{  
  
   "disclaimer":"This data was produced from the CoinDesk Bitcoin Price Index (USD & CNY respectively).",
   "bpi":{  
      "USD":{  
         "code":"USD",
         "rate":"10,121.1383",
         "description":"United States Dollar",
         "rate_float":10121.1383
      },
      "CNY":{  
         "code":"CNY",
         "rate":"40,202.5000",
         "description":"Chinese Yuan",
         "rate_float":40202.5
      }
   }
}