[
    {
      "relation": [
        "delegate_permission/common.handle_all_urls"
      ],
      "target": {
        "namespace": "android_app",
        "package_name": "com.woorien.wrapp",
        "sha256_cert_fingerprints": [
          "CF:BD:58:DC:BF:87:14:F5:F6:01:FC:D1:72:9D:BE:EC:9A:B0:6C:F7:49:1B:93:C2:6F:9E:88:E5:D5:19:EB:29"
        ]
      }
    }
  ]