﻿Latitude,Longitude
39.31402636,-86.14004433
36.36636248,-109.828673
37.00511439,-109.828673
32.28466897,-91.17961202
34.05105159,-91.17961202
39.94896092,-91.17961202
39.82547011,-97.56781238
43.78090903,-97.56781238
43.78090903,-87.39717836
43.78090903,-105.2408155
38.26334181,-98.38620863
38.0188315,-98.38620863
36.97597481,-118.1775818
41.77217131,-118.1775818
43.33617408,-118.1775818
40.59077196,-89.42766035
36.92497021,-89.42766035
36.92497021,-97.70688581
36.92497021,-92.02063059
33.68469388,-92.02063059
31.46752661,-90.38842707
32.9808773,-90.38842707
35.88676099,-83.70909253
35.71753971,-83.70909253
35.82481256,-83.32713502
36.9014145,-83.32713502
36.8001298,-83.32713502
37.52035323,-88.80995795
33.23872868,-90.63909138
31.99100469,-90.63909138
32.08603913,-90.30451547
31.26139648,-90.30451547
34.93536377,-90.30451547
34.54534296,-91.97588881
34.54534296,-99.32338625
34.54534296,-94.94818135
36.58576449,-94.94818135
32.37814111,-94.94818135
32.37814111,-82.1481934
38.52304418,-82.1481934
37.69956734,-84.42357698
37.69956734,-88.98931119
37.82241237,-88.98931119
39.05045676,-88.98931119
39.05045676,-101.8903256
39.05045676,-97.0209451
36.11285277,-91.64654207
39.83236672,-81.49334754
40.3569892,-81.49334754
39.97800869,-81.49334754
39.51422103,-94.30454814
39.51422103,-111.3647444
40.33234634,-111.3647444
40.33234634,-91.54684487
39.89890157,-91.54684487
36.93194422,-91.54684487
38.9255071,-92.55860602
38.98178133,-90.95635591
38.98178133,-90.00069057
37.63518597,-83.48695529
36.51427353,-100.4499556
36.73019639,-106.2620698
35.67921217,-106.2620698
37.8900199,-106.2620698
40.91092177,-95.53700317
40.91092177,-84.05798092
41.43463982,-104.9482893
38.97993404,-103.8839583
34.19868756,-98.72822546
34.01841833,-106.309227
36.94194305,-86.94146744
36.90759747,-99.15515333
