<?xml version="1.0" encoding="UTF-8" standalone="no"?>
<!-- Created with Inkscape (http://www.inkscape.org/) -->

<svg
   width="141.61366mm"
   height="46.635689mm"
   viewBox="0 0 141.61366 46.635689"
   version="1.1"
   id="svg1"
   xml:space="preserve"
   xmlns="http://www.w3.org/2000/svg"
   xmlns:svg="http://www.w3.org/2000/svg"><defs
     id="defs1" /><g
     id="layer1"
     transform="translate(-31.171931,-159.6517)"><path
       style="fill:#ffffff"
       d="m 128.20452,206.17901 c -1.33847,-0.24023 -2.81543,-0.78992 -3.93462,-1.46436 -1.27864,-0.77053 -3.20341,-2.81908 -3.9207,-4.17283 l -0.57579,-1.08669 1.55837,-0.64089 c 0.8571,-0.35249 1.85022,-0.76444 2.20694,-0.91544 l 0.64858,-0.27454 0.64993,1.05297 c 1.15063,1.86417 2.81853,2.87732 4.94615,3.00446 2.98438,0.17834 5.15197,-1.17909 6.07461,-3.80416 0.35902,-1.02148 0.70292,-4.55394 0.44335,-4.55394 -0.072,0 -0.46604,0.27461 -0.87564,0.61024 -1.72973,1.41739 -3.61173,1.98697 -6.0818,1.84064 -2.03543,-0.12058 -3.48802,-0.61203 -5.20677,-1.7616 -2.22192,-1.48611 -3.75305,-3.46991 -4.69138,-6.07835 -0.41792,-1.16179 -0.47139,-1.57363 -0.47165,-3.63279 -2.6e-4,-2.05691 0.0557,-2.49026 0.48977,-3.78999 1.12065,-3.3558 3.92723,-6.25624 7.13814,-7.37685 1.35963,-0.47451 3.96721,-0.6608 5.28718,-0.37771 1.2496,0.26799 2.63663,0.93917 3.54156,1.71375 0.40499,0.34666 0.78386,0.63029 0.84193,0.63029 0.0581,0 0.10559,-0.40197 0.10559,-0.89326 v -0.89325 h 2.42116 2.42116 l -0.0608,11.83561 c -0.0592,11.52751 -0.0709,11.87188 -0.451,13.22917 -1.11746,3.99059 -3.60916,6.56838 -7.28445,7.53609 -1.33503,0.35152 -3.98416,0.48521 -5.21985,0.26343 z m 4.29679,-15.28776 c 3.63325,-1.27264 5.2511,-6.15139 3.36781,-10.15593 -2.2877,-4.86445 -8.70661,-4.72308 -11.1527,0.24563 -0.54754,1.11222 -0.57572,1.27019 -0.57572,3.2277 0,1.93228 0.0339,2.1293 0.55335,3.21946 1.48735,3.12124 4.70659,4.54922 7.80726,3.46314 z m -86.395541,4.66158 c -3.360487,-0.63656 -6.555335,-2.30272 -9.154891,-4.7744 -4.424855,-4.2072 -6.406836,-9.66514 -5.604516,-15.4336 0.611028,-4.39313 3.086794,-8.7307 6.5965,-11.55714 1.745584,-1.40576 4.751815,-2.95762 6.787607,-3.50388 5.808908,-1.55867 12.04379,-0.18769 16.338461,3.59263 l 0.839906,0.73931 -1.739341,1.7459 -1.739341,1.74589 -0.820382,-0.68524 c -1.121051,-0.93638 -2.877171,-1.85848 -4.482721,-2.35376 -1.92447,-0.59367 -5.228847,-0.59251 -7.146027,0.003 -4.525475,1.40454 -7.903895,4.88782 -9.025306,9.30543 -1.412941,5.56604 0.970086,11.63843 5.715781,14.56486 4.064218,2.50619 9.665306,2.60538 13.622723,0.24123 1.402575,-0.83789 3.073437,-2.54531 3.75993,-3.84218 0.4813,-0.90923 1.290831,-3.42718 1.290831,-4.01498 0,-0.0825 -2.652963,-0.15007 -5.895473,-0.15007 h -5.895473 v -2.50111 -2.50111 h 8.299162 8.299162 l 0.119559,0.63731 c 0.06576,0.35052 0.08089,1.77749 0.03363,3.17105 -0.103153,3.04157 -0.516955,4.83985 -1.651869,7.17866 -1.855132,3.82301 -5.595644,6.85161 -9.941294,8.04922 -2.145508,0.59127 -6.401754,0.76114 -8.606617,0.34347 z m 31.061674,-0.0143 c -3.254943,-0.7873 -6.194782,-3.19154 -7.623459,-6.23458 -0.786499,-1.67522 -1.067576,-3.01331 -1.069524,-5.09155 -0.0021,-2.23567 0.283664,-3.46321 1.279983,-5.49845 1.237,-2.52689 3.796232,-4.70108 6.597197,-5.60465 1.636003,-0.52776 4.705822,-0.65075 6.466378,-0.25906 4.246508,0.94476 7.501972,4.11921 8.629151,8.41443 0.368089,1.40263 0.370282,4.47934 0.0042,5.89547 -1.063543,4.11417 -4.420375,7.43018 -8.489656,8.3864 -1.44569,0.33972 -4.373384,0.33567 -5.794272,-0.008 z m 5.768505,-4.9639 c 4.806422,-2.47114 4.958894,-10.06648 0.252435,-12.57499 -3.312581,-1.76559 -7.348135,-0.44759 -8.903083,2.90772 -1.875966,4.04802 0.01809,8.80035 4.031498,10.11534 0.245644,0.0805 1.170162,0.12328 2.054482,0.0951 1.341653,-0.0427 1.766271,-0.13268 2.564668,-0.54317 z m 19.358542,4.90097 c -3.79555,-1.02807 -6.725649,-3.75115 -8.029071,-7.46179 -0.437922,-1.2467 -0.488497,-1.63768 -0.491732,-3.80141 -0.0031,-2.07308 0.05589,-2.5874 0.420049,-3.66234 0.591125,-1.7449 1.325594,-2.97799 2.559379,-4.29691 1.329205,-1.42093 2.614865,-2.27919 4.485435,-2.99433 1.39492,-0.53329 1.58641,-0.55988 4.0545,-0.56303 2.36573,-0.003 2.7041,0.0381 3.90077,0.47381 1.86553,0.67928 3.14796,1.4893 4.49666,2.84022 2.45513,2.45918 3.65188,6.06216 3.2029,9.64281 -0.56904,4.53816 -3.55447,8.20519 -7.84866,9.64059 -1.71102,0.57193 -4.98541,0.6604 -6.75023,0.18238 z m 5.18899,-4.58301 c 4.52997,-1.57965 5.87634,-8.03877 2.45038,-11.7555 -2.38078,-2.58284 -6.58504,-2.63309 -9.11786,-0.10898 -2.68219,2.67296 -2.72427,7.54405 -0.0886,10.25595 1.75058,1.80123 4.39678,2.43125 6.75607,1.60853 z m 52.36271,4.57812 c -4.0727,-1.06772 -7.21785,-4.30994 -8.19303,-8.4459 -0.33658,-1.4275 -0.33636,-4.1587 4.5e-4,-5.74865 0.87702,-4.13999 4.29508,-7.63352 8.3199,-8.5036 1.47309,-0.31845 4.46852,-0.14606 5.78581,0.33298 2.05316,0.74664 3.97119,2.32945 5.29327,4.36815 0.66771,1.02963 1.86118,3.67044 1.72179,3.80983 -0.0404,0.0404 -3.24158,1.38912 -7.11376,2.99719 -3.87219,1.60807 -7.34538,3.05186 -7.7182,3.20843 l -0.67786,0.28466 0.30777,0.4971 c 0.55975,0.90409 1.57128,1.86112 2.47716,2.3437 0.81167,0.43239 1.07272,0.47585 2.85841,0.47585 1.89988,0 2.00274,-0.0204 3.09656,-0.61341 0.64026,-0.34713 1.46982,-1.00027 1.91097,-1.50457 l 0.77956,-0.89116 1.97114,1.30332 1.97114,1.30332 -0.34388,0.48293 c -0.67492,0.94785 -2.79957,2.78775 -3.88343,3.36299 -2.38867,1.26772 -5.85516,1.64694 -8.56377,0.93684 z m 1.2752,-13.57917 c 5.5779,-2.32558 5.6275,-2.3481 5.6275,-2.55533 0,-0.103 -0.36043,-0.53263 -0.80096,-0.95472 -1.40841,-1.3495 -3.72546,-1.67976 -5.68954,-0.81095 -1.07208,0.47423 -2.54845,1.86627 -3.06916,2.89384 -0.35828,0.70703 -0.80208,2.45059 -0.80208,3.15113 0,0.27196 -0.41846,0.42434 4.73424,-1.72397 z m -16.88249,-3.84259 v -17.06114 h 2.50111 2.50111 v 17.06114 17.06114 h -2.50111 -2.50111 z"
       id="path2" /></g></svg>
