\relax 
\providecommand\zref@newlabel[2]{}
\providecommand{\transparent@use}[1]{}
\providecommand\hyper@newdestlabel[2]{}
\providecommand\HyperFirstAtBeginDocument{\AtBeginDocument}
\HyperFirstAtBeginDocument{\ifx\hyper@anchor\@undefined
\global\let\oldcontentsline\contentsline
\gdef\contentsline#1#2#3#4{\oldcontentsline{#1}{#2}{#3}}
\global\let\oldnewlabel\newlabel
\gdef\newlabel#1#2{\newlabelxx{#1}#2}
\gdef\newlabelxx#1#2#3#4#5#6{\oldnewlabel{#1}{{#2}{#3}}}
\AtEndDocument{\ifx\hyper@anchor\@undefined
\let\contentsline\oldcontentsline
\let\newlabel\oldnewlabel
\fi}
\fi}
\global\let\hyper@last\relax 
\gdef\HyperFirstAtBeginDocument#1{#1}
\providecommand\HyField@AuxAddToFields[1]{}
\providecommand\HyField@AuxAddToCoFields[2]{}
\providecommand\ocgxii@newkey[2]{}
\providecommand\ocgxii@newkeynoexp[2]{}
\providecommand\ocgxii@ocg@stack@on@page[2]{}
\providecommand\ocgxii@lnkcol@stack@on@page[2]{}
\ocgxii@newkey{ocgx2.ocg.OCView}{31 0 R}
\ocgxii@newkey{ocgx2.ocg.OCPrint}{32 0 R}
\providecommand\pbs@newkey[2]{}
\providecommand\pbs@seq@push@cx[2]{}
\providecommand \oddpage@label [2]{}
\ocgxii@lnkcol@stack@on@page{1}{{linkcolour}}
\ocgxii@lnkcol@stack@on@page{1}{}
\pbs@seq@push@cx{pbs@props@1}{/rm@oc0 32 0 R}
\pbs@seq@push@cx{pbs@props@1}{/rm@oc1 31 0 R}
\ocgxii@lnkcol@stack@on@page{1}{{linkcolour}}
\ocgxii@lnkcol@stack@on@page{1}{}
\pbs@seq@push@cx{pbs@props@1}{/rm@oc2 32 0 R}
\pbs@seq@push@cx{pbs@props@1}{/rm@oc3 31 0 R}
\ocgxii@lnkcol@stack@on@page{1}{{linkcolour}}
\ocgxii@lnkcol@stack@on@page{1}{}
\pbs@seq@push@cx{pbs@props@1}{/rm@oc4 32 0 R}
\pbs@seq@push@cx{pbs@props@1}{/rm@oc5 31 0 R}
\ocgxii@lnkcol@stack@on@page{1}{{linkcolour}}
\ocgxii@lnkcol@stack@on@page{1}{}
\pbs@seq@push@cx{pbs@props@1}{/rm@oc6 32 0 R}
\pbs@seq@push@cx{pbs@props@1}{/rm@oc7 31 0 R}
\ocgxii@lnkcol@stack@on@page{1}{{linkcolour}}
\ocgxii@lnkcol@stack@on@page{1}{}
\pbs@seq@push@cx{pbs@props@1}{/rm@oc8 32 0 R}
\pbs@seq@push@cx{pbs@props@1}{/rm@oc9 31 0 R}
\ocgxii@lnkcol@stack@on@page{1}{{linkcolour}}
\ocgxii@lnkcol@stack@on@page{1}{}
\pbs@seq@push@cx{pbs@props@1}{/rm@oc10 32 0 R}
\pbs@seq@push@cx{pbs@props@1}{/rm@oc11 31 0 R}
\ocgxii@lnkcol@stack@on@page{1}{{linkcolour}}
\ocgxii@lnkcol@stack@on@page{1}{}
\pbs@seq@push@cx{pbs@props@1}{/rm@oc12 32 0 R}
\pbs@seq@push@cx{pbs@props@1}{/rm@oc13 31 0 R}
\ocgxii@lnkcol@stack@on@page{1}{{linkcolour}}
\ocgxii@lnkcol@stack@on@page{1}{}
\pbs@seq@push@cx{pbs@props@1}{/rm@oc14 32 0 R}
\pbs@seq@push@cx{pbs@props@1}{/rm@oc15 31 0 R}
\ocgxii@lnkcol@stack@on@page{1}{{linkcolour}}
\ocgxii@lnkcol@stack@on@page{1}{}
\pbs@seq@push@cx{pbs@props@1}{/rm@oc16 32 0 R}
\pbs@seq@push@cx{pbs@props@1}{/rm@oc17 31 0 R}
\ocgxii@lnkcol@stack@on@page{1}{{linkcolour}}
\ocgxii@lnkcol@stack@on@page{1}{}
\pbs@seq@push@cx{pbs@props@1}{/rm@oc18 32 0 R}
\pbs@seq@push@cx{pbs@props@1}{/rm@oc19 31 0 R}
\ocgxii@lnkcol@stack@on@page{1}{{linkcolour}}
\ocgxii@lnkcol@stack@on@page{1}{}
\pbs@seq@push@cx{pbs@props@1}{/rm@oc20 32 0 R}
\pbs@seq@push@cx{pbs@props@1}{/rm@oc21 31 0 R}
\ocgxii@lnkcol@stack@on@page{1}{{linkcolour}}
\ocgxii@lnkcol@stack@on@page{1}{}
\pbs@seq@push@cx{pbs@props@1}{/rm@oc22 32 0 R}
\pbs@seq@push@cx{pbs@props@1}{/rm@oc23 31 0 R}
\ocgxii@lnkcol@stack@on@page{1}{{linkcolour}}
\ocgxii@lnkcol@stack@on@page{1}{}
\pbs@seq@push@cx{pbs@props@1}{/rm@oc24 32 0 R}
\pbs@seq@push@cx{pbs@props@1}{/rm@oc25 31 0 R}
\ocgxii@lnkcol@stack@on@page{1}{{linkcolour}}
\ocgxii@lnkcol@stack@on@page{1}{}
\pbs@seq@push@cx{pbs@props@1}{/rm@oc26 32 0 R}
\pbs@seq@push@cx{pbs@props@1}{/rm@oc27 31 0 R}
\ocgxii@lnkcol@stack@on@page{1}{{linkcolour}}
\ocgxii@lnkcol@stack@on@page{1}{}
\pbs@seq@push@cx{pbs@props@1}{/rm@oc28 32 0 R}
\pbs@seq@push@cx{pbs@props@1}{/rm@oc29 31 0 R}
\ocgxii@lnkcol@stack@on@page{1}{{linkcolour}}
\ocgxii@lnkcol@stack@on@page{1}{}
\pbs@seq@push@cx{pbs@props@1}{/rm@oc30 32 0 R}
\pbs@seq@push@cx{pbs@props@1}{/rm@oc31 31 0 R}
\ocgxii@lnkcol@stack@on@page{1}{{linkcolour}}
\ocgxii@lnkcol@stack@on@page{1}{}
\pbs@seq@push@cx{pbs@props@1}{/rm@oc32 32 0 R}
\pbs@seq@push@cx{pbs@props@1}{/rm@oc33 31 0 R}
\ocgxii@lnkcol@stack@on@page{1}{{linkcolour}}
\ocgxii@lnkcol@stack@on@page{1}{}
\pbs@seq@push@cx{pbs@props@1}{/rm@oc34 32 0 R}
\pbs@seq@push@cx{pbs@props@1}{/rm@oc35 31 0 R}
\ocgxii@lnkcol@stack@on@page{1}{{linkcolour}}
\ocgxii@lnkcol@stack@on@page{1}{}
\pbs@seq@push@cx{pbs@props@1}{/rm@oc36 32 0 R}
\pbs@seq@push@cx{pbs@props@1}{/rm@oc37 31 0 R}
\ocgxii@lnkcol@stack@on@page{1}{{linkcolour}}
\ocgxii@lnkcol@stack@on@page{1}{}
\pbs@seq@push@cx{pbs@props@1}{/rm@oc38 32 0 R}
\pbs@seq@push@cx{pbs@props@1}{/rm@oc39 31 0 R}
\ocgxii@lnkcol@stack@on@page{1}{{linkcolour}}
\ocgxii@lnkcol@stack@on@page{1}{}
\pbs@seq@push@cx{pbs@props@1}{/rm@oc40 32 0 R}
\pbs@seq@push@cx{pbs@props@1}{/rm@oc41 31 0 R}
\ocgxii@lnkcol@stack@on@page{1}{{linkcolour}}
\ocgxii@lnkcol@stack@on@page{1}{}
\pbs@seq@push@cx{pbs@props@1}{/rm@oc42 32 0 R}
\pbs@seq@push@cx{pbs@props@1}{/rm@oc43 31 0 R}
\ocgxii@lnkcol@stack@on@page{1}{{linkcolour}}
\ocgxii@lnkcol@stack@on@page{1}{}
\pbs@seq@push@cx{pbs@props@1}{/rm@oc44 32 0 R}
\pbs@seq@push@cx{pbs@props@1}{/rm@oc45 31 0 R}
\ocgxii@lnkcol@stack@on@page{1}{{linkcolour}}
\ocgxii@lnkcol@stack@on@page{1}{}
\pbs@seq@push@cx{pbs@props@1}{/rm@oc46 32 0 R}
\pbs@seq@push@cx{pbs@props@1}{/rm@oc47 31 0 R}
\ocgxii@lnkcol@stack@on@page{1}{{linkcolour}}
\ocgxii@lnkcol@stack@on@page{1}{}
\pbs@seq@push@cx{pbs@props@1}{/rm@oc48 32 0 R}
\pbs@seq@push@cx{pbs@props@1}{/rm@oc49 31 0 R}
\ocgxii@lnkcol@stack@on@page{1}{{linkcolour}}
\ocgxii@lnkcol@stack@on@page{1}{}
\pbs@seq@push@cx{pbs@props@1}{/rm@oc50 32 0 R}
\pbs@seq@push@cx{pbs@props@1}{/rm@oc51 31 0 R}
\ocgxii@newkey{ocgx2.oldlnkcol.1}{}
\ocgxii@newkey{ocgx2.oldstack.1}{}
\ocgxii@newkey{ocgx2.ocg.id1}{98 0 R}
\@writefile{toc}{\contentsline {section}{\numberline {1}Army Model Rules}{2}{section.1}\protected@file@percent }
\newlabel{TSModelRules}{{1}{2}{\armymodelrules }{section.1}{}}
\@writefile{toc}{\contentsline {subsection}{\numberline {1.1}Universal Rules}{2}{subsection.1.1}\protected@file@percent }
\@writefile{toc}{\contentsline {subsubsection}{\numberline {1.1.1}Cloud of Arrows{}{}}{2}{subsubsection.1.1.1}\protected@file@percent }
\@writefile{toc}{\contentsline {subsubsection}{\numberline {1.1.2}Heavenly Court{}{}}{2}{subsubsection.1.1.2}\protected@file@percent }
\@writefile{toc}{\contentsline {subsubsection}{\numberline {1.1.3}Imperial Mandate{}{}}{2}{subsubsection.1.1.3}\protected@file@percent }
\@writefile{toc}{\contentsline {subsubsection}{\numberline {1.1.4}Line of Command{}{}}{2}{subsubsection.1.1.4}\protected@file@percent }
\@writefile{toc}{\contentsline {subsubsection}{\numberline {1.1.5}Tao Forms{}{}}{2}{subsubsection.1.1.5}\protected@file@percent }
\@writefile{toc}{\contentsline {subsubsection}{\numberline {1.1.6}Tsuandan Training{}{}}{2}{subsubsection.1.1.6}\protected@file@percent }
\@writefile{toc}{\contentsline {subsection}{\numberline {1.2}Special Attacks}{2}{subsection.1.2}\protected@file@percent }
\@writefile{toc}{\contentsline {subsubsection}{\numberline {1.2.1}Fire Lance{}{}}{2}{subsubsection.1.2.1}\protected@file@percent }
\@writefile{toc}{\contentsline {subsection}{\numberline {1.3}Armoury}{2}{subsection.1.3}\protected@file@percent }
\@writefile{toc}{\contentsline {subsubsection}{\numberline {1.3.1}San Yan Chong{}{}\textnormal  {\fontsize  {10}{12}\selectfont  {} -- Shooting Weapon}}{2}{subsubsection.1.3.1}\protected@file@percent }
\ocgxii@newkey{ocgx2.oldlnkcol.2}{}
\ocgxii@newkey{ocgx2.oldstack.2}{}
\ocgxii@ocg@stack@on@page{2}{98 0 R}
\pbs@seq@push@cx{pbs@props@2}{/rm@oc52 98 0 R}
\ocgxii@lnkcol@stack@on@page{2}{{linkcolour}}
\ocgxii@lnkcol@stack@on@page{2}{}
\pbs@seq@push@cx{pbs@props@2}{/rm@oc53 32 0 R}
\pbs@seq@push@cx{pbs@props@2}{/rm@oc54 31 0 R}
\ocgxii@lnkcol@stack@on@page{2}{{linkcolour}}
\ocgxii@lnkcol@stack@on@page{2}{}
\pbs@seq@push@cx{pbs@props@2}{/rm@oc55 32 0 R}
\pbs@seq@push@cx{pbs@props@2}{/rm@oc56 31 0 R}
\ocgxii@lnkcol@stack@on@page{2}{{linkcolour}}
\ocgxii@lnkcol@stack@on@page{2}{}
\pbs@seq@push@cx{pbs@props@2}{/rm@oc57 32 0 R}
\pbs@seq@push@cx{pbs@props@2}{/rm@oc58 31 0 R}
\ocgxii@lnkcol@stack@on@page{2}{{linkcolour}}
\ocgxii@lnkcol@stack@on@page{2}{}
\pbs@seq@push@cx{pbs@props@2}{/rm@oc59 32 0 R}
\pbs@seq@push@cx{pbs@props@2}{/rm@oc60 31 0 R}
\ocgxii@lnkcol@stack@on@page{2}{{linkcolour}}
\ocgxii@lnkcol@stack@on@page{2}{}
\pbs@seq@push@cx{pbs@props@2}{/rm@oc61 32 0 R}
\pbs@seq@push@cx{pbs@props@2}{/rm@oc62 31 0 R}
\ocgxii@lnkcol@stack@on@page{2}{{linkcolour}}
\ocgxii@lnkcol@stack@on@page{2}{}
\pbs@seq@push@cx{pbs@props@2}{/rm@oc63 32 0 R}
\pbs@seq@push@cx{pbs@props@2}{/rm@oc64 31 0 R}
\ocgxii@lnkcol@stack@on@page{2}{{linkcolour}}
\ocgxii@lnkcol@stack@on@page{2}{}
\pbs@seq@push@cx{pbs@props@2}{/rm@oc65 32 0 R}
\pbs@seq@push@cx{pbs@props@2}{/rm@oc66 31 0 R}
\ocgxii@ocg@stack@on@page{2}{}
\ocgxii@ocg@stack@on@page{2}{98 0 R}
\pbs@seq@push@cx{pbs@props@2}{/rm@oc67 98 0 R}
\ocgxii@lnkcol@stack@on@page{2}{{linkcolour}}
\ocgxii@lnkcol@stack@on@page{2}{}
\pbs@seq@push@cx{pbs@props@2}{/rm@oc68 32 0 R}
\pbs@seq@push@cx{pbs@props@2}{/rm@oc69 31 0 R}
\ocgxii@lnkcol@stack@on@page{2}{{linkcolour}}
\ocgxii@lnkcol@stack@on@page{2}{}
\pbs@seq@push@cx{pbs@props@2}{/rm@oc70 32 0 R}
\pbs@seq@push@cx{pbs@props@2}{/rm@oc71 31 0 R}
\ocgxii@lnkcol@stack@on@page{2}{{linkcolour}}
\ocgxii@lnkcol@stack@on@page{2}{}
\pbs@seq@push@cx{pbs@props@2}{/rm@oc72 32 0 R}
\pbs@seq@push@cx{pbs@props@2}{/rm@oc73 31 0 R}
\ocgxii@lnkcol@stack@on@page{2}{{linkcolour}}
\ocgxii@lnkcol@stack@on@page{2}{}
\pbs@seq@push@cx{pbs@props@2}{/rm@oc74 32 0 R}
\pbs@seq@push@cx{pbs@props@2}{/rm@oc75 31 0 R}
\ocgxii@lnkcol@stack@on@page{2}{{linkcolour}}
\ocgxii@lnkcol@stack@on@page{2}{}
\pbs@seq@push@cx{pbs@props@2}{/rm@oc76 32 0 R}
\pbs@seq@push@cx{pbs@props@2}{/rm@oc77 31 0 R}
\ocgxii@lnkcol@stack@on@page{2}{{linkcolour}}
\ocgxii@lnkcol@stack@on@page{2}{}
\pbs@seq@push@cx{pbs@props@2}{/rm@oc78 32 0 R}
\pbs@seq@push@cx{pbs@props@2}{/rm@oc79 31 0 R}
\ocgxii@ocg@stack@on@page{2}{}
\@writefile{toc}{\contentsline {subsubsection}{\numberline {1.3.2}Thunderclap Arrows{}{}\textnormal  {\fontsize  {10}{12}\selectfont  {} -- Shooting Weapon}}{3}{subsubsection.1.3.2}\protected@file@percent }
\@writefile{toc}{\contentsline {subsubsection}{\numberline {1.3.3}Zhuge Nu{}{}\textnormal  {\fontsize  {10}{12}\selectfont  {} -- Shooting Weapon}}{3}{subsubsection.1.3.3}\protected@file@percent }
\@writefile{toc}{\contentsline {subsubsection}{\numberline {1.3.4}Zhanmadao{}{}\textnormal  {\fontsize  {10}{12}\selectfont  {} -- Close Combat Weapon}}{3}{subsubsection.1.3.4}\protected@file@percent }
\@writefile{toc}{\contentsline {subsection}{\numberline {1.4}Equipment}{3}{subsection.1.4}\protected@file@percent }
\@writefile{toc}{\contentsline {subsubsection}{\numberline {1.4.1}Fire Lanterns{}{}}{3}{subsubsection.1.4.1}\protected@file@percent }
\ocgxii@newkey{ocgx2.oldlnkcol.3}{}
\ocgxii@newkey{ocgx2.oldstack.3}{}
\ocgxii@ocg@stack@on@page{3}{98 0 R}
\pbs@seq@push@cx{pbs@props@3}{/rm@oc80 98 0 R}
\ocgxii@lnkcol@stack@on@page{3}{{linkcolour}}
\ocgxii@lnkcol@stack@on@page{3}{}
\pbs@seq@push@cx{pbs@props@3}{/rm@oc81 32 0 R}
\pbs@seq@push@cx{pbs@props@3}{/rm@oc82 31 0 R}
\ocgxii@lnkcol@stack@on@page{3}{{linkcolour}}
\ocgxii@lnkcol@stack@on@page{3}{}
\pbs@seq@push@cx{pbs@props@3}{/rm@oc83 32 0 R}
\pbs@seq@push@cx{pbs@props@3}{/rm@oc84 31 0 R}
\ocgxii@lnkcol@stack@on@page{3}{{linkcolour}}
\ocgxii@lnkcol@stack@on@page{3}{}
\pbs@seq@push@cx{pbs@props@3}{/rm@oc85 32 0 R}
\pbs@seq@push@cx{pbs@props@3}{/rm@oc86 31 0 R}
\ocgxii@lnkcol@stack@on@page{3}{{linkcolour}}
\ocgxii@lnkcol@stack@on@page{3}{}
\pbs@seq@push@cx{pbs@props@3}{/rm@oc87 32 0 R}
\pbs@seq@push@cx{pbs@props@3}{/rm@oc88 31 0 R}
\ocgxii@lnkcol@stack@on@page{3}{{linkcolour}}
\ocgxii@lnkcol@stack@on@page{3}{}
\pbs@seq@push@cx{pbs@props@3}{/rm@oc89 32 0 R}
\pbs@seq@push@cx{pbs@props@3}{/rm@oc90 31 0 R}
\ocgxii@lnkcol@stack@on@page{3}{{linkcolour}}
\ocgxii@lnkcol@stack@on@page{3}{}
\pbs@seq@push@cx{pbs@props@3}{/rm@oc91 32 0 R}
\pbs@seq@push@cx{pbs@props@3}{/rm@oc92 31 0 R}
\ocgxii@lnkcol@stack@on@page{3}{{linkcolour}}
\ocgxii@lnkcol@stack@on@page{3}{}
\pbs@seq@push@cx{pbs@props@3}{/rm@oc93 32 0 R}
\pbs@seq@push@cx{pbs@props@3}{/rm@oc94 31 0 R}
\ocgxii@ocg@stack@on@page{3}{}
\ocgxii@ocg@stack@on@page{3}{98 0 R}
\pbs@seq@push@cx{pbs@props@3}{/rm@oc95 98 0 R}
\ocgxii@lnkcol@stack@on@page{3}{{linkcolour}}
\ocgxii@lnkcol@stack@on@page{3}{}
\pbs@seq@push@cx{pbs@props@3}{/rm@oc96 32 0 R}
\pbs@seq@push@cx{pbs@props@3}{/rm@oc97 31 0 R}
\ocgxii@lnkcol@stack@on@page{3}{{linkcolour}}
\ocgxii@lnkcol@stack@on@page{3}{}
\pbs@seq@push@cx{pbs@props@3}{/rm@oc98 32 0 R}
\pbs@seq@push@cx{pbs@props@3}{/rm@oc99 31 0 R}
\ocgxii@lnkcol@stack@on@page{3}{{linkcolour}}
\ocgxii@lnkcol@stack@on@page{3}{}
\pbs@seq@push@cx{pbs@props@3}{/rm@oc100 32 0 R}
\pbs@seq@push@cx{pbs@props@3}{/rm@oc101 31 0 R}
\ocgxii@lnkcol@stack@on@page{3}{{linkcolour}}
\ocgxii@lnkcol@stack@on@page{3}{}
\pbs@seq@push@cx{pbs@props@3}{/rm@oc102 32 0 R}
\pbs@seq@push@cx{pbs@props@3}{/rm@oc103 31 0 R}
\ocgxii@lnkcol@stack@on@page{3}{{linkcolour}}
\ocgxii@lnkcol@stack@on@page{3}{}
\pbs@seq@push@cx{pbs@props@3}{/rm@oc104 32 0 R}
\pbs@seq@push@cx{pbs@props@3}{/rm@oc105 31 0 R}
\ocgxii@lnkcol@stack@on@page{3}{{linkcolour}}
\ocgxii@lnkcol@stack@on@page{3}{}
\pbs@seq@push@cx{pbs@props@3}{/rm@oc106 32 0 R}
\pbs@seq@push@cx{pbs@props@3}{/rm@oc107 31 0 R}
\ocgxii@ocg@stack@on@page{3}{}
\@writefile{toc}{\contentsline {section}{\numberline {2}Celestial Bureaucracy}{4}{section.2}\protected@file@percent }
\newlabel{TSMinistries}{{2}{4}{\ministries }{section.2}{}}
\@writefile{toc}{\contentsline {subsection}{\numberline {2.1}List of Ministries{}}{4}{subsection.2.1}\protected@file@percent }
\@writefile{toc}{\contentsline {subsubsection}{\numberline {2.1.1}Ministry of Imperial Administration{}}{4}{subsubsection.2.1.1}\protected@file@percent }
\@writefile{toc}{\contentsline {subsubsection}{\numberline {2.1.2}Ministry of Personnel{}}{4}{subsubsection.2.1.2}\protected@file@percent }
\@writefile{toc}{\contentsline {subsubsection}{\numberline {2.1.3}Ministry of Rites{}}{4}{subsubsection.2.1.3}\protected@file@percent }
\@writefile{toc}{\contentsline {subsubsection}{\numberline {2.1.4}Ministry of War{}}{4}{subsubsection.2.1.4}\protected@file@percent }
\@writefile{toc}{\contentsline {section}{\numberline {3}Stratagems}{4}{section.3}\protected@file@percent }
\newlabel{TSStratagems}{{3}{4}{\stratagems }{section.3}{}}
\@writefile{toc}{\contentsline {subsection}{\numberline {3.1}List of Stratagems{}}{4}{subsection.3.1}\protected@file@percent }
\@writefile{toc}{\contentsline {subsubsection}{\numberline {3.1.1}Alchemical Ammunitions{}}{4}{subsubsection.3.1.1}\protected@file@percent }
\@writefile{toc}{\contentsline {subsubsection}{\numberline {3.1.2}All Seeing Owl{}}{4}{subsubsection.3.1.2}\protected@file@percent }
\@writefile{toc}{\contentsline {subsubsection}{\numberline {3.1.3}Biding Time{}}{4}{subsubsection.3.1.3}\protected@file@percent }
\@writefile{toc}{\contentsline {subsubsection}{\numberline {3.1.4}Ebb and Flow{}}{4}{subsubsection.3.1.4}\protected@file@percent }
\@writefile{toc}{\contentsline {subsubsection}{\numberline {3.1.5}Elusive Eel{}}{4}{subsubsection.3.1.5}\protected@file@percent }
\@writefile{toc}{\contentsline {subsubsection}{\numberline {3.1.6}Ferocious Tiger{}}{4}{subsubsection.3.1.6}\protected@file@percent }
\@writefile{toc}{\contentsline {subsubsection}{\numberline {3.1.7}Hidden Threat{}}{4}{subsubsection.3.1.7}\protected@file@percent }
\@writefile{toc}{\contentsline {subsubsection}{\numberline {3.1.8}Nimble Fox{}}{4}{subsubsection.3.1.8}\protected@file@percent }
\ocgxii@newkey{ocgx2.oldlnkcol.4}{}
\ocgxii@newkey{ocgx2.oldstack.4}{}
\ocgxii@ocg@stack@on@page{4}{98 0 R}
\pbs@seq@push@cx{pbs@props@4}{/rm@oc108 98 0 R}
\ocgxii@lnkcol@stack@on@page{4}{{linkcolour}}
\ocgxii@lnkcol@stack@on@page{4}{}
\pbs@seq@push@cx{pbs@props@4}{/rm@oc109 32 0 R}
\pbs@seq@push@cx{pbs@props@4}{/rm@oc110 31 0 R}
\ocgxii@lnkcol@stack@on@page{4}{{linkcolour}}
\ocgxii@lnkcol@stack@on@page{4}{}
\pbs@seq@push@cx{pbs@props@4}{/rm@oc111 32 0 R}
\pbs@seq@push@cx{pbs@props@4}{/rm@oc112 31 0 R}
\ocgxii@lnkcol@stack@on@page{4}{{linkcolour}}
\ocgxii@lnkcol@stack@on@page{4}{}
\pbs@seq@push@cx{pbs@props@4}{/rm@oc113 32 0 R}
\pbs@seq@push@cx{pbs@props@4}{/rm@oc114 31 0 R}
\ocgxii@lnkcol@stack@on@page{4}{{linkcolour}}
\ocgxii@lnkcol@stack@on@page{4}{}
\pbs@seq@push@cx{pbs@props@4}{/rm@oc115 32 0 R}
\pbs@seq@push@cx{pbs@props@4}{/rm@oc116 31 0 R}
\ocgxii@lnkcol@stack@on@page{4}{{linkcolour}}
\ocgxii@lnkcol@stack@on@page{4}{}
\pbs@seq@push@cx{pbs@props@4}{/rm@oc117 32 0 R}
\pbs@seq@push@cx{pbs@props@4}{/rm@oc118 31 0 R}
\ocgxii@lnkcol@stack@on@page{4}{{linkcolour}}
\ocgxii@lnkcol@stack@on@page{4}{}
\pbs@seq@push@cx{pbs@props@4}{/rm@oc119 32 0 R}
\pbs@seq@push@cx{pbs@props@4}{/rm@oc120 31 0 R}
\ocgxii@lnkcol@stack@on@page{4}{{linkcolour}}
\ocgxii@lnkcol@stack@on@page{4}{}
\pbs@seq@push@cx{pbs@props@4}{/rm@oc121 32 0 R}
\pbs@seq@push@cx{pbs@props@4}{/rm@oc122 31 0 R}
\ocgxii@ocg@stack@on@page{4}{}
\ocgxii@ocg@stack@on@page{4}{98 0 R}
\pbs@seq@push@cx{pbs@props@4}{/rm@oc123 98 0 R}
\ocgxii@lnkcol@stack@on@page{4}{{linkcolour}}
\ocgxii@lnkcol@stack@on@page{4}{}
\pbs@seq@push@cx{pbs@props@4}{/rm@oc124 32 0 R}
\pbs@seq@push@cx{pbs@props@4}{/rm@oc125 31 0 R}
\ocgxii@lnkcol@stack@on@page{4}{{linkcolour}}
\ocgxii@lnkcol@stack@on@page{4}{}
\pbs@seq@push@cx{pbs@props@4}{/rm@oc126 32 0 R}
\pbs@seq@push@cx{pbs@props@4}{/rm@oc127 31 0 R}
\ocgxii@lnkcol@stack@on@page{4}{{linkcolour}}
\ocgxii@lnkcol@stack@on@page{4}{}
\pbs@seq@push@cx{pbs@props@4}{/rm@oc128 32 0 R}
\pbs@seq@push@cx{pbs@props@4}{/rm@oc129 31 0 R}
\ocgxii@lnkcol@stack@on@page{4}{{linkcolour}}
\ocgxii@lnkcol@stack@on@page{4}{}
\pbs@seq@push@cx{pbs@props@4}{/rm@oc130 32 0 R}
\pbs@seq@push@cx{pbs@props@4}{/rm@oc131 31 0 R}
\ocgxii@lnkcol@stack@on@page{4}{{linkcolour}}
\ocgxii@lnkcol@stack@on@page{4}{}
\pbs@seq@push@cx{pbs@props@4}{/rm@oc132 32 0 R}
\pbs@seq@push@cx{pbs@props@4}{/rm@oc133 31 0 R}
\ocgxii@lnkcol@stack@on@page{4}{{linkcolour}}
\ocgxii@lnkcol@stack@on@page{4}{}
\pbs@seq@push@cx{pbs@props@4}{/rm@oc134 32 0 R}
\pbs@seq@push@cx{pbs@props@4}{/rm@oc135 31 0 R}
\ocgxii@ocg@stack@on@page{4}{}
\@writefile{toc}{\contentsline {section}{\numberline {4}Hereditary Spell}{5}{section.4}\protected@file@percent }
\newlabel{TSHereditarySpell}{{4}{5}{\hereditaryspell }{section.4}{}}
\@writefile{toc}{\contentsline {section}{\numberline {5}Special Items}{5}{section.5}\protected@file@percent }
\newlabel{TSSpecialEquip}{{5}{5}{\specialequipment }{section.5}{}}
\@writefile{toc}{\contentsline {subsection}{\numberline {5.1}Weapon Enchantments}{5}{subsection.5.1}\protected@file@percent }
\@writefile{toc}{\contentsline {subsection}{\numberline {5.2}Armour Enchantments}{5}{subsection.5.2}\protected@file@percent }
\@writefile{toc}{\contentsline {subsection}{\numberline {5.3}Banner Enchantments}{5}{subsection.5.3}\protected@file@percent }
\@writefile{toc}{\contentsline {subsection}{\numberline {5.4}Artefacts}{5}{subsection.5.4}\protected@file@percent }
\ocgxii@newkey{ocgx2.oldlnkcol.5}{}
\ocgxii@newkey{ocgx2.oldstack.5}{}
\ocgxii@ocg@stack@on@page{5}{98 0 R}
\pbs@seq@push@cx{pbs@props@5}{/rm@oc136 98 0 R}
\ocgxii@lnkcol@stack@on@page{5}{{linkcolour}}
\ocgxii@lnkcol@stack@on@page{5}{}
\pbs@seq@push@cx{pbs@props@5}{/rm@oc137 32 0 R}
\pbs@seq@push@cx{pbs@props@5}{/rm@oc138 31 0 R}
\ocgxii@lnkcol@stack@on@page{5}{{linkcolour}}
\ocgxii@lnkcol@stack@on@page{5}{}
\pbs@seq@push@cx{pbs@props@5}{/rm@oc139 32 0 R}
\pbs@seq@push@cx{pbs@props@5}{/rm@oc140 31 0 R}
\ocgxii@lnkcol@stack@on@page{5}{{linkcolour}}
\ocgxii@lnkcol@stack@on@page{5}{}
\pbs@seq@push@cx{pbs@props@5}{/rm@oc141 32 0 R}
\pbs@seq@push@cx{pbs@props@5}{/rm@oc142 31 0 R}
\ocgxii@lnkcol@stack@on@page{5}{{linkcolour}}
\ocgxii@lnkcol@stack@on@page{5}{}
\pbs@seq@push@cx{pbs@props@5}{/rm@oc143 32 0 R}
\pbs@seq@push@cx{pbs@props@5}{/rm@oc144 31 0 R}
\ocgxii@lnkcol@stack@on@page{5}{{linkcolour}}
\ocgxii@lnkcol@stack@on@page{5}{}
\pbs@seq@push@cx{pbs@props@5}{/rm@oc145 32 0 R}
\pbs@seq@push@cx{pbs@props@5}{/rm@oc146 31 0 R}
\ocgxii@lnkcol@stack@on@page{5}{{linkcolour}}
\ocgxii@lnkcol@stack@on@page{5}{}
\pbs@seq@push@cx{pbs@props@5}{/rm@oc147 32 0 R}
\pbs@seq@push@cx{pbs@props@5}{/rm@oc148 31 0 R}
\ocgxii@lnkcol@stack@on@page{5}{{linkcolour}}
\ocgxii@lnkcol@stack@on@page{5}{}
\pbs@seq@push@cx{pbs@props@5}{/rm@oc149 32 0 R}
\pbs@seq@push@cx{pbs@props@5}{/rm@oc150 31 0 R}
\ocgxii@ocg@stack@on@page{5}{}
\ocgxii@ocg@stack@on@page{5}{98 0 R}
\pbs@seq@push@cx{pbs@props@5}{/rm@oc151 98 0 R}
\ocgxii@lnkcol@stack@on@page{5}{{linkcolour}}
\ocgxii@lnkcol@stack@on@page{5}{}
\pbs@seq@push@cx{pbs@props@5}{/rm@oc152 32 0 R}
\pbs@seq@push@cx{pbs@props@5}{/rm@oc153 31 0 R}
\ocgxii@lnkcol@stack@on@page{5}{{linkcolour}}
\ocgxii@lnkcol@stack@on@page{5}{}
\pbs@seq@push@cx{pbs@props@5}{/rm@oc154 32 0 R}
\pbs@seq@push@cx{pbs@props@5}{/rm@oc155 31 0 R}
\ocgxii@lnkcol@stack@on@page{5}{{linkcolour}}
\ocgxii@lnkcol@stack@on@page{5}{}
\pbs@seq@push@cx{pbs@props@5}{/rm@oc156 32 0 R}
\pbs@seq@push@cx{pbs@props@5}{/rm@oc157 31 0 R}
\ocgxii@lnkcol@stack@on@page{5}{{linkcolour}}
\ocgxii@lnkcol@stack@on@page{5}{}
\pbs@seq@push@cx{pbs@props@5}{/rm@oc158 32 0 R}
\pbs@seq@push@cx{pbs@props@5}{/rm@oc159 31 0 R}
\ocgxii@lnkcol@stack@on@page{5}{{linkcolour}}
\ocgxii@lnkcol@stack@on@page{5}{}
\pbs@seq@push@cx{pbs@props@5}{/rm@oc160 32 0 R}
\pbs@seq@push@cx{pbs@props@5}{/rm@oc161 31 0 R}
\ocgxii@lnkcol@stack@on@page{5}{{linkcolour}}
\ocgxii@lnkcol@stack@on@page{5}{}
\pbs@seq@push@cx{pbs@props@5}{/rm@oc162 32 0 R}
\pbs@seq@push@cx{pbs@props@5}{/rm@oc163 31 0 R}
\ocgxii@ocg@stack@on@page{5}{}
\@writefile{toc}{\contentsline {section}{\numberline {6}Army Organisation}{6}{section.6}\protected@file@percent }
\newlabel{TSArmyOrganisation}{{6}{6}{\armyorganisation }{section.6}{}}
\newlabel{TSCharacters}{{6}{6}{}{section.6}{}}
\ocgxii@newkey{ocgx2.oldlnkcol.6}{}
\ocgxii@newkey{ocgx2.oldstack.6}{}
\ocgxii@ocg@stack@on@page{6}{98 0 R}
\pbs@seq@push@cx{pbs@props@6}{/rm@oc164 98 0 R}
\ocgxii@lnkcol@stack@on@page{6}{{linkcolour}}
\ocgxii@lnkcol@stack@on@page{6}{}
\pbs@seq@push@cx{pbs@props@6}{/rm@oc165 32 0 R}
\pbs@seq@push@cx{pbs@props@6}{/rm@oc166 31 0 R}
\ocgxii@lnkcol@stack@on@page{6}{{linkcolour}}
\ocgxii@lnkcol@stack@on@page{6}{}
\pbs@seq@push@cx{pbs@props@6}{/rm@oc167 32 0 R}
\pbs@seq@push@cx{pbs@props@6}{/rm@oc168 31 0 R}
\ocgxii@lnkcol@stack@on@page{6}{{linkcolour}}
\ocgxii@lnkcol@stack@on@page{6}{}
\pbs@seq@push@cx{pbs@props@6}{/rm@oc169 32 0 R}
\pbs@seq@push@cx{pbs@props@6}{/rm@oc170 31 0 R}
\ocgxii@lnkcol@stack@on@page{6}{{linkcolour}}
\ocgxii@lnkcol@stack@on@page{6}{}
\pbs@seq@push@cx{pbs@props@6}{/rm@oc171 32 0 R}
\pbs@seq@push@cx{pbs@props@6}{/rm@oc172 31 0 R}
\ocgxii@lnkcol@stack@on@page{6}{{linkcolour}}
\ocgxii@lnkcol@stack@on@page{6}{}
\pbs@seq@push@cx{pbs@props@6}{/rm@oc173 32 0 R}
\pbs@seq@push@cx{pbs@props@6}{/rm@oc174 31 0 R}
\ocgxii@lnkcol@stack@on@page{6}{{linkcolour}}
\ocgxii@lnkcol@stack@on@page{6}{}
\pbs@seq@push@cx{pbs@props@6}{/rm@oc175 32 0 R}
\pbs@seq@push@cx{pbs@props@6}{/rm@oc176 31 0 R}
\ocgxii@lnkcol@stack@on@page{6}{{linkcolour}}
\ocgxii@lnkcol@stack@on@page{6}{}
\pbs@seq@push@cx{pbs@props@6}{/rm@oc177 32 0 R}
\pbs@seq@push@cx{pbs@props@6}{/rm@oc178 31 0 R}
\ocgxii@ocg@stack@on@page{6}{}
\ocgxii@ocg@stack@on@page{6}{98 0 R}
\pbs@seq@push@cx{pbs@props@6}{/rm@oc179 98 0 R}
\ocgxii@lnkcol@stack@on@page{6}{{linkcolour}}
\ocgxii@lnkcol@stack@on@page{6}{}
\pbs@seq@push@cx{pbs@props@6}{/rm@oc180 32 0 R}
\pbs@seq@push@cx{pbs@props@6}{/rm@oc181 31 0 R}
\ocgxii@lnkcol@stack@on@page{6}{{linkcolour}}
\ocgxii@lnkcol@stack@on@page{6}{}
\pbs@seq@push@cx{pbs@props@6}{/rm@oc182 32 0 R}
\pbs@seq@push@cx{pbs@props@6}{/rm@oc183 31 0 R}
\ocgxii@lnkcol@stack@on@page{6}{{linkcolour}}
\ocgxii@lnkcol@stack@on@page{6}{}
\pbs@seq@push@cx{pbs@props@6}{/rm@oc184 32 0 R}
\pbs@seq@push@cx{pbs@props@6}{/rm@oc185 31 0 R}
\ocgxii@lnkcol@stack@on@page{6}{{linkcolour}}
\ocgxii@lnkcol@stack@on@page{6}{}
\pbs@seq@push@cx{pbs@props@6}{/rm@oc186 32 0 R}
\pbs@seq@push@cx{pbs@props@6}{/rm@oc187 31 0 R}
\ocgxii@lnkcol@stack@on@page{6}{{linkcolour}}
\ocgxii@lnkcol@stack@on@page{6}{}
\pbs@seq@push@cx{pbs@props@6}{/rm@oc188 32 0 R}
\pbs@seq@push@cx{pbs@props@6}{/rm@oc189 31 0 R}
\ocgxii@lnkcol@stack@on@page{6}{{linkcolour}}
\ocgxii@lnkcol@stack@on@page{6}{}
\pbs@seq@push@cx{pbs@props@6}{/rm@oc190 32 0 R}
\pbs@seq@push@cx{pbs@props@6}{/rm@oc191 31 0 R}
\ocgxii@ocg@stack@on@page{6}{}
\ocgxii@newkey{ocgx2.oldlnkcol.7}{}
\ocgxii@newkey{ocgx2.oldstack.7}{}
\ocgxii@ocg@stack@on@page{7}{98 0 R}
\pbs@seq@push@cx{pbs@props@7}{/rm@oc192 98 0 R}
\ocgxii@lnkcol@stack@on@page{7}{{linkcolour}}
\ocgxii@lnkcol@stack@on@page{7}{}
\pbs@seq@push@cx{pbs@props@7}{/rm@oc193 32 0 R}
\pbs@seq@push@cx{pbs@props@7}{/rm@oc194 31 0 R}
\ocgxii@lnkcol@stack@on@page{7}{{linkcolour}}
\ocgxii@lnkcol@stack@on@page{7}{}
\pbs@seq@push@cx{pbs@props@7}{/rm@oc195 32 0 R}
\pbs@seq@push@cx{pbs@props@7}{/rm@oc196 31 0 R}
\ocgxii@lnkcol@stack@on@page{7}{{linkcolour}}
\ocgxii@lnkcol@stack@on@page{7}{}
\pbs@seq@push@cx{pbs@props@7}{/rm@oc197 32 0 R}
\pbs@seq@push@cx{pbs@props@7}{/rm@oc198 31 0 R}
\ocgxii@lnkcol@stack@on@page{7}{{linkcolour}}
\ocgxii@lnkcol@stack@on@page{7}{}
\pbs@seq@push@cx{pbs@props@7}{/rm@oc199 32 0 R}
\pbs@seq@push@cx{pbs@props@7}{/rm@oc200 31 0 R}
\ocgxii@lnkcol@stack@on@page{7}{{linkcolour}}
\ocgxii@lnkcol@stack@on@page{7}{}
\pbs@seq@push@cx{pbs@props@7}{/rm@oc201 32 0 R}
\pbs@seq@push@cx{pbs@props@7}{/rm@oc202 31 0 R}
\ocgxii@lnkcol@stack@on@page{7}{{linkcolour}}
\ocgxii@lnkcol@stack@on@page{7}{}
\pbs@seq@push@cx{pbs@props@7}{/rm@oc203 32 0 R}
\pbs@seq@push@cx{pbs@props@7}{/rm@oc204 31 0 R}
\ocgxii@lnkcol@stack@on@page{7}{{linkcolour}}
\ocgxii@lnkcol@stack@on@page{7}{}
\pbs@seq@push@cx{pbs@props@7}{/rm@oc205 32 0 R}
\pbs@seq@push@cx{pbs@props@7}{/rm@oc206 31 0 R}
\ocgxii@ocg@stack@on@page{7}{}
\ocgxii@ocg@stack@on@page{7}{98 0 R}
\pbs@seq@push@cx{pbs@props@7}{/rm@oc207 98 0 R}
\ocgxii@lnkcol@stack@on@page{7}{{linkcolour}}
\ocgxii@lnkcol@stack@on@page{7}{}
\pbs@seq@push@cx{pbs@props@7}{/rm@oc208 32 0 R}
\pbs@seq@push@cx{pbs@props@7}{/rm@oc209 31 0 R}
\ocgxii@lnkcol@stack@on@page{7}{{linkcolour}}
\ocgxii@lnkcol@stack@on@page{7}{}
\pbs@seq@push@cx{pbs@props@7}{/rm@oc210 32 0 R}
\pbs@seq@push@cx{pbs@props@7}{/rm@oc211 31 0 R}
\ocgxii@lnkcol@stack@on@page{7}{{linkcolour}}
\ocgxii@lnkcol@stack@on@page{7}{}
\pbs@seq@push@cx{pbs@props@7}{/rm@oc212 32 0 R}
\pbs@seq@push@cx{pbs@props@7}{/rm@oc213 31 0 R}
\ocgxii@lnkcol@stack@on@page{7}{{linkcolour}}
\ocgxii@lnkcol@stack@on@page{7}{}
\pbs@seq@push@cx{pbs@props@7}{/rm@oc214 32 0 R}
\pbs@seq@push@cx{pbs@props@7}{/rm@oc215 31 0 R}
\ocgxii@lnkcol@stack@on@page{7}{{linkcolour}}
\ocgxii@lnkcol@stack@on@page{7}{}
\pbs@seq@push@cx{pbs@props@7}{/rm@oc216 32 0 R}
\pbs@seq@push@cx{pbs@props@7}{/rm@oc217 31 0 R}
\ocgxii@lnkcol@stack@on@page{7}{{linkcolour}}
\ocgxii@lnkcol@stack@on@page{7}{}
\pbs@seq@push@cx{pbs@props@7}{/rm@oc218 32 0 R}
\pbs@seq@push@cx{pbs@props@7}{/rm@oc219 31 0 R}
\ocgxii@ocg@stack@on@page{7}{}
\ocgxii@newkey{ocgx2.oldlnkcol.8}{}
\ocgxii@newkey{ocgx2.oldstack.8}{}
\ocgxii@ocg@stack@on@page{8}{98 0 R}
\pbs@seq@push@cx{pbs@props@8}{/rm@oc220 98 0 R}
\ocgxii@lnkcol@stack@on@page{8}{{linkcolour}}
\ocgxii@lnkcol@stack@on@page{8}{}
\pbs@seq@push@cx{pbs@props@8}{/rm@oc221 32 0 R}
\pbs@seq@push@cx{pbs@props@8}{/rm@oc222 31 0 R}
\ocgxii@lnkcol@stack@on@page{8}{{linkcolour}}
\ocgxii@lnkcol@stack@on@page{8}{}
\pbs@seq@push@cx{pbs@props@8}{/rm@oc223 32 0 R}
\pbs@seq@push@cx{pbs@props@8}{/rm@oc224 31 0 R}
\ocgxii@lnkcol@stack@on@page{8}{{linkcolour}}
\ocgxii@lnkcol@stack@on@page{8}{}
\pbs@seq@push@cx{pbs@props@8}{/rm@oc225 32 0 R}
\pbs@seq@push@cx{pbs@props@8}{/rm@oc226 31 0 R}
\ocgxii@lnkcol@stack@on@page{8}{{linkcolour}}
\ocgxii@lnkcol@stack@on@page{8}{}
\pbs@seq@push@cx{pbs@props@8}{/rm@oc227 32 0 R}
\pbs@seq@push@cx{pbs@props@8}{/rm@oc228 31 0 R}
\ocgxii@lnkcol@stack@on@page{8}{{linkcolour}}
\ocgxii@lnkcol@stack@on@page{8}{}
\pbs@seq@push@cx{pbs@props@8}{/rm@oc229 32 0 R}
\pbs@seq@push@cx{pbs@props@8}{/rm@oc230 31 0 R}
\ocgxii@lnkcol@stack@on@page{8}{{linkcolour}}
\ocgxii@lnkcol@stack@on@page{8}{}
\pbs@seq@push@cx{pbs@props@8}{/rm@oc231 32 0 R}
\pbs@seq@push@cx{pbs@props@8}{/rm@oc232 31 0 R}
\ocgxii@lnkcol@stack@on@page{8}{{linkcolour}}
\ocgxii@lnkcol@stack@on@page{8}{}
\pbs@seq@push@cx{pbs@props@8}{/rm@oc233 32 0 R}
\pbs@seq@push@cx{pbs@props@8}{/rm@oc234 31 0 R}
\ocgxii@ocg@stack@on@page{8}{}
\ocgxii@ocg@stack@on@page{8}{98 0 R}
\pbs@seq@push@cx{pbs@props@8}{/rm@oc235 98 0 R}
\ocgxii@lnkcol@stack@on@page{8}{{linkcolour}}
\ocgxii@lnkcol@stack@on@page{8}{}
\pbs@seq@push@cx{pbs@props@8}{/rm@oc236 32 0 R}
\pbs@seq@push@cx{pbs@props@8}{/rm@oc237 31 0 R}
\ocgxii@lnkcol@stack@on@page{8}{{linkcolour}}
\ocgxii@lnkcol@stack@on@page{8}{}
\pbs@seq@push@cx{pbs@props@8}{/rm@oc238 32 0 R}
\pbs@seq@push@cx{pbs@props@8}{/rm@oc239 31 0 R}
\ocgxii@lnkcol@stack@on@page{8}{{linkcolour}}
\ocgxii@lnkcol@stack@on@page{8}{}
\pbs@seq@push@cx{pbs@props@8}{/rm@oc240 32 0 R}
\pbs@seq@push@cx{pbs@props@8}{/rm@oc241 31 0 R}
\ocgxii@lnkcol@stack@on@page{8}{{linkcolour}}
\ocgxii@lnkcol@stack@on@page{8}{}
\pbs@seq@push@cx{pbs@props@8}{/rm@oc242 32 0 R}
\pbs@seq@push@cx{pbs@props@8}{/rm@oc243 31 0 R}
\ocgxii@lnkcol@stack@on@page{8}{{linkcolour}}
\ocgxii@lnkcol@stack@on@page{8}{}
\pbs@seq@push@cx{pbs@props@8}{/rm@oc244 32 0 R}
\pbs@seq@push@cx{pbs@props@8}{/rm@oc245 31 0 R}
\ocgxii@lnkcol@stack@on@page{8}{{linkcolour}}
\ocgxii@lnkcol@stack@on@page{8}{}
\pbs@seq@push@cx{pbs@props@8}{/rm@oc246 32 0 R}
\pbs@seq@push@cx{pbs@props@8}{/rm@oc247 31 0 R}
\ocgxii@ocg@stack@on@page{8}{}
\ocgxii@newkey{ocgx2.oldlnkcol.9}{}
\ocgxii@newkey{ocgx2.oldstack.9}{}
\ocgxii@ocg@stack@on@page{9}{98 0 R}
\pbs@seq@push@cx{pbs@props@9}{/rm@oc248 98 0 R}
\ocgxii@lnkcol@stack@on@page{9}{{linkcolour}}
\ocgxii@lnkcol@stack@on@page{9}{}
\pbs@seq@push@cx{pbs@props@9}{/rm@oc249 32 0 R}
\pbs@seq@push@cx{pbs@props@9}{/rm@oc250 31 0 R}
\ocgxii@lnkcol@stack@on@page{9}{{linkcolour}}
\ocgxii@lnkcol@stack@on@page{9}{}
\pbs@seq@push@cx{pbs@props@9}{/rm@oc251 32 0 R}
\pbs@seq@push@cx{pbs@props@9}{/rm@oc252 31 0 R}
\ocgxii@lnkcol@stack@on@page{9}{{linkcolour}}
\ocgxii@lnkcol@stack@on@page{9}{}
\pbs@seq@push@cx{pbs@props@9}{/rm@oc253 32 0 R}
\pbs@seq@push@cx{pbs@props@9}{/rm@oc254 31 0 R}
\ocgxii@lnkcol@stack@on@page{9}{{linkcolour}}
\ocgxii@lnkcol@stack@on@page{9}{}
\pbs@seq@push@cx{pbs@props@9}{/rm@oc255 32 0 R}
\pbs@seq@push@cx{pbs@props@9}{/rm@oc256 31 0 R}
\ocgxii@lnkcol@stack@on@page{9}{{linkcolour}}
\ocgxii@lnkcol@stack@on@page{9}{}
\pbs@seq@push@cx{pbs@props@9}{/rm@oc257 32 0 R}
\pbs@seq@push@cx{pbs@props@9}{/rm@oc258 31 0 R}
\ocgxii@lnkcol@stack@on@page{9}{{linkcolour}}
\ocgxii@lnkcol@stack@on@page{9}{}
\pbs@seq@push@cx{pbs@props@9}{/rm@oc259 32 0 R}
\pbs@seq@push@cx{pbs@props@9}{/rm@oc260 31 0 R}
\ocgxii@lnkcol@stack@on@page{9}{{linkcolour}}
\ocgxii@lnkcol@stack@on@page{9}{}
\pbs@seq@push@cx{pbs@props@9}{/rm@oc261 32 0 R}
\pbs@seq@push@cx{pbs@props@9}{/rm@oc262 31 0 R}
\ocgxii@ocg@stack@on@page{9}{}
\ocgxii@ocg@stack@on@page{9}{98 0 R}
\pbs@seq@push@cx{pbs@props@9}{/rm@oc263 98 0 R}
\ocgxii@lnkcol@stack@on@page{9}{{linkcolour}}
\ocgxii@lnkcol@stack@on@page{9}{}
\pbs@seq@push@cx{pbs@props@9}{/rm@oc264 32 0 R}
\pbs@seq@push@cx{pbs@props@9}{/rm@oc265 31 0 R}
\ocgxii@lnkcol@stack@on@page{9}{{linkcolour}}
\ocgxii@lnkcol@stack@on@page{9}{}
\pbs@seq@push@cx{pbs@props@9}{/rm@oc266 32 0 R}
\pbs@seq@push@cx{pbs@props@9}{/rm@oc267 31 0 R}
\ocgxii@lnkcol@stack@on@page{9}{{linkcolour}}
\ocgxii@lnkcol@stack@on@page{9}{}
\pbs@seq@push@cx{pbs@props@9}{/rm@oc268 32 0 R}
\pbs@seq@push@cx{pbs@props@9}{/rm@oc269 31 0 R}
\ocgxii@lnkcol@stack@on@page{9}{{linkcolour}}
\ocgxii@lnkcol@stack@on@page{9}{}
\pbs@seq@push@cx{pbs@props@9}{/rm@oc270 32 0 R}
\pbs@seq@push@cx{pbs@props@9}{/rm@oc271 31 0 R}
\ocgxii@lnkcol@stack@on@page{9}{{linkcolour}}
\ocgxii@lnkcol@stack@on@page{9}{}
\pbs@seq@push@cx{pbs@props@9}{/rm@oc272 32 0 R}
\pbs@seq@push@cx{pbs@props@9}{/rm@oc273 31 0 R}
\ocgxii@lnkcol@stack@on@page{9}{{linkcolour}}
\ocgxii@lnkcol@stack@on@page{9}{}
\pbs@seq@push@cx{pbs@props@9}{/rm@oc274 32 0 R}
\pbs@seq@push@cx{pbs@props@9}{/rm@oc275 31 0 R}
\ocgxii@ocg@stack@on@page{9}{}
\newlabel{TSMounts}{{6}{10}{}{DTLrowi.39.3}{}}
\ocgxii@newkey{ocgx2.oldlnkcol.10}{}
\ocgxii@newkey{ocgx2.oldstack.10}{}
\ocgxii@ocg@stack@on@page{10}{98 0 R}
\pbs@seq@push@cx{pbs@props@10}{/rm@oc276 98 0 R}
\ocgxii@lnkcol@stack@on@page{10}{{linkcolour}}
\ocgxii@lnkcol@stack@on@page{10}{}
\pbs@seq@push@cx{pbs@props@10}{/rm@oc277 32 0 R}
\pbs@seq@push@cx{pbs@props@10}{/rm@oc278 31 0 R}
\ocgxii@lnkcol@stack@on@page{10}{{linkcolour}}
\ocgxii@lnkcol@stack@on@page{10}{}
\pbs@seq@push@cx{pbs@props@10}{/rm@oc279 32 0 R}
\pbs@seq@push@cx{pbs@props@10}{/rm@oc280 31 0 R}
\ocgxii@lnkcol@stack@on@page{10}{{linkcolour}}
\ocgxii@lnkcol@stack@on@page{10}{}
\pbs@seq@push@cx{pbs@props@10}{/rm@oc281 32 0 R}
\pbs@seq@push@cx{pbs@props@10}{/rm@oc282 31 0 R}
\ocgxii@lnkcol@stack@on@page{10}{{linkcolour}}
\ocgxii@lnkcol@stack@on@page{10}{}
\pbs@seq@push@cx{pbs@props@10}{/rm@oc283 32 0 R}
\pbs@seq@push@cx{pbs@props@10}{/rm@oc284 31 0 R}
\ocgxii@lnkcol@stack@on@page{10}{{linkcolour}}
\ocgxii@lnkcol@stack@on@page{10}{}
\pbs@seq@push@cx{pbs@props@10}{/rm@oc285 32 0 R}
\pbs@seq@push@cx{pbs@props@10}{/rm@oc286 31 0 R}
\ocgxii@lnkcol@stack@on@page{10}{{linkcolour}}
\ocgxii@lnkcol@stack@on@page{10}{}
\pbs@seq@push@cx{pbs@props@10}{/rm@oc287 32 0 R}
\pbs@seq@push@cx{pbs@props@10}{/rm@oc288 31 0 R}
\ocgxii@lnkcol@stack@on@page{10}{{linkcolour}}
\ocgxii@lnkcol@stack@on@page{10}{}
\pbs@seq@push@cx{pbs@props@10}{/rm@oc289 32 0 R}
\pbs@seq@push@cx{pbs@props@10}{/rm@oc290 31 0 R}
\ocgxii@ocg@stack@on@page{10}{}
\ocgxii@ocg@stack@on@page{10}{98 0 R}
\pbs@seq@push@cx{pbs@props@10}{/rm@oc291 98 0 R}
\ocgxii@lnkcol@stack@on@page{10}{{linkcolour}}
\ocgxii@lnkcol@stack@on@page{10}{}
\pbs@seq@push@cx{pbs@props@10}{/rm@oc292 32 0 R}
\pbs@seq@push@cx{pbs@props@10}{/rm@oc293 31 0 R}
\ocgxii@lnkcol@stack@on@page{10}{{linkcolour}}
\ocgxii@lnkcol@stack@on@page{10}{}
\pbs@seq@push@cx{pbs@props@10}{/rm@oc294 32 0 R}
\pbs@seq@push@cx{pbs@props@10}{/rm@oc295 31 0 R}
\ocgxii@lnkcol@stack@on@page{10}{{linkcolour}}
\ocgxii@lnkcol@stack@on@page{10}{}
\pbs@seq@push@cx{pbs@props@10}{/rm@oc296 32 0 R}
\pbs@seq@push@cx{pbs@props@10}{/rm@oc297 31 0 R}
\ocgxii@lnkcol@stack@on@page{10}{{linkcolour}}
\ocgxii@lnkcol@stack@on@page{10}{}
\pbs@seq@push@cx{pbs@props@10}{/rm@oc298 32 0 R}
\pbs@seq@push@cx{pbs@props@10}{/rm@oc299 31 0 R}
\ocgxii@lnkcol@stack@on@page{10}{{linkcolour}}
\ocgxii@lnkcol@stack@on@page{10}{}
\pbs@seq@push@cx{pbs@props@10}{/rm@oc300 32 0 R}
\pbs@seq@push@cx{pbs@props@10}{/rm@oc301 31 0 R}
\ocgxii@lnkcol@stack@on@page{10}{{linkcolour}}
\ocgxii@lnkcol@stack@on@page{10}{}
\pbs@seq@push@cx{pbs@props@10}{/rm@oc302 32 0 R}
\pbs@seq@push@cx{pbs@props@10}{/rm@oc303 31 0 R}
\ocgxii@ocg@stack@on@page{10}{}
\newlabel{TSRetinue}{{6}{11}{}{DTLrowi.51.2}{}}
\ocgxii@newkey{ocgx2.oldlnkcol.11}{}
\ocgxii@newkey{ocgx2.oldstack.11}{}
\ocgxii@ocg@stack@on@page{11}{98 0 R}
\pbs@seq@push@cx{pbs@props@11}{/rm@oc304 98 0 R}
\ocgxii@lnkcol@stack@on@page{11}{{linkcolour}}
\ocgxii@lnkcol@stack@on@page{11}{}
\pbs@seq@push@cx{pbs@props@11}{/rm@oc305 32 0 R}
\pbs@seq@push@cx{pbs@props@11}{/rm@oc306 31 0 R}
\ocgxii@lnkcol@stack@on@page{11}{{linkcolour}}
\ocgxii@lnkcol@stack@on@page{11}{}
\pbs@seq@push@cx{pbs@props@11}{/rm@oc307 32 0 R}
\pbs@seq@push@cx{pbs@props@11}{/rm@oc308 31 0 R}
\ocgxii@lnkcol@stack@on@page{11}{{linkcolour}}
\ocgxii@lnkcol@stack@on@page{11}{}
\pbs@seq@push@cx{pbs@props@11}{/rm@oc309 32 0 R}
\pbs@seq@push@cx{pbs@props@11}{/rm@oc310 31 0 R}
\ocgxii@lnkcol@stack@on@page{11}{{linkcolour}}
\ocgxii@lnkcol@stack@on@page{11}{}
\pbs@seq@push@cx{pbs@props@11}{/rm@oc311 32 0 R}
\pbs@seq@push@cx{pbs@props@11}{/rm@oc312 31 0 R}
\ocgxii@lnkcol@stack@on@page{11}{{linkcolour}}
\ocgxii@lnkcol@stack@on@page{11}{}
\pbs@seq@push@cx{pbs@props@11}{/rm@oc313 32 0 R}
\pbs@seq@push@cx{pbs@props@11}{/rm@oc314 31 0 R}
\ocgxii@lnkcol@stack@on@page{11}{{linkcolour}}
\ocgxii@lnkcol@stack@on@page{11}{}
\pbs@seq@push@cx{pbs@props@11}{/rm@oc315 32 0 R}
\pbs@seq@push@cx{pbs@props@11}{/rm@oc316 31 0 R}
\ocgxii@lnkcol@stack@on@page{11}{{linkcolour}}
\ocgxii@lnkcol@stack@on@page{11}{}
\pbs@seq@push@cx{pbs@props@11}{/rm@oc317 32 0 R}
\pbs@seq@push@cx{pbs@props@11}{/rm@oc318 31 0 R}
\ocgxii@ocg@stack@on@page{11}{}
\ocgxii@ocg@stack@on@page{11}{98 0 R}
\pbs@seq@push@cx{pbs@props@11}{/rm@oc319 98 0 R}
\ocgxii@lnkcol@stack@on@page{11}{{linkcolour}}
\ocgxii@lnkcol@stack@on@page{11}{}
\pbs@seq@push@cx{pbs@props@11}{/rm@oc320 32 0 R}
\pbs@seq@push@cx{pbs@props@11}{/rm@oc321 31 0 R}
\ocgxii@lnkcol@stack@on@page{11}{{linkcolour}}
\ocgxii@lnkcol@stack@on@page{11}{}
\pbs@seq@push@cx{pbs@props@11}{/rm@oc322 32 0 R}
\pbs@seq@push@cx{pbs@props@11}{/rm@oc323 31 0 R}
\ocgxii@lnkcol@stack@on@page{11}{{linkcolour}}
\ocgxii@lnkcol@stack@on@page{11}{}
\pbs@seq@push@cx{pbs@props@11}{/rm@oc324 32 0 R}
\pbs@seq@push@cx{pbs@props@11}{/rm@oc325 31 0 R}
\ocgxii@lnkcol@stack@on@page{11}{{linkcolour}}
\ocgxii@lnkcol@stack@on@page{11}{}
\pbs@seq@push@cx{pbs@props@11}{/rm@oc326 32 0 R}
\pbs@seq@push@cx{pbs@props@11}{/rm@oc327 31 0 R}
\ocgxii@lnkcol@stack@on@page{11}{{linkcolour}}
\ocgxii@lnkcol@stack@on@page{11}{}
\pbs@seq@push@cx{pbs@props@11}{/rm@oc328 32 0 R}
\pbs@seq@push@cx{pbs@props@11}{/rm@oc329 31 0 R}
\ocgxii@lnkcol@stack@on@page{11}{{linkcolour}}
\ocgxii@lnkcol@stack@on@page{11}{}
\pbs@seq@push@cx{pbs@props@11}{/rm@oc330 32 0 R}
\pbs@seq@push@cx{pbs@props@11}{/rm@oc331 31 0 R}
\ocgxii@ocg@stack@on@page{11}{}
\newlabel{TSCore}{{6}{12}{}{DTLrowi.53.4}{}}
\ocgxii@newkey{ocgx2.oldlnkcol.12}{}
\ocgxii@newkey{ocgx2.oldstack.12}{}
\ocgxii@ocg@stack@on@page{12}{98 0 R}
\pbs@seq@push@cx{pbs@props@12}{/rm@oc332 98 0 R}
\ocgxii@lnkcol@stack@on@page{12}{{linkcolour}}
\ocgxii@lnkcol@stack@on@page{12}{}
\pbs@seq@push@cx{pbs@props@12}{/rm@oc333 32 0 R}
\pbs@seq@push@cx{pbs@props@12}{/rm@oc334 31 0 R}
\ocgxii@lnkcol@stack@on@page{12}{{linkcolour}}
\ocgxii@lnkcol@stack@on@page{12}{}
\pbs@seq@push@cx{pbs@props@12}{/rm@oc335 32 0 R}
\pbs@seq@push@cx{pbs@props@12}{/rm@oc336 31 0 R}
\ocgxii@lnkcol@stack@on@page{12}{{linkcolour}}
\ocgxii@lnkcol@stack@on@page{12}{}
\pbs@seq@push@cx{pbs@props@12}{/rm@oc337 32 0 R}
\pbs@seq@push@cx{pbs@props@12}{/rm@oc338 31 0 R}
\ocgxii@lnkcol@stack@on@page{12}{{linkcolour}}
\ocgxii@lnkcol@stack@on@page{12}{}
\pbs@seq@push@cx{pbs@props@12}{/rm@oc339 32 0 R}
\pbs@seq@push@cx{pbs@props@12}{/rm@oc340 31 0 R}
\ocgxii@lnkcol@stack@on@page{12}{{linkcolour}}
\ocgxii@lnkcol@stack@on@page{12}{}
\pbs@seq@push@cx{pbs@props@12}{/rm@oc341 32 0 R}
\pbs@seq@push@cx{pbs@props@12}{/rm@oc342 31 0 R}
\ocgxii@lnkcol@stack@on@page{12}{{linkcolour}}
\ocgxii@lnkcol@stack@on@page{12}{}
\pbs@seq@push@cx{pbs@props@12}{/rm@oc343 32 0 R}
\pbs@seq@push@cx{pbs@props@12}{/rm@oc344 31 0 R}
\ocgxii@lnkcol@stack@on@page{12}{{linkcolour}}
\ocgxii@lnkcol@stack@on@page{12}{}
\pbs@seq@push@cx{pbs@props@12}{/rm@oc345 32 0 R}
\pbs@seq@push@cx{pbs@props@12}{/rm@oc346 31 0 R}
\ocgxii@ocg@stack@on@page{12}{}
\ocgxii@ocg@stack@on@page{12}{98 0 R}
\pbs@seq@push@cx{pbs@props@12}{/rm@oc347 98 0 R}
\ocgxii@lnkcol@stack@on@page{12}{{linkcolour}}
\ocgxii@lnkcol@stack@on@page{12}{}
\pbs@seq@push@cx{pbs@props@12}{/rm@oc348 32 0 R}
\pbs@seq@push@cx{pbs@props@12}{/rm@oc349 31 0 R}
\ocgxii@lnkcol@stack@on@page{12}{{linkcolour}}
\ocgxii@lnkcol@stack@on@page{12}{}
\pbs@seq@push@cx{pbs@props@12}{/rm@oc350 32 0 R}
\pbs@seq@push@cx{pbs@props@12}{/rm@oc351 31 0 R}
\ocgxii@lnkcol@stack@on@page{12}{{linkcolour}}
\ocgxii@lnkcol@stack@on@page{12}{}
\pbs@seq@push@cx{pbs@props@12}{/rm@oc352 32 0 R}
\pbs@seq@push@cx{pbs@props@12}{/rm@oc353 31 0 R}
\ocgxii@lnkcol@stack@on@page{12}{{linkcolour}}
\ocgxii@lnkcol@stack@on@page{12}{}
\pbs@seq@push@cx{pbs@props@12}{/rm@oc354 32 0 R}
\pbs@seq@push@cx{pbs@props@12}{/rm@oc355 31 0 R}
\ocgxii@lnkcol@stack@on@page{12}{{linkcolour}}
\ocgxii@lnkcol@stack@on@page{12}{}
\pbs@seq@push@cx{pbs@props@12}{/rm@oc356 32 0 R}
\pbs@seq@push@cx{pbs@props@12}{/rm@oc357 31 0 R}
\ocgxii@lnkcol@stack@on@page{12}{{linkcolour}}
\ocgxii@lnkcol@stack@on@page{12}{}
\pbs@seq@push@cx{pbs@props@12}{/rm@oc358 32 0 R}
\pbs@seq@push@cx{pbs@props@12}{/rm@oc359 31 0 R}
\ocgxii@ocg@stack@on@page{12}{}
\ocgxii@newkey{ocgx2.oldlnkcol.13}{}
\ocgxii@newkey{ocgx2.oldstack.13}{}
\ocgxii@ocg@stack@on@page{13}{98 0 R}
\pbs@seq@push@cx{pbs@props@13}{/rm@oc360 98 0 R}
\ocgxii@lnkcol@stack@on@page{13}{{linkcolour}}
\ocgxii@lnkcol@stack@on@page{13}{}
\pbs@seq@push@cx{pbs@props@13}{/rm@oc361 32 0 R}
\pbs@seq@push@cx{pbs@props@13}{/rm@oc362 31 0 R}
\ocgxii@lnkcol@stack@on@page{13}{{linkcolour}}
\ocgxii@lnkcol@stack@on@page{13}{}
\pbs@seq@push@cx{pbs@props@13}{/rm@oc363 32 0 R}
\pbs@seq@push@cx{pbs@props@13}{/rm@oc364 31 0 R}
\ocgxii@lnkcol@stack@on@page{13}{{linkcolour}}
\ocgxii@lnkcol@stack@on@page{13}{}
\pbs@seq@push@cx{pbs@props@13}{/rm@oc365 32 0 R}
\pbs@seq@push@cx{pbs@props@13}{/rm@oc366 31 0 R}
\ocgxii@lnkcol@stack@on@page{13}{{linkcolour}}
\ocgxii@lnkcol@stack@on@page{13}{}
\pbs@seq@push@cx{pbs@props@13}{/rm@oc367 32 0 R}
\pbs@seq@push@cx{pbs@props@13}{/rm@oc368 31 0 R}
\ocgxii@lnkcol@stack@on@page{13}{{linkcolour}}
\ocgxii@lnkcol@stack@on@page{13}{}
\pbs@seq@push@cx{pbs@props@13}{/rm@oc369 32 0 R}
\pbs@seq@push@cx{pbs@props@13}{/rm@oc370 31 0 R}
\ocgxii@lnkcol@stack@on@page{13}{{linkcolour}}
\ocgxii@lnkcol@stack@on@page{13}{}
\pbs@seq@push@cx{pbs@props@13}{/rm@oc371 32 0 R}
\pbs@seq@push@cx{pbs@props@13}{/rm@oc372 31 0 R}
\ocgxii@lnkcol@stack@on@page{13}{{linkcolour}}
\ocgxii@lnkcol@stack@on@page{13}{}
\pbs@seq@push@cx{pbs@props@13}{/rm@oc373 32 0 R}
\pbs@seq@push@cx{pbs@props@13}{/rm@oc374 31 0 R}
\ocgxii@ocg@stack@on@page{13}{}
\ocgxii@ocg@stack@on@page{13}{98 0 R}
\pbs@seq@push@cx{pbs@props@13}{/rm@oc375 98 0 R}
\ocgxii@lnkcol@stack@on@page{13}{{linkcolour}}
\ocgxii@lnkcol@stack@on@page{13}{}
\pbs@seq@push@cx{pbs@props@13}{/rm@oc376 32 0 R}
\pbs@seq@push@cx{pbs@props@13}{/rm@oc377 31 0 R}
\ocgxii@lnkcol@stack@on@page{13}{{linkcolour}}
\ocgxii@lnkcol@stack@on@page{13}{}
\pbs@seq@push@cx{pbs@props@13}{/rm@oc378 32 0 R}
\pbs@seq@push@cx{pbs@props@13}{/rm@oc379 31 0 R}
\ocgxii@lnkcol@stack@on@page{13}{{linkcolour}}
\ocgxii@lnkcol@stack@on@page{13}{}
\pbs@seq@push@cx{pbs@props@13}{/rm@oc380 32 0 R}
\pbs@seq@push@cx{pbs@props@13}{/rm@oc381 31 0 R}
\ocgxii@lnkcol@stack@on@page{13}{{linkcolour}}
\ocgxii@lnkcol@stack@on@page{13}{}
\pbs@seq@push@cx{pbs@props@13}{/rm@oc382 32 0 R}
\pbs@seq@push@cx{pbs@props@13}{/rm@oc383 31 0 R}
\ocgxii@lnkcol@stack@on@page{13}{{linkcolour}}
\ocgxii@lnkcol@stack@on@page{13}{}
\pbs@seq@push@cx{pbs@props@13}{/rm@oc384 32 0 R}
\pbs@seq@push@cx{pbs@props@13}{/rm@oc385 31 0 R}
\ocgxii@lnkcol@stack@on@page{13}{{linkcolour}}
\ocgxii@lnkcol@stack@on@page{13}{}
\pbs@seq@push@cx{pbs@props@13}{/rm@oc386 32 0 R}
\pbs@seq@push@cx{pbs@props@13}{/rm@oc387 31 0 R}
\ocgxii@ocg@stack@on@page{13}{}
\newlabel{TSSpecial}{{6}{14}{}{DTLrowi.68.4}{}}
\ocgxii@newkey{ocgx2.oldlnkcol.14}{}
\ocgxii@newkey{ocgx2.oldstack.14}{}
\ocgxii@ocg@stack@on@page{14}{98 0 R}
\pbs@seq@push@cx{pbs@props@14}{/rm@oc388 98 0 R}
\ocgxii@lnkcol@stack@on@page{14}{{linkcolour}}
\ocgxii@lnkcol@stack@on@page{14}{}
\pbs@seq@push@cx{pbs@props@14}{/rm@oc389 32 0 R}
\pbs@seq@push@cx{pbs@props@14}{/rm@oc390 31 0 R}
\ocgxii@lnkcol@stack@on@page{14}{{linkcolour}}
\ocgxii@lnkcol@stack@on@page{14}{}
\pbs@seq@push@cx{pbs@props@14}{/rm@oc391 32 0 R}
\pbs@seq@push@cx{pbs@props@14}{/rm@oc392 31 0 R}
\ocgxii@lnkcol@stack@on@page{14}{{linkcolour}}
\ocgxii@lnkcol@stack@on@page{14}{}
\pbs@seq@push@cx{pbs@props@14}{/rm@oc393 32 0 R}
\pbs@seq@push@cx{pbs@props@14}{/rm@oc394 31 0 R}
\ocgxii@lnkcol@stack@on@page{14}{{linkcolour}}
\ocgxii@lnkcol@stack@on@page{14}{}
\pbs@seq@push@cx{pbs@props@14}{/rm@oc395 32 0 R}
\pbs@seq@push@cx{pbs@props@14}{/rm@oc396 31 0 R}
\ocgxii@lnkcol@stack@on@page{14}{{linkcolour}}
\ocgxii@lnkcol@stack@on@page{14}{}
\pbs@seq@push@cx{pbs@props@14}{/rm@oc397 32 0 R}
\pbs@seq@push@cx{pbs@props@14}{/rm@oc398 31 0 R}
\ocgxii@lnkcol@stack@on@page{14}{{linkcolour}}
\ocgxii@lnkcol@stack@on@page{14}{}
\pbs@seq@push@cx{pbs@props@14}{/rm@oc399 32 0 R}
\pbs@seq@push@cx{pbs@props@14}{/rm@oc400 31 0 R}
\ocgxii@lnkcol@stack@on@page{14}{{linkcolour}}
\ocgxii@lnkcol@stack@on@page{14}{}
\pbs@seq@push@cx{pbs@props@14}{/rm@oc401 32 0 R}
\pbs@seq@push@cx{pbs@props@14}{/rm@oc402 31 0 R}
\ocgxii@ocg@stack@on@page{14}{}
\ocgxii@ocg@stack@on@page{14}{98 0 R}
\pbs@seq@push@cx{pbs@props@14}{/rm@oc403 98 0 R}
\ocgxii@lnkcol@stack@on@page{14}{{linkcolour}}
\ocgxii@lnkcol@stack@on@page{14}{}
\pbs@seq@push@cx{pbs@props@14}{/rm@oc404 32 0 R}
\pbs@seq@push@cx{pbs@props@14}{/rm@oc405 31 0 R}
\ocgxii@lnkcol@stack@on@page{14}{{linkcolour}}
\ocgxii@lnkcol@stack@on@page{14}{}
\pbs@seq@push@cx{pbs@props@14}{/rm@oc406 32 0 R}
\pbs@seq@push@cx{pbs@props@14}{/rm@oc407 31 0 R}
\ocgxii@lnkcol@stack@on@page{14}{{linkcolour}}
\ocgxii@lnkcol@stack@on@page{14}{}
\pbs@seq@push@cx{pbs@props@14}{/rm@oc408 32 0 R}
\pbs@seq@push@cx{pbs@props@14}{/rm@oc409 31 0 R}
\ocgxii@lnkcol@stack@on@page{14}{{linkcolour}}
\ocgxii@lnkcol@stack@on@page{14}{}
\pbs@seq@push@cx{pbs@props@14}{/rm@oc410 32 0 R}
\pbs@seq@push@cx{pbs@props@14}{/rm@oc411 31 0 R}
\ocgxii@lnkcol@stack@on@page{14}{{linkcolour}}
\ocgxii@lnkcol@stack@on@page{14}{}
\pbs@seq@push@cx{pbs@props@14}{/rm@oc412 32 0 R}
\pbs@seq@push@cx{pbs@props@14}{/rm@oc413 31 0 R}
\ocgxii@lnkcol@stack@on@page{14}{{linkcolour}}
\ocgxii@lnkcol@stack@on@page{14}{}
\pbs@seq@push@cx{pbs@props@14}{/rm@oc414 32 0 R}
\pbs@seq@push@cx{pbs@props@14}{/rm@oc415 31 0 R}
\ocgxii@ocg@stack@on@page{14}{}
\ocgxii@newkey{ocgx2.oldlnkcol.15}{}
\ocgxii@newkey{ocgx2.oldstack.15}{}
\ocgxii@ocg@stack@on@page{15}{98 0 R}
\pbs@seq@push@cx{pbs@props@15}{/rm@oc416 98 0 R}
\ocgxii@lnkcol@stack@on@page{15}{{linkcolour}}
\ocgxii@lnkcol@stack@on@page{15}{}
\pbs@seq@push@cx{pbs@props@15}{/rm@oc417 32 0 R}
\pbs@seq@push@cx{pbs@props@15}{/rm@oc418 31 0 R}
\ocgxii@lnkcol@stack@on@page{15}{{linkcolour}}
\ocgxii@lnkcol@stack@on@page{15}{}
\pbs@seq@push@cx{pbs@props@15}{/rm@oc419 32 0 R}
\pbs@seq@push@cx{pbs@props@15}{/rm@oc420 31 0 R}
\ocgxii@lnkcol@stack@on@page{15}{{linkcolour}}
\ocgxii@lnkcol@stack@on@page{15}{}
\pbs@seq@push@cx{pbs@props@15}{/rm@oc421 32 0 R}
\pbs@seq@push@cx{pbs@props@15}{/rm@oc422 31 0 R}
\ocgxii@lnkcol@stack@on@page{15}{{linkcolour}}
\ocgxii@lnkcol@stack@on@page{15}{}
\pbs@seq@push@cx{pbs@props@15}{/rm@oc423 32 0 R}
\pbs@seq@push@cx{pbs@props@15}{/rm@oc424 31 0 R}
\ocgxii@lnkcol@stack@on@page{15}{{linkcolour}}
\ocgxii@lnkcol@stack@on@page{15}{}
\pbs@seq@push@cx{pbs@props@15}{/rm@oc425 32 0 R}
\pbs@seq@push@cx{pbs@props@15}{/rm@oc426 31 0 R}
\ocgxii@lnkcol@stack@on@page{15}{{linkcolour}}
\ocgxii@lnkcol@stack@on@page{15}{}
\pbs@seq@push@cx{pbs@props@15}{/rm@oc427 32 0 R}
\pbs@seq@push@cx{pbs@props@15}{/rm@oc428 31 0 R}
\ocgxii@lnkcol@stack@on@page{15}{{linkcolour}}
\ocgxii@lnkcol@stack@on@page{15}{}
\pbs@seq@push@cx{pbs@props@15}{/rm@oc429 32 0 R}
\pbs@seq@push@cx{pbs@props@15}{/rm@oc430 31 0 R}
\ocgxii@ocg@stack@on@page{15}{}
\ocgxii@ocg@stack@on@page{15}{98 0 R}
\pbs@seq@push@cx{pbs@props@15}{/rm@oc431 98 0 R}
\ocgxii@lnkcol@stack@on@page{15}{{linkcolour}}
\ocgxii@lnkcol@stack@on@page{15}{}
\pbs@seq@push@cx{pbs@props@15}{/rm@oc432 32 0 R}
\pbs@seq@push@cx{pbs@props@15}{/rm@oc433 31 0 R}
\ocgxii@lnkcol@stack@on@page{15}{{linkcolour}}
\ocgxii@lnkcol@stack@on@page{15}{}
\pbs@seq@push@cx{pbs@props@15}{/rm@oc434 32 0 R}
\pbs@seq@push@cx{pbs@props@15}{/rm@oc435 31 0 R}
\ocgxii@lnkcol@stack@on@page{15}{{linkcolour}}
\ocgxii@lnkcol@stack@on@page{15}{}
\pbs@seq@push@cx{pbs@props@15}{/rm@oc436 32 0 R}
\pbs@seq@push@cx{pbs@props@15}{/rm@oc437 31 0 R}
\ocgxii@lnkcol@stack@on@page{15}{{linkcolour}}
\ocgxii@lnkcol@stack@on@page{15}{}
\pbs@seq@push@cx{pbs@props@15}{/rm@oc438 32 0 R}
\pbs@seq@push@cx{pbs@props@15}{/rm@oc439 31 0 R}
\ocgxii@lnkcol@stack@on@page{15}{{linkcolour}}
\ocgxii@lnkcol@stack@on@page{15}{}
\pbs@seq@push@cx{pbs@props@15}{/rm@oc440 32 0 R}
\pbs@seq@push@cx{pbs@props@15}{/rm@oc441 31 0 R}
\ocgxii@lnkcol@stack@on@page{15}{{linkcolour}}
\ocgxii@lnkcol@stack@on@page{15}{}
\pbs@seq@push@cx{pbs@props@15}{/rm@oc442 32 0 R}
\pbs@seq@push@cx{pbs@props@15}{/rm@oc443 31 0 R}
\ocgxii@ocg@stack@on@page{15}{}
\ocgxii@newkey{ocgx2.oldlnkcol.16}{}
\ocgxii@newkey{ocgx2.oldstack.16}{}
\ocgxii@ocg@stack@on@page{16}{98 0 R}
\pbs@seq@push@cx{pbs@props@16}{/rm@oc444 98 0 R}
\ocgxii@lnkcol@stack@on@page{16}{{linkcolour}}
\ocgxii@lnkcol@stack@on@page{16}{}
\pbs@seq@push@cx{pbs@props@16}{/rm@oc445 32 0 R}
\pbs@seq@push@cx{pbs@props@16}{/rm@oc446 31 0 R}
\ocgxii@lnkcol@stack@on@page{16}{{linkcolour}}
\ocgxii@lnkcol@stack@on@page{16}{}
\pbs@seq@push@cx{pbs@props@16}{/rm@oc447 32 0 R}
\pbs@seq@push@cx{pbs@props@16}{/rm@oc448 31 0 R}
\ocgxii@lnkcol@stack@on@page{16}{{linkcolour}}
\ocgxii@lnkcol@stack@on@page{16}{}
\pbs@seq@push@cx{pbs@props@16}{/rm@oc449 32 0 R}
\pbs@seq@push@cx{pbs@props@16}{/rm@oc450 31 0 R}
\ocgxii@lnkcol@stack@on@page{16}{{linkcolour}}
\ocgxii@lnkcol@stack@on@page{16}{}
\pbs@seq@push@cx{pbs@props@16}{/rm@oc451 32 0 R}
\pbs@seq@push@cx{pbs@props@16}{/rm@oc452 31 0 R}
\ocgxii@lnkcol@stack@on@page{16}{{linkcolour}}
\ocgxii@lnkcol@stack@on@page{16}{}
\pbs@seq@push@cx{pbs@props@16}{/rm@oc453 32 0 R}
\pbs@seq@push@cx{pbs@props@16}{/rm@oc454 31 0 R}
\ocgxii@lnkcol@stack@on@page{16}{{linkcolour}}
\ocgxii@lnkcol@stack@on@page{16}{}
\pbs@seq@push@cx{pbs@props@16}{/rm@oc455 32 0 R}
\pbs@seq@push@cx{pbs@props@16}{/rm@oc456 31 0 R}
\ocgxii@lnkcol@stack@on@page{16}{{linkcolour}}
\ocgxii@lnkcol@stack@on@page{16}{}
\pbs@seq@push@cx{pbs@props@16}{/rm@oc457 32 0 R}
\pbs@seq@push@cx{pbs@props@16}{/rm@oc458 31 0 R}
\ocgxii@ocg@stack@on@page{16}{}
\ocgxii@ocg@stack@on@page{16}{98 0 R}
\pbs@seq@push@cx{pbs@props@16}{/rm@oc459 98 0 R}
\ocgxii@lnkcol@stack@on@page{16}{{linkcolour}}
\ocgxii@lnkcol@stack@on@page{16}{}
\pbs@seq@push@cx{pbs@props@16}{/rm@oc460 32 0 R}
\pbs@seq@push@cx{pbs@props@16}{/rm@oc461 31 0 R}
\ocgxii@lnkcol@stack@on@page{16}{{linkcolour}}
\ocgxii@lnkcol@stack@on@page{16}{}
\pbs@seq@push@cx{pbs@props@16}{/rm@oc462 32 0 R}
\pbs@seq@push@cx{pbs@props@16}{/rm@oc463 31 0 R}
\ocgxii@lnkcol@stack@on@page{16}{{linkcolour}}
\ocgxii@lnkcol@stack@on@page{16}{}
\pbs@seq@push@cx{pbs@props@16}{/rm@oc464 32 0 R}
\pbs@seq@push@cx{pbs@props@16}{/rm@oc465 31 0 R}
\ocgxii@lnkcol@stack@on@page{16}{{linkcolour}}
\ocgxii@lnkcol@stack@on@page{16}{}
\pbs@seq@push@cx{pbs@props@16}{/rm@oc466 32 0 R}
\pbs@seq@push@cx{pbs@props@16}{/rm@oc467 31 0 R}
\ocgxii@lnkcol@stack@on@page{16}{{linkcolour}}
\ocgxii@lnkcol@stack@on@page{16}{}
\pbs@seq@push@cx{pbs@props@16}{/rm@oc468 32 0 R}
\pbs@seq@push@cx{pbs@props@16}{/rm@oc469 31 0 R}
\ocgxii@lnkcol@stack@on@page{16}{{linkcolour}}
\ocgxii@lnkcol@stack@on@page{16}{}
\pbs@seq@push@cx{pbs@props@16}{/rm@oc470 32 0 R}
\pbs@seq@push@cx{pbs@props@16}{/rm@oc471 31 0 R}
\ocgxii@ocg@stack@on@page{16}{}
\ocgxii@newkey{ocgx2.oldlnkcol.17}{}
\ocgxii@newkey{ocgx2.oldstack.17}{}
\ocgxii@ocg@stack@on@page{17}{98 0 R}
\pbs@seq@push@cx{pbs@props@17}{/rm@oc472 98 0 R}
\ocgxii@lnkcol@stack@on@page{17}{{linkcolour}}
\ocgxii@lnkcol@stack@on@page{17}{}
\pbs@seq@push@cx{pbs@props@17}{/rm@oc473 32 0 R}
\pbs@seq@push@cx{pbs@props@17}{/rm@oc474 31 0 R}
\ocgxii@lnkcol@stack@on@page{17}{{linkcolour}}
\ocgxii@lnkcol@stack@on@page{17}{}
\pbs@seq@push@cx{pbs@props@17}{/rm@oc475 32 0 R}
\pbs@seq@push@cx{pbs@props@17}{/rm@oc476 31 0 R}
\ocgxii@lnkcol@stack@on@page{17}{{linkcolour}}
\ocgxii@lnkcol@stack@on@page{17}{}
\pbs@seq@push@cx{pbs@props@17}{/rm@oc477 32 0 R}
\pbs@seq@push@cx{pbs@props@17}{/rm@oc478 31 0 R}
\ocgxii@lnkcol@stack@on@page{17}{{linkcolour}}
\ocgxii@lnkcol@stack@on@page{17}{}
\pbs@seq@push@cx{pbs@props@17}{/rm@oc479 32 0 R}
\pbs@seq@push@cx{pbs@props@17}{/rm@oc480 31 0 R}
\ocgxii@lnkcol@stack@on@page{17}{{linkcolour}}
\ocgxii@lnkcol@stack@on@page{17}{}
\pbs@seq@push@cx{pbs@props@17}{/rm@oc481 32 0 R}
\pbs@seq@push@cx{pbs@props@17}{/rm@oc482 31 0 R}
\ocgxii@lnkcol@stack@on@page{17}{{linkcolour}}
\ocgxii@lnkcol@stack@on@page{17}{}
\pbs@seq@push@cx{pbs@props@17}{/rm@oc483 32 0 R}
\pbs@seq@push@cx{pbs@props@17}{/rm@oc484 31 0 R}
\ocgxii@lnkcol@stack@on@page{17}{{linkcolour}}
\ocgxii@lnkcol@stack@on@page{17}{}
\pbs@seq@push@cx{pbs@props@17}{/rm@oc485 32 0 R}
\pbs@seq@push@cx{pbs@props@17}{/rm@oc486 31 0 R}
\ocgxii@ocg@stack@on@page{17}{}
\ocgxii@ocg@stack@on@page{17}{98 0 R}
\pbs@seq@push@cx{pbs@props@17}{/rm@oc487 98 0 R}
\ocgxii@lnkcol@stack@on@page{17}{{linkcolour}}
\ocgxii@lnkcol@stack@on@page{17}{}
\pbs@seq@push@cx{pbs@props@17}{/rm@oc488 32 0 R}
\pbs@seq@push@cx{pbs@props@17}{/rm@oc489 31 0 R}
\ocgxii@lnkcol@stack@on@page{17}{{linkcolour}}
\ocgxii@lnkcol@stack@on@page{17}{}
\pbs@seq@push@cx{pbs@props@17}{/rm@oc490 32 0 R}
\pbs@seq@push@cx{pbs@props@17}{/rm@oc491 31 0 R}
\ocgxii@lnkcol@stack@on@page{17}{{linkcolour}}
\ocgxii@lnkcol@stack@on@page{17}{}
\pbs@seq@push@cx{pbs@props@17}{/rm@oc492 32 0 R}
\pbs@seq@push@cx{pbs@props@17}{/rm@oc493 31 0 R}
\ocgxii@lnkcol@stack@on@page{17}{{linkcolour}}
\ocgxii@lnkcol@stack@on@page{17}{}
\pbs@seq@push@cx{pbs@props@17}{/rm@oc494 32 0 R}
\pbs@seq@push@cx{pbs@props@17}{/rm@oc495 31 0 R}
\ocgxii@lnkcol@stack@on@page{17}{{linkcolour}}
\ocgxii@lnkcol@stack@on@page{17}{}
\pbs@seq@push@cx{pbs@props@17}{/rm@oc496 32 0 R}
\pbs@seq@push@cx{pbs@props@17}{/rm@oc497 31 0 R}
\ocgxii@lnkcol@stack@on@page{17}{{linkcolour}}
\ocgxii@lnkcol@stack@on@page{17}{}
\pbs@seq@push@cx{pbs@props@17}{/rm@oc498 32 0 R}
\pbs@seq@push@cx{pbs@props@17}{/rm@oc499 31 0 R}
\ocgxii@ocg@stack@on@page{17}{}
\newlabel{TSUnfairWarfare}{{6}{18}{}{DTLrowi.116.1}{}}
\ocgxii@newkey{ocgx2.oldlnkcol.18}{}
\ocgxii@newkey{ocgx2.oldstack.18}{}
\ocgxii@ocg@stack@on@page{18}{98 0 R}
\pbs@seq@push@cx{pbs@props@18}{/rm@oc500 98 0 R}
\ocgxii@lnkcol@stack@on@page{18}{{linkcolour}}
\ocgxii@lnkcol@stack@on@page{18}{}
\pbs@seq@push@cx{pbs@props@18}{/rm@oc501 32 0 R}
\pbs@seq@push@cx{pbs@props@18}{/rm@oc502 31 0 R}
\ocgxii@lnkcol@stack@on@page{18}{{linkcolour}}
\ocgxii@lnkcol@stack@on@page{18}{}
\pbs@seq@push@cx{pbs@props@18}{/rm@oc503 32 0 R}
\pbs@seq@push@cx{pbs@props@18}{/rm@oc504 31 0 R}
\ocgxii@lnkcol@stack@on@page{18}{{linkcolour}}
\ocgxii@lnkcol@stack@on@page{18}{}
\pbs@seq@push@cx{pbs@props@18}{/rm@oc505 32 0 R}
\pbs@seq@push@cx{pbs@props@18}{/rm@oc506 31 0 R}
\ocgxii@lnkcol@stack@on@page{18}{{linkcolour}}
\ocgxii@lnkcol@stack@on@page{18}{}
\pbs@seq@push@cx{pbs@props@18}{/rm@oc507 32 0 R}
\pbs@seq@push@cx{pbs@props@18}{/rm@oc508 31 0 R}
\ocgxii@lnkcol@stack@on@page{18}{{linkcolour}}
\ocgxii@lnkcol@stack@on@page{18}{}
\pbs@seq@push@cx{pbs@props@18}{/rm@oc509 32 0 R}
\pbs@seq@push@cx{pbs@props@18}{/rm@oc510 31 0 R}
\ocgxii@lnkcol@stack@on@page{18}{{linkcolour}}
\ocgxii@lnkcol@stack@on@page{18}{}
\pbs@seq@push@cx{pbs@props@18}{/rm@oc511 32 0 R}
\pbs@seq@push@cx{pbs@props@18}{/rm@oc512 31 0 R}
\ocgxii@lnkcol@stack@on@page{18}{{linkcolour}}
\ocgxii@lnkcol@stack@on@page{18}{}
\pbs@seq@push@cx{pbs@props@18}{/rm@oc513 32 0 R}
\pbs@seq@push@cx{pbs@props@18}{/rm@oc514 31 0 R}
\ocgxii@ocg@stack@on@page{18}{}
\ocgxii@ocg@stack@on@page{18}{98 0 R}
\pbs@seq@push@cx{pbs@props@18}{/rm@oc515 98 0 R}
\ocgxii@lnkcol@stack@on@page{18}{{linkcolour}}
\ocgxii@lnkcol@stack@on@page{18}{}
\pbs@seq@push@cx{pbs@props@18}{/rm@oc516 32 0 R}
\pbs@seq@push@cx{pbs@props@18}{/rm@oc517 31 0 R}
\ocgxii@lnkcol@stack@on@page{18}{{linkcolour}}
\ocgxii@lnkcol@stack@on@page{18}{}
\pbs@seq@push@cx{pbs@props@18}{/rm@oc518 32 0 R}
\pbs@seq@push@cx{pbs@props@18}{/rm@oc519 31 0 R}
\ocgxii@lnkcol@stack@on@page{18}{{linkcolour}}
\ocgxii@lnkcol@stack@on@page{18}{}
\pbs@seq@push@cx{pbs@props@18}{/rm@oc520 32 0 R}
\pbs@seq@push@cx{pbs@props@18}{/rm@oc521 31 0 R}
\ocgxii@lnkcol@stack@on@page{18}{{linkcolour}}
\ocgxii@lnkcol@stack@on@page{18}{}
\pbs@seq@push@cx{pbs@props@18}{/rm@oc522 32 0 R}
\pbs@seq@push@cx{pbs@props@18}{/rm@oc523 31 0 R}
\ocgxii@lnkcol@stack@on@page{18}{{linkcolour}}
\ocgxii@lnkcol@stack@on@page{18}{}
\pbs@seq@push@cx{pbs@props@18}{/rm@oc524 32 0 R}
\pbs@seq@push@cx{pbs@props@18}{/rm@oc525 31 0 R}
\ocgxii@lnkcol@stack@on@page{18}{{linkcolour}}
\ocgxii@lnkcol@stack@on@page{18}{}
\pbs@seq@push@cx{pbs@props@18}{/rm@oc526 32 0 R}
\pbs@seq@push@cx{pbs@props@18}{/rm@oc527 31 0 R}
\ocgxii@ocg@stack@on@page{18}{}
\ocgxii@newkey{ocgx2.oldlnkcol.19}{}
\ocgxii@newkey{ocgx2.oldstack.19}{}
\ocgxii@ocg@stack@on@page{19}{98 0 R}
\pbs@seq@push@cx{pbs@props@19}{/rm@oc528 98 0 R}
\ocgxii@lnkcol@stack@on@page{19}{{linkcolour}}
\ocgxii@lnkcol@stack@on@page{19}{}
\pbs@seq@push@cx{pbs@props@19}{/rm@oc529 32 0 R}
\pbs@seq@push@cx{pbs@props@19}{/rm@oc530 31 0 R}
\ocgxii@lnkcol@stack@on@page{19}{{linkcolour}}
\ocgxii@lnkcol@stack@on@page{19}{}
\pbs@seq@push@cx{pbs@props@19}{/rm@oc531 32 0 R}
\pbs@seq@push@cx{pbs@props@19}{/rm@oc532 31 0 R}
\ocgxii@lnkcol@stack@on@page{19}{{linkcolour}}
\ocgxii@lnkcol@stack@on@page{19}{}
\pbs@seq@push@cx{pbs@props@19}{/rm@oc533 32 0 R}
\pbs@seq@push@cx{pbs@props@19}{/rm@oc534 31 0 R}
\ocgxii@lnkcol@stack@on@page{19}{{linkcolour}}
\ocgxii@lnkcol@stack@on@page{19}{}
\pbs@seq@push@cx{pbs@props@19}{/rm@oc535 32 0 R}
\pbs@seq@push@cx{pbs@props@19}{/rm@oc536 31 0 R}
\ocgxii@lnkcol@stack@on@page{19}{{linkcolour}}
\ocgxii@lnkcol@stack@on@page{19}{}
\pbs@seq@push@cx{pbs@props@19}{/rm@oc537 32 0 R}
\pbs@seq@push@cx{pbs@props@19}{/rm@oc538 31 0 R}
\ocgxii@lnkcol@stack@on@page{19}{{linkcolour}}
\ocgxii@lnkcol@stack@on@page{19}{}
\pbs@seq@push@cx{pbs@props@19}{/rm@oc539 32 0 R}
\pbs@seq@push@cx{pbs@props@19}{/rm@oc540 31 0 R}
\ocgxii@lnkcol@stack@on@page{19}{{linkcolour}}
\ocgxii@lnkcol@stack@on@page{19}{}
\pbs@seq@push@cx{pbs@props@19}{/rm@oc541 32 0 R}
\pbs@seq@push@cx{pbs@props@19}{/rm@oc542 31 0 R}
\ocgxii@ocg@stack@on@page{19}{}
\ocgxii@ocg@stack@on@page{19}{98 0 R}
\pbs@seq@push@cx{pbs@props@19}{/rm@oc543 98 0 R}
\ocgxii@lnkcol@stack@on@page{19}{{linkcolour}}
\ocgxii@lnkcol@stack@on@page{19}{}
\pbs@seq@push@cx{pbs@props@19}{/rm@oc544 32 0 R}
\pbs@seq@push@cx{pbs@props@19}{/rm@oc545 31 0 R}
\ocgxii@lnkcol@stack@on@page{19}{{linkcolour}}
\ocgxii@lnkcol@stack@on@page{19}{}
\pbs@seq@push@cx{pbs@props@19}{/rm@oc546 32 0 R}
\pbs@seq@push@cx{pbs@props@19}{/rm@oc547 31 0 R}
\ocgxii@lnkcol@stack@on@page{19}{{linkcolour}}
\ocgxii@lnkcol@stack@on@page{19}{}
\pbs@seq@push@cx{pbs@props@19}{/rm@oc548 32 0 R}
\pbs@seq@push@cx{pbs@props@19}{/rm@oc549 31 0 R}
\ocgxii@lnkcol@stack@on@page{19}{{linkcolour}}
\ocgxii@lnkcol@stack@on@page{19}{}
\pbs@seq@push@cx{pbs@props@19}{/rm@oc550 32 0 R}
\pbs@seq@push@cx{pbs@props@19}{/rm@oc551 31 0 R}
\ocgxii@lnkcol@stack@on@page{19}{{linkcolour}}
\ocgxii@lnkcol@stack@on@page{19}{}
\pbs@seq@push@cx{pbs@props@19}{/rm@oc552 32 0 R}
\pbs@seq@push@cx{pbs@props@19}{/rm@oc553 31 0 R}
\ocgxii@lnkcol@stack@on@page{19}{{linkcolour}}
\ocgxii@lnkcol@stack@on@page{19}{}
\pbs@seq@push@cx{pbs@props@19}{/rm@oc554 32 0 R}
\pbs@seq@push@cx{pbs@props@19}{/rm@oc555 31 0 R}
\ocgxii@ocg@stack@on@page{19}{}
\ocgxii@newkey{ocgx2.oldlnkcol.20}{}
\ocgxii@newkey{ocgx2.oldstack.20}{}
\ocgxii@ocg@stack@on@page{20}{98 0 R}
\pbs@seq@push@cx{pbs@props@20}{/rm@oc556 98 0 R}
\ocgxii@lnkcol@stack@on@page{20}{{linkcolour}}
\ocgxii@lnkcol@stack@on@page{20}{}
\pbs@seq@push@cx{pbs@props@20}{/rm@oc557 32 0 R}
\pbs@seq@push@cx{pbs@props@20}{/rm@oc558 31 0 R}
\ocgxii@lnkcol@stack@on@page{20}{{linkcolour}}
\ocgxii@lnkcol@stack@on@page{20}{}
\pbs@seq@push@cx{pbs@props@20}{/rm@oc559 32 0 R}
\pbs@seq@push@cx{pbs@props@20}{/rm@oc560 31 0 R}
\ocgxii@lnkcol@stack@on@page{20}{{linkcolour}}
\ocgxii@lnkcol@stack@on@page{20}{}
\pbs@seq@push@cx{pbs@props@20}{/rm@oc561 32 0 R}
\pbs@seq@push@cx{pbs@props@20}{/rm@oc562 31 0 R}
\ocgxii@lnkcol@stack@on@page{20}{{linkcolour}}
\ocgxii@lnkcol@stack@on@page{20}{}
\pbs@seq@push@cx{pbs@props@20}{/rm@oc563 32 0 R}
\pbs@seq@push@cx{pbs@props@20}{/rm@oc564 31 0 R}
\ocgxii@lnkcol@stack@on@page{20}{{linkcolour}}
\ocgxii@lnkcol@stack@on@page{20}{}
\pbs@seq@push@cx{pbs@props@20}{/rm@oc565 32 0 R}
\pbs@seq@push@cx{pbs@props@20}{/rm@oc566 31 0 R}
\ocgxii@lnkcol@stack@on@page{20}{{linkcolour}}
\ocgxii@lnkcol@stack@on@page{20}{}
\pbs@seq@push@cx{pbs@props@20}{/rm@oc567 32 0 R}
\pbs@seq@push@cx{pbs@props@20}{/rm@oc568 31 0 R}
\ocgxii@lnkcol@stack@on@page{20}{{linkcolour}}
\ocgxii@lnkcol@stack@on@page{20}{}
\pbs@seq@push@cx{pbs@props@20}{/rm@oc569 32 0 R}
\pbs@seq@push@cx{pbs@props@20}{/rm@oc570 31 0 R}
\ocgxii@ocg@stack@on@page{20}{}
\ocgxii@ocg@stack@on@page{20}{98 0 R}
\pbs@seq@push@cx{pbs@props@20}{/rm@oc571 98 0 R}
\ocgxii@lnkcol@stack@on@page{20}{{linkcolour}}
\ocgxii@lnkcol@stack@on@page{20}{}
\pbs@seq@push@cx{pbs@props@20}{/rm@oc572 32 0 R}
\pbs@seq@push@cx{pbs@props@20}{/rm@oc573 31 0 R}
\ocgxii@lnkcol@stack@on@page{20}{{linkcolour}}
\ocgxii@lnkcol@stack@on@page{20}{}
\pbs@seq@push@cx{pbs@props@20}{/rm@oc574 32 0 R}
\pbs@seq@push@cx{pbs@props@20}{/rm@oc575 31 0 R}
\ocgxii@lnkcol@stack@on@page{20}{{linkcolour}}
\ocgxii@lnkcol@stack@on@page{20}{}
\pbs@seq@push@cx{pbs@props@20}{/rm@oc576 32 0 R}
\pbs@seq@push@cx{pbs@props@20}{/rm@oc577 31 0 R}
\ocgxii@lnkcol@stack@on@page{20}{{linkcolour}}
\ocgxii@lnkcol@stack@on@page{20}{}
\pbs@seq@push@cx{pbs@props@20}{/rm@oc578 32 0 R}
\pbs@seq@push@cx{pbs@props@20}{/rm@oc579 31 0 R}
\ocgxii@lnkcol@stack@on@page{20}{{linkcolour}}
\ocgxii@lnkcol@stack@on@page{20}{}
\pbs@seq@push@cx{pbs@props@20}{/rm@oc580 32 0 R}
\pbs@seq@push@cx{pbs@props@20}{/rm@oc581 31 0 R}
\ocgxii@lnkcol@stack@on@page{20}{{linkcolour}}
\ocgxii@lnkcol@stack@on@page{20}{}
\pbs@seq@push@cx{pbs@props@20}{/rm@oc582 32 0 R}
\pbs@seq@push@cx{pbs@props@20}{/rm@oc583 31 0 R}
\ocgxii@ocg@stack@on@page{20}{}
\@writefile{toc}{\contentsline {section}{\numberline {7}Quick Reference Sheet}{21}{section.7}\protected@file@percent }
\newlabel{TSQRS}{{7}{21}{\quickrefsheet }{section.7}{}}
\@writefile{toc}{\contentsline {subsubsection}{\numberline {7.0.1}Characters}{21}{subsubsection.7.0.1}\protected@file@percent }
\ocgxii@lnkcol@stack@on@page{21}{{linkcolour}}
\ocgxii@lnkcol@stack@on@page{21}{}
\pbs@seq@push@cx{pbs@props@21}{/rm@oc584 32 0 R}
\pbs@seq@push@cx{pbs@props@21}{/rm@oc585 31 0 R}
\ocgxii@lnkcol@stack@on@page{21}{{linkcolour}}
\ocgxii@lnkcol@stack@on@page{21}{}
\pbs@seq@push@cx{pbs@props@21}{/rm@oc586 32 0 R}
\pbs@seq@push@cx{pbs@props@21}{/rm@oc587 31 0 R}
\ocgxii@lnkcol@stack@on@page{21}{{linkcolour}}
\ocgxii@lnkcol@stack@on@page{21}{}
\pbs@seq@push@cx{pbs@props@21}{/rm@oc588 32 0 R}
\pbs@seq@push@cx{pbs@props@21}{/rm@oc589 31 0 R}
\ocgxii@lnkcol@stack@on@page{21}{{linkcolour}}
\ocgxii@lnkcol@stack@on@page{21}{}
\pbs@seq@push@cx{pbs@props@21}{/rm@oc590 32 0 R}
\pbs@seq@push@cx{pbs@props@21}{/rm@oc591 31 0 R}
\ocgxii@lnkcol@stack@on@page{21}{{linkcolour}}
\ocgxii@lnkcol@stack@on@page{21}{}
\pbs@seq@push@cx{pbs@props@21}{/rm@oc592 32 0 R}
\pbs@seq@push@cx{pbs@props@21}{/rm@oc593 31 0 R}
\ocgxii@lnkcol@stack@on@page{21}{{linkcolour}}
\ocgxii@lnkcol@stack@on@page{21}{}
\pbs@seq@push@cx{pbs@props@21}{/rm@oc594 32 0 R}
\pbs@seq@push@cx{pbs@props@21}{/rm@oc595 31 0 R}
\@writefile{toc}{\contentsline {subsubsection}{\numberline {7.0.2}Character Mounts}{21}{subsubsection.7.0.2}\protected@file@percent }
\ocgxii@lnkcol@stack@on@page{21}{{linkcolour}}
\ocgxii@lnkcol@stack@on@page{21}{}
\pbs@seq@push@cx{pbs@props@21}{/rm@oc596 32 0 R}
\pbs@seq@push@cx{pbs@props@21}{/rm@oc597 31 0 R}
\ocgxii@lnkcol@stack@on@page{21}{{linkcolour}}
\ocgxii@lnkcol@stack@on@page{21}{}
\pbs@seq@push@cx{pbs@props@21}{/rm@oc598 32 0 R}
\pbs@seq@push@cx{pbs@props@21}{/rm@oc599 31 0 R}
\ocgxii@lnkcol@stack@on@page{21}{{linkcolour}}
\ocgxii@lnkcol@stack@on@page{21}{}
\pbs@seq@push@cx{pbs@props@21}{/rm@oc600 32 0 R}
\pbs@seq@push@cx{pbs@props@21}{/rm@oc601 31 0 R}
\ocgxii@lnkcol@stack@on@page{21}{{linkcolour}}
\ocgxii@lnkcol@stack@on@page{21}{}
\pbs@seq@push@cx{pbs@props@21}{/rm@oc602 32 0 R}
\pbs@seq@push@cx{pbs@props@21}{/rm@oc603 31 0 R}
\@writefile{toc}{\contentsline {subsubsection}{\numberline {7.0.3}Retinue}{21}{subsubsection.7.0.3}\protected@file@percent }
\ocgxii@lnkcol@stack@on@page{21}{{linkcolour}}
\ocgxii@lnkcol@stack@on@page{21}{}
\pbs@seq@push@cx{pbs@props@21}{/rm@oc604 32 0 R}
\pbs@seq@push@cx{pbs@props@21}{/rm@oc605 31 0 R}
\@writefile{toc}{\contentsline {subsubsection}{\numberline {7.0.4}Core}{21}{subsubsection.7.0.4}\protected@file@percent }
\ocgxii@lnkcol@stack@on@page{21}{{linkcolour}}
\ocgxii@lnkcol@stack@on@page{21}{}
\pbs@seq@push@cx{pbs@props@21}{/rm@oc606 32 0 R}
\pbs@seq@push@cx{pbs@props@21}{/rm@oc607 31 0 R}
\ocgxii@lnkcol@stack@on@page{21}{{linkcolour}}
\ocgxii@lnkcol@stack@on@page{21}{}
\pbs@seq@push@cx{pbs@props@21}{/rm@oc608 32 0 R}
\pbs@seq@push@cx{pbs@props@21}{/rm@oc609 31 0 R}
\ocgxii@newkey{ocgx2.oldlnkcol.21}{}
\ocgxii@newkey{ocgx2.oldstack.21}{}
\ocgxii@ocg@stack@on@page{21}{98 0 R}
\pbs@seq@push@cx{pbs@props@21}{/rm@oc612 98 0 R}
\ocgxii@lnkcol@stack@on@page{21}{{linkcolour}}
\ocgxii@lnkcol@stack@on@page{21}{}
\pbs@seq@push@cx{pbs@props@21}{/rm@oc613 32 0 R}
\pbs@seq@push@cx{pbs@props@21}{/rm@oc614 31 0 R}
\ocgxii@lnkcol@stack@on@page{21}{{linkcolour}}
\ocgxii@lnkcol@stack@on@page{21}{}
\pbs@seq@push@cx{pbs@props@21}{/rm@oc615 32 0 R}
\pbs@seq@push@cx{pbs@props@21}{/rm@oc616 31 0 R}
\ocgxii@lnkcol@stack@on@page{21}{{linkcolour}}
\ocgxii@lnkcol@stack@on@page{21}{}
\pbs@seq@push@cx{pbs@props@21}{/rm@oc617 32 0 R}
\pbs@seq@push@cx{pbs@props@21}{/rm@oc618 31 0 R}
\ocgxii@lnkcol@stack@on@page{21}{{linkcolour}}
\ocgxii@lnkcol@stack@on@page{21}{}
\pbs@seq@push@cx{pbs@props@21}{/rm@oc619 32 0 R}
\pbs@seq@push@cx{pbs@props@21}{/rm@oc620 31 0 R}
\ocgxii@lnkcol@stack@on@page{21}{{linkcolour}}
\ocgxii@lnkcol@stack@on@page{21}{}
\pbs@seq@push@cx{pbs@props@21}{/rm@oc621 32 0 R}
\pbs@seq@push@cx{pbs@props@21}{/rm@oc622 31 0 R}
\ocgxii@lnkcol@stack@on@page{21}{{linkcolour}}
\ocgxii@lnkcol@stack@on@page{21}{}
\pbs@seq@push@cx{pbs@props@21}{/rm@oc623 32 0 R}
\pbs@seq@push@cx{pbs@props@21}{/rm@oc624 31 0 R}
\ocgxii@lnkcol@stack@on@page{21}{{linkcolour}}
\ocgxii@lnkcol@stack@on@page{21}{}
\pbs@seq@push@cx{pbs@props@21}{/rm@oc625 32 0 R}
\pbs@seq@push@cx{pbs@props@21}{/rm@oc626 31 0 R}
\ocgxii@ocg@stack@on@page{21}{}
\ocgxii@ocg@stack@on@page{21}{98 0 R}
\pbs@seq@push@cx{pbs@props@21}{/rm@oc627 98 0 R}
\ocgxii@lnkcol@stack@on@page{21}{{linkcolour}}
\ocgxii@lnkcol@stack@on@page{21}{}
\pbs@seq@push@cx{pbs@props@21}{/rm@oc628 32 0 R}
\pbs@seq@push@cx{pbs@props@21}{/rm@oc629 31 0 R}
\ocgxii@lnkcol@stack@on@page{21}{{linkcolour}}
\ocgxii@lnkcol@stack@on@page{21}{}
\pbs@seq@push@cx{pbs@props@21}{/rm@oc630 32 0 R}
\pbs@seq@push@cx{pbs@props@21}{/rm@oc631 31 0 R}
\ocgxii@lnkcol@stack@on@page{21}{{linkcolour}}
\ocgxii@lnkcol@stack@on@page{21}{}
\pbs@seq@push@cx{pbs@props@21}{/rm@oc632 32 0 R}
\pbs@seq@push@cx{pbs@props@21}{/rm@oc633 31 0 R}
\ocgxii@lnkcol@stack@on@page{21}{{linkcolour}}
\ocgxii@lnkcol@stack@on@page{21}{}
\pbs@seq@push@cx{pbs@props@21}{/rm@oc634 32 0 R}
\pbs@seq@push@cx{pbs@props@21}{/rm@oc635 31 0 R}
\ocgxii@lnkcol@stack@on@page{21}{{linkcolour}}
\ocgxii@lnkcol@stack@on@page{21}{}
\pbs@seq@push@cx{pbs@props@21}{/rm@oc636 32 0 R}
\pbs@seq@push@cx{pbs@props@21}{/rm@oc637 31 0 R}
\ocgxii@lnkcol@stack@on@page{21}{{linkcolour}}
\ocgxii@lnkcol@stack@on@page{21}{}
\pbs@seq@push@cx{pbs@props@21}{/rm@oc638 32 0 R}
\pbs@seq@push@cx{pbs@props@21}{/rm@oc639 31 0 R}
\ocgxii@ocg@stack@on@page{21}{}
\ocgxii@lnkcol@stack@on@page{22}{{linkcolour}}
\ocgxii@lnkcol@stack@on@page{22}{}
\pbs@seq@push@cx{pbs@props@22}{/rm@oc610 32 0 R}
\pbs@seq@push@cx{pbs@props@22}{/rm@oc611 31 0 R}
\@writefile{toc}{\contentsline {subsubsection}{\numberline {7.0.5}Special}{22}{subsubsection.7.0.5}\protected@file@percent }
\ocgxii@lnkcol@stack@on@page{22}{{linkcolour}}
\ocgxii@lnkcol@stack@on@page{22}{}
\pbs@seq@push@cx{pbs@props@22}{/rm@oc640 32 0 R}
\pbs@seq@push@cx{pbs@props@22}{/rm@oc641 31 0 R}
\ocgxii@lnkcol@stack@on@page{22}{{linkcolour}}
\ocgxii@lnkcol@stack@on@page{22}{}
\pbs@seq@push@cx{pbs@props@22}{/rm@oc642 32 0 R}
\pbs@seq@push@cx{pbs@props@22}{/rm@oc643 31 0 R}
\ocgxii@lnkcol@stack@on@page{22}{{linkcolour}}
\ocgxii@lnkcol@stack@on@page{22}{}
\pbs@seq@push@cx{pbs@props@22}{/rm@oc644 32 0 R}
\pbs@seq@push@cx{pbs@props@22}{/rm@oc645 31 0 R}
\ocgxii@lnkcol@stack@on@page{22}{{linkcolour}}
\ocgxii@lnkcol@stack@on@page{22}{}
\pbs@seq@push@cx{pbs@props@22}{/rm@oc646 32 0 R}
\pbs@seq@push@cx{pbs@props@22}{/rm@oc647 31 0 R}
\ocgxii@lnkcol@stack@on@page{22}{{linkcolour}}
\ocgxii@lnkcol@stack@on@page{22}{}
\pbs@seq@push@cx{pbs@props@22}{/rm@oc648 32 0 R}
\pbs@seq@push@cx{pbs@props@22}{/rm@oc649 31 0 R}
\ocgxii@lnkcol@stack@on@page{22}{{linkcolour}}
\ocgxii@lnkcol@stack@on@page{22}{}
\pbs@seq@push@cx{pbs@props@22}{/rm@oc650 32 0 R}
\pbs@seq@push@cx{pbs@props@22}{/rm@oc651 31 0 R}
\ocgxii@lnkcol@stack@on@page{22}{{linkcolour}}
\ocgxii@lnkcol@stack@on@page{22}{}
\pbs@seq@push@cx{pbs@props@22}{/rm@oc652 32 0 R}
\pbs@seq@push@cx{pbs@props@22}{/rm@oc653 31 0 R}
\ocgxii@lnkcol@stack@on@page{22}{{linkcolour}}
\ocgxii@lnkcol@stack@on@page{22}{}
\pbs@seq@push@cx{pbs@props@22}{/rm@oc654 32 0 R}
\pbs@seq@push@cx{pbs@props@22}{/rm@oc655 31 0 R}
\ocgxii@lnkcol@stack@on@page{22}{{linkcolour}}
\ocgxii@lnkcol@stack@on@page{22}{}
\pbs@seq@push@cx{pbs@props@22}{/rm@oc656 32 0 R}
\pbs@seq@push@cx{pbs@props@22}{/rm@oc657 31 0 R}
\@writefile{toc}{\contentsline {subsubsection}{\numberline {7.0.6}Unfair Warfare}{22}{subsubsection.7.0.6}\protected@file@percent }
\ocgxii@lnkcol@stack@on@page{22}{{linkcolour}}
\ocgxii@lnkcol@stack@on@page{22}{}
\pbs@seq@push@cx{pbs@props@22}{/rm@oc658 32 0 R}
\pbs@seq@push@cx{pbs@props@22}{/rm@oc659 31 0 R}
\ocgxii@lnkcol@stack@on@page{22}{{linkcolour}}
\ocgxii@lnkcol@stack@on@page{22}{}
\pbs@seq@push@cx{pbs@props@22}{/rm@oc660 32 0 R}
\pbs@seq@push@cx{pbs@props@22}{/rm@oc661 31 0 R}
\ocgxii@lnkcol@stack@on@page{22}{{linkcolour}}
\ocgxii@lnkcol@stack@on@page{22}{}
\pbs@seq@push@cx{pbs@props@22}{/rm@oc662 32 0 R}
\pbs@seq@push@cx{pbs@props@22}{/rm@oc663 31 0 R}
\ocgxii@lnkcol@stack@on@page{22}{{linkcolour}}
\ocgxii@lnkcol@stack@on@page{22}{}
\pbs@seq@push@cx{pbs@props@22}{/rm@oc664 32 0 R}
\pbs@seq@push@cx{pbs@props@22}{/rm@oc665 31 0 R}
\ocgxii@lnkcol@stack@on@page{22}{{linkcolour}}
\ocgxii@lnkcol@stack@on@page{22}{}
\pbs@seq@push@cx{pbs@props@22}{/rm@oc666 32 0 R}
\pbs@seq@push@cx{pbs@props@22}{/rm@oc667 31 0 R}
\ocgxii@newkey{ocgx2.oldlnkcol.22}{}
\ocgxii@newkey{ocgx2.oldstack.22}{}
\ocgxii@ocg@stack@on@page{22}{98 0 R}
\pbs@seq@push@cx{pbs@props@22}{/rm@oc668 98 0 R}
\ocgxii@lnkcol@stack@on@page{22}{{linkcolour}}
\ocgxii@lnkcol@stack@on@page{22}{}
\pbs@seq@push@cx{pbs@props@22}{/rm@oc669 32 0 R}
\pbs@seq@push@cx{pbs@props@22}{/rm@oc670 31 0 R}
\ocgxii@lnkcol@stack@on@page{22}{{linkcolour}}
\ocgxii@lnkcol@stack@on@page{22}{}
\pbs@seq@push@cx{pbs@props@22}{/rm@oc671 32 0 R}
\pbs@seq@push@cx{pbs@props@22}{/rm@oc672 31 0 R}
\ocgxii@lnkcol@stack@on@page{22}{{linkcolour}}
\ocgxii@lnkcol@stack@on@page{22}{}
\pbs@seq@push@cx{pbs@props@22}{/rm@oc673 32 0 R}
\pbs@seq@push@cx{pbs@props@22}{/rm@oc674 31 0 R}
\ocgxii@lnkcol@stack@on@page{22}{{linkcolour}}
\ocgxii@lnkcol@stack@on@page{22}{}
\pbs@seq@push@cx{pbs@props@22}{/rm@oc675 32 0 R}
\pbs@seq@push@cx{pbs@props@22}{/rm@oc676 31 0 R}
\ocgxii@lnkcol@stack@on@page{22}{{linkcolour}}
\ocgxii@lnkcol@stack@on@page{22}{}
\pbs@seq@push@cx{pbs@props@22}{/rm@oc677 32 0 R}
\pbs@seq@push@cx{pbs@props@22}{/rm@oc678 31 0 R}
\ocgxii@lnkcol@stack@on@page{22}{{linkcolour}}
\ocgxii@lnkcol@stack@on@page{22}{}
\pbs@seq@push@cx{pbs@props@22}{/rm@oc679 32 0 R}
\pbs@seq@push@cx{pbs@props@22}{/rm@oc680 31 0 R}
\ocgxii@lnkcol@stack@on@page{22}{{linkcolour}}
\ocgxii@lnkcol@stack@on@page{22}{}
\pbs@seq@push@cx{pbs@props@22}{/rm@oc681 32 0 R}
\pbs@seq@push@cx{pbs@props@22}{/rm@oc682 31 0 R}
\ocgxii@ocg@stack@on@page{22}{}
\ocgxii@ocg@stack@on@page{22}{98 0 R}
\pbs@seq@push@cx{pbs@props@22}{/rm@oc683 98 0 R}
\ocgxii@lnkcol@stack@on@page{22}{{linkcolour}}
\ocgxii@lnkcol@stack@on@page{22}{}
\pbs@seq@push@cx{pbs@props@22}{/rm@oc684 32 0 R}
\pbs@seq@push@cx{pbs@props@22}{/rm@oc685 31 0 R}
\ocgxii@lnkcol@stack@on@page{22}{{linkcolour}}
\ocgxii@lnkcol@stack@on@page{22}{}
\pbs@seq@push@cx{pbs@props@22}{/rm@oc686 32 0 R}
\pbs@seq@push@cx{pbs@props@22}{/rm@oc687 31 0 R}
\ocgxii@lnkcol@stack@on@page{22}{{linkcolour}}
\ocgxii@lnkcol@stack@on@page{22}{}
\pbs@seq@push@cx{pbs@props@22}{/rm@oc688 32 0 R}
\pbs@seq@push@cx{pbs@props@22}{/rm@oc689 31 0 R}
\ocgxii@lnkcol@stack@on@page{22}{{linkcolour}}
\ocgxii@lnkcol@stack@on@page{22}{}
\pbs@seq@push@cx{pbs@props@22}{/rm@oc690 32 0 R}
\pbs@seq@push@cx{pbs@props@22}{/rm@oc691 31 0 R}
\ocgxii@lnkcol@stack@on@page{22}{{linkcolour}}
\ocgxii@lnkcol@stack@on@page{22}{}
\pbs@seq@push@cx{pbs@props@22}{/rm@oc692 32 0 R}
\pbs@seq@push@cx{pbs@props@22}{/rm@oc693 31 0 R}
\ocgxii@lnkcol@stack@on@page{22}{{linkcolour}}
\ocgxii@lnkcol@stack@on@page{22}{}
\pbs@seq@push@cx{pbs@props@22}{/rm@oc694 32 0 R}
\pbs@seq@push@cx{pbs@props@22}{/rm@oc695 31 0 R}
\ocgxii@ocg@stack@on@page{22}{}
\ocgxii@newkey{ocgx2.oldlnkcol.23}{}
\ocgxii@newkey{ocgx2.oldstack.23}{}
\ocgxii@ocg@stack@on@page{23}{98 0 R}
\pbs@seq@push@cx{pbs@props@23}{/rm@oc696 98 0 R}
\ocgxii@lnkcol@stack@on@page{23}{{linkcolour}}
\ocgxii@lnkcol@stack@on@page{23}{}
\pbs@seq@push@cx{pbs@props@23}{/rm@oc697 32 0 R}
\pbs@seq@push@cx{pbs@props@23}{/rm@oc698 31 0 R}
\ocgxii@lnkcol@stack@on@page{23}{{linkcolour}}
\ocgxii@lnkcol@stack@on@page{23}{}
\pbs@seq@push@cx{pbs@props@23}{/rm@oc699 32 0 R}
\pbs@seq@push@cx{pbs@props@23}{/rm@oc700 31 0 R}
\ocgxii@lnkcol@stack@on@page{23}{{linkcolour}}
\ocgxii@lnkcol@stack@on@page{23}{}
\pbs@seq@push@cx{pbs@props@23}{/rm@oc701 32 0 R}
\pbs@seq@push@cx{pbs@props@23}{/rm@oc702 31 0 R}
\ocgxii@lnkcol@stack@on@page{23}{{linkcolour}}
\ocgxii@lnkcol@stack@on@page{23}{}
\pbs@seq@push@cx{pbs@props@23}{/rm@oc703 32 0 R}
\pbs@seq@push@cx{pbs@props@23}{/rm@oc704 31 0 R}
\ocgxii@lnkcol@stack@on@page{23}{{linkcolour}}
\ocgxii@lnkcol@stack@on@page{23}{}
\pbs@seq@push@cx{pbs@props@23}{/rm@oc705 32 0 R}
\pbs@seq@push@cx{pbs@props@23}{/rm@oc706 31 0 R}
\ocgxii@lnkcol@stack@on@page{23}{{linkcolour}}
\ocgxii@lnkcol@stack@on@page{23}{}
\pbs@seq@push@cx{pbs@props@23}{/rm@oc707 32 0 R}
\pbs@seq@push@cx{pbs@props@23}{/rm@oc708 31 0 R}
\ocgxii@lnkcol@stack@on@page{23}{{linkcolour}}
\ocgxii@lnkcol@stack@on@page{23}{}
\pbs@seq@push@cx{pbs@props@23}{/rm@oc709 32 0 R}
\pbs@seq@push@cx{pbs@props@23}{/rm@oc710 31 0 R}
\ocgxii@ocg@stack@on@page{23}{}
\ocgxii@ocg@stack@on@page{23}{98 0 R}
\pbs@seq@push@cx{pbs@props@23}{/rm@oc711 98 0 R}
\ocgxii@lnkcol@stack@on@page{23}{{linkcolour}}
\ocgxii@lnkcol@stack@on@page{23}{}
\pbs@seq@push@cx{pbs@props@23}{/rm@oc712 32 0 R}
\pbs@seq@push@cx{pbs@props@23}{/rm@oc713 31 0 R}
\ocgxii@lnkcol@stack@on@page{23}{{linkcolour}}
\ocgxii@lnkcol@stack@on@page{23}{}
\pbs@seq@push@cx{pbs@props@23}{/rm@oc714 32 0 R}
\pbs@seq@push@cx{pbs@props@23}{/rm@oc715 31 0 R}
\ocgxii@lnkcol@stack@on@page{23}{{linkcolour}}
\ocgxii@lnkcol@stack@on@page{23}{}
\pbs@seq@push@cx{pbs@props@23}{/rm@oc716 32 0 R}
\pbs@seq@push@cx{pbs@props@23}{/rm@oc717 31 0 R}
\ocgxii@lnkcol@stack@on@page{23}{{linkcolour}}
\ocgxii@lnkcol@stack@on@page{23}{}
\pbs@seq@push@cx{pbs@props@23}{/rm@oc718 32 0 R}
\pbs@seq@push@cx{pbs@props@23}{/rm@oc719 31 0 R}
\ocgxii@lnkcol@stack@on@page{23}{{linkcolour}}
\ocgxii@lnkcol@stack@on@page{23}{}
\pbs@seq@push@cx{pbs@props@23}{/rm@oc720 32 0 R}
\pbs@seq@push@cx{pbs@props@23}{/rm@oc721 31 0 R}
\ocgxii@lnkcol@stack@on@page{23}{{linkcolour}}
\ocgxii@lnkcol@stack@on@page{23}{}
\pbs@seq@push@cx{pbs@props@23}{/rm@oc722 32 0 R}
\pbs@seq@push@cx{pbs@props@23}{/rm@oc723 31 0 R}
\ocgxii@ocg@stack@on@page{23}{}
\gdef \@abspage@last{23}
