..........................
----------------------------------------------------------------------
Ran 26 tests in 0.333s

OK
Name             Stmts   Miss Branch BrPart  Cover   Missing
------------------------------------------------------------
Collatz.py          51      2     26      0    97%   116-117
TestCollatz.py      99      0      0      0   100%
------------------------------------------------------------
TOTAL              150      2     26      0    99%
