.......................
----------------------------------------------------------------------
Ran 23 tests in 0.122s

OK
Name             Stmts   Miss Branch BrPart  Cover   Missing
------------------------------------------------------------
Collatz.py          41      0     20      0   100%
TestCollatz.py      99      0      0      0   100%
------------------------------------------------------------
TOTAL              140      0     20      0   100%
