1 10 19
100 200 124
201 210 88
900 1000 173
1 1 0
2 1 1
10 20 20
20 40 111
21 22 15
7325 1254 261
8766 4989 261
5497 8198 261
2928 64 216
3748 9162 261
9473 9891 241
8470 3667 261
8257 9002 246
4652 6273 261
4043 8860 261
1627 1310 171
208 6220 261
3018 5009 237
4987 3969 214
1811 4799 237
8379 621 261
5278 3725 214
5599 8532 261
2832 9501 261
1149 4722 237
5076 1328 237
2027 6150 237
811 7315 261
5624 7466 261
8505 1990 261
5703 6298 261
8933 4938 261
6234 3325 261
4112 4489 214
1036 330 178
5971 9675 261
5996 6440 261
3207 2500 216
1606 4897 237
3558 1903 216
3852 2052 237
5936 3177 237
7583 5155 261
3509 8083 261
7356 9489 259
5746 3879 235
2078 3735 237
9168 2721 261
8320 7200 251
4056 9697 261
3835 709 237
138 3270 216
4611 9978 261
1974 320 181
42 6355 261
8518 7920 251
659 3436 216
7659 8245 251
6279 5555 261
6728 5369 261
279 5896 237
5799 1781 237
5832 9126 261
5748 9389 261
8267 6036 261
9540 5037 261
5308 8194 261
2685 7118 261
1803 3541 216
6856 1343 261
716 873 178
4354 4519 214
268 1002 178
4110 9886 261
2452 123 182
6958 6328 256
3831 7833 261
7034 1399 261
8747 9209 246
5601 6214 261
9830 6970 259
5913 6103 186
9273 8391 259
4523 8602 261
3334 978 216
6208 9110 256
8298 1939 261
5115 2616 237
3498 7961 261
9468 3481 261
3305 3349 180
6884 9458 259
8789 5428 261
3989 8205 261
1426 6530 261
5313 953 237
2466 1302 208
117 2467 208
2416 6226 261
1707 1035 181
541 3769 237
919 8399 261
6975 571 261
4954 8168 261
360 7856 261
4994 2578 237
9161 8126 246
8154 3414 261
1949 6946 261
866 6171 261
2804 3974 237
6735 2033 261
93 3245 216
826 2164 181
355 4153 237
5943 1623 237
2178 5235 237
4092 8517 261
9992 4963 261
5638 1803 237
152 6868 261
6351 417 261
7827 2162 261
7220 4490 261
8538 5376 261
499 5021 237
3928 1643 237
6055 5219 235
8788 7363 251
4243 1862 237
6207 6523 199
2084 8002 261
9891 7692 259
1629 7316 261
8781 1647 261
7817 4967 261
2970 3277 198
918 2936 216
2471 1588 208
6924 952 261
9886 9944 241
2772 8112 261
30 5583 237
7358 2497 261
7183 4772 261
6023 8480 261
9315 2332 261
205 4640 237
9163 9575 259
3356 166 216
6668 5685 261
102 3822 237
902 8065 261
8590 1784 261
1351 6708 261
8672 7401 251
5305 6025 235
6386 9906 259
1736 8200 261
9930 5084 261
3351 9511 261
5067 3262 237
3562 2030 216
9578 5340 261
8144 9429 259
1035 5575 237
3643 4362 237
7043 7969 251
8981 8033 246
6944 3200 261
5034 7527 261
7976 6044 261
7760 974 261
7157 3638 261
141 3592 216
924 3187 216
3223 8000 261
9820 7435 259
2951 2823 216
1488 2646 208
1315 5523 237
6919 139 261
6120 1609 237
5995 6882 261
6735 8461 256
1 1 0
1000 1000 111
2000 2000 112
3000 3000 48
10000 10000 29
2000 10000 261
2000 3999 237
