Name             Stmts   Miss  Cover   Missing
----------------------------------------------
Collatz.py          30      0   100%
TestCollatz.py      76      0   100%
----------------------------------------------
TOTAL              106      0   100%