...........................
----------------------------------------------------------------------
Ran 27 tests in 0.069s

OK
Name             Stmts   Miss Branch BrPart  Cover   Missing
------------------------------------------------------------
Collatz.py          47      0     20      0   100%
TestCollatz.py     107      0      0      0   100%
------------------------------------------------------------
TOTAL              154      0     20      0   100%
