..................
----------------------------------------------------------------------
Ran 18 tests in 1.145s

OK
Name             Stmts   Miss Branch BrPart  Cover   Missing
------------------------------------------------------------
Collatz.py          40      2     18      1    95%   111-112, 110->111
TestCollatz.py      77      0      0      0   100%
------------------------------------------------------------
TOTAL              117      2     18      1    98%
