363361 665131 509
544179 247462 470
854721 932475 476
804329 617363 509
646993 839009 525
386095 291375 441
970639 661158 525
874570 157027 525
251268 735534 509
139342 889597 525
469318 450601 444
676248 319702 509
393620 460184 449
105342 834504 509
408668 413251 449
891082 717879 525
792266 955968 525
782091 425788 509
973778 788036 525
786003 904078 525
39873 607692 470
937251 113863 525
252461 688598 509
983275 803289 525
362082 593165 470
908003 469102 525
643865 454133 509
721158 478191 509
532321 887876 525
326113 906840 525
927169 974941 507
212806 108153 383
128309 21761 354
845231 787440 525
678551 74799 509
791672 977741 525
820110 397731 509
422492 347131 449
871418 97497 525
951312 645219 525
463846 64379 449
433632 370961 449
987223 545321 525
48224 538159 470
297818 278620 389
730181 217394 509
927290 909262 476
71448 422823 449
462161 588359 470
134533 389751 443
831945 300424 509
597078 774058 509
703589 826377 504
285023 882561 525
236504 250275 368
514279 668329 509
732587 419889 509
448255 333543 449
347089 450641 449
748830 315671 509
251782 418117 449
954713 890715 507
520336 846066 525
953231 192216 525
928813 324687 525
669843 765415 504
4923 7961 262
582785 469638 470
255653 72960 443
192048 314713 443
910323 662036 525
176719 811199 509
482802 334928 449
597483 339887 470
564399 11491 470
839284 643545 525
811882 291488 509
28639 927003 525
262393 581875 470
137349 718348 509
536538 958474 525
808320 778626 468
280939 468241 449
130051 728686 509
582116 409977 470
669757 525293 509
8604 908626 525
715893 95570 509
379734 534620 470
924514 638765 525
860180 201782 525
360655 91491 443
220945 231792 443
437503 742992 509
940616 168847 525
635091 653709 416
574067 214538 470
541354 391819 470
197550 336972 443
864754 724242 525
173692 350102 443
486784 925472 525
927618 933321 383
822426 77872 509
962234 476900 525
833761 835843 357
938903 335681 525
451803 16947 449
831601 599442 509
505172 1114 449
141401 780931 509
946164 491878 525
34987 742816 509
409372 534688 470
676576 983525 525
947304 572369 525
110613 803022 509
193854 172617 365
901743 964139 507
737378 918885 525
547332 414287 470
48353 56459 340
19904 909563 525
656719 411829 509
648809 911579 525
242265 300254 407
144714 822601 509
666805 652470 442
141285 185123 383
450028 719562 509
