1 10 20
100 200 125
201 210 89
900 1000 174
1000 9000 262
1000 2000 182
10000 11000 268
550 600 137
500 600 137
999990 999999 259
10000 20000 279
1 5 8
1 1 1
999999 999999 259
3100 3200 199
4300 5400 215
6500 7500 257
8000 9000 247
9500 10500 255
12000 12750 263
15000 15010 178
20000 20002 181
50000 50015 190
75000 76000 307
8000 7500 252
1 3 8
1 6 9
1 9 20
10 1 20
70 65 28
100000 100005 129
200000 200003 161
30 70 113
45 60 113
60 45 113
36 35 22
17 38 112
42 16 112
1000 1007 143
12 20 21
80 100 119
100 90 119
101 102 26
102 100 26
40 30 107
30 20 112
20 15 21
15 30 112
28 7 112
90 95 106
100 200 125
50 60 113
65 77 116
70 74 116
80 88 111
300000 300003 190
700000 699998 230
50000 50100 234
800000 800005 194
999998 999999 259
700000 700002 168
5400 5410 161
9990 10000 180
100000 100050 310
1 100 119
200 150 125
5000 10000 262
9000 9999 260
1234 1432 177
888 900 148
64 32 113
32 16 112
16 8 20
8 4 17
4 2 8
4000 4005 145
29000 30000 272
3200 3000 199
9000 9001 141
26 64 113
12 19 21
19 98 119
2010 2018 113
8400 8410 97
300000 300010 234
750 775 153
4020 4030 96
690 700 127
960 980 143
123 132 122
456 465 129
789 798 122
1030 1050 156
670 679 114
60000 60100 286
8000 8250 190
45 40 110
80000 80008 183
321 312 131
987 978 143
654 645 145
20 25 24
