1 10 20
100 200 125
201 210 89
900 1000 174
999999 1 525
1 999999 525
1 10 20
1 100 119
1 1000 179
1 10000 262
1 100000 351
100000 1 351
10000 1 262
1000 1 179
100 1 119
10 1 20
1 1 1
15 16 18
1500 1501 48
999998 999999 259
123 456 144
123456 78910 354
455 230 144
123980 83921 354
322381 673142 509
995295 572786 525
134 518573 470
1 326862 443
733377 827686 468
465828 276965 449
190009 188044 360
920661 596043 525
332725 821401 509
836514 638979 504
469528 707973 509
657166 759915 504
235802 558344 470
491098 128163 449
986078 948849 458
191516 75740 383
731627 723926 380
734275 272264 509
472263 583944 470
90029 389861 443
851254 91737 525
14870 963245 525
456220 773259 509
283949 891483 525
286925 627150 509
181568 194748 360
817562 844806 525
469635 949442 525
608559 45736 470
835236 17100 509
362210 814616 509
388814 168095 443
747458 361240 509
812988 442715 509
860116 907277 445
726047 49487 509
978855 451456 525
108817 145295 375
208712 764880 509
241241 325003 407
619567 442261 470
614253 983414 525
611916 851622 525
372353 77299 443
3591 938931 525
130530 22789 354
768392 880366 525
830944 429583 509
979188 839624 507
13444 748743 509
764889 758271 380
34350 42443 324
794078 991494 525
684491 43971 509
597089 337910 470
391372 749753 509
976455 719157 525
658600 945947 525
195533 968174 525
41857 402800 443
742560 54604 509
749731 666641 504
276156 219391 443
923330 674460 525
20375 193779 383
764934 339437 509
874277 273366 525
738622 782475 468
639392 331222 509
83330 741454 509
380426 271920 441
637235 99562 509
634388 216145 509
505259 785296 509
554574 784231 509
276488 174994 443
930637 782041 525
294612 839389 525
123411 1284 354
1 2 2
1515 11 182
