1 10 20
100 200 125
201 210 89
900 1000 174
35182 582243 470
84588 596100 470
270812 624432 470
247164 47400 443
553284 473938 470
23981 247551 443
550559 238722 470
314505 984006 525
655973 285586 509
964290 766993 525
2369 258868 443
332353 558479 470
560566 447048 470
84466 762009 509
612530 889407 525
875132 62012 525
668615 878738 525
785558 201579 509
4115 67607 340
448843 611607 470
702425 966379 525
858772 97441 525
246508 507999 449
476212 107260 449
675266 939312 525
147212 428148 449
282796 486229 449
721232 503879 509
369317 415722 449
584372 240292 470
831506 379077 509
247430 339279 407
655052 903952 525
961474 644344 525
709617 785833 468
142017 797504 509
980815 52685 525
633992 861687 525
883553 628337 525
129537 664732 509
326003 165331 443
361076 377612 423
774064 560261 509
111380 631957 509
207174 229597 386
654017 229372 509
472842 298932 449
525632 398465 470
659653 126163 509
713593 51427 509
34099 495474 449
434760 482448 444
167698 974662 525
530615 102861 470
198385 360136 443
428160 913987 525
815467 243397 509
371965 923809 525
640907 610454 509
338003 333259 366
329091 718283 509
393701 254378 441
954237 150361 525
896439 268434 525
36805 388787 443
270588 666364 509
228124 903572 525
321586 998304 525
438579 824285 509
977960 791555 525
797446 684785 504
563829 650872 509
787982 156301 509
244448 534484 470
632357 512976 509
689514 603473 509
212388 406876 443
651638 207940 509
306204 264355 407
720923 842350 525
687535 255606 509
824293 859599 525
313287 841655 525
791823 811117 468
793861 834839 468
299688 811362 509
35047 505416 449
838987 742870 525
268308 249048 407
767740 934392 525
45663 956305 525
830335 546776 509
617697 607196 447
467714 449161 444
880581 293772 525
398348 766184 509
549683 402614 470
468145 136224 449
61191 176319 383
414377 773379 509
915313 892559 476
182675 938351 525
178050 697794 509
781295 571179 509
317828 283158 389
181208 706936 509
455988 488656 444
775064 256958 509
720775 522235 509
511867 769525 509
941031 244096 525
274321 807777 509
200957 813906 509
64169 946102 525
421296 691497 509
881578 71226 525
746801 393368 509
718103 984249 525
48599 161363 383
618067 323903 470
533217 471532 470
935509 938263 445
270942 35627 443
908755 568592 525
594111 35209 470
889561 321262 525
233820 987486 525
813566 984304 525
778609 637185 504
502735 287849 449
171763 114113 383
976249 987658 427
258290 499119 449
602258 361104 470
543329 234073 470
225939 981375 525
697203 286786 509
367519 598398 470
657062 171654 509
265703 455469 449
210182 355095 443
335516 644262 509
730522 530132 509
271454 541411 470
380283 923833 525
764158 579116 509
25935 921500 525
817918 773462 468
559509 817821 509
918569 592077 525
186054 260583 443
790470 387393 509
653432 411436 509
160079 274781 443
803660 198196 509
993591 291689 525
968245 538143 525
270318 662033 509
395480 224923 443
246269 366025 441
182891 94827 383
565146 255221 470
168939 727006 509
