1 10 20
100 200 125
201 210 89
900 1000 174
-1 -10 0
-10 -1 0
-1 1 0
10 1 0
1 1 0
1 0 0
1 1000000 525
-6 9999 0
4 24 21
90 10000 262
4567 -999999 0
5678 890 0
45 67 113
320 322 25
4567 7856 262
567 568 62
90 320 131
29 32 107
34 56 113
12 9 0
5 9 17
9 12 20
1 13 20
9 5 0
45 666 145
321 456 144
999999 1000000 259
9999 456789 449
34523 908761 525
-666 666 0
0 100 0
0 0 0
95 1212 182
95 9595 262
12345 678910 509
77 1313 182
13 777 171
90 180 125
56 78 116
67 678 145
90 181 125
34 69 113
867 5309 238
86 75309 340
8 675309 509
524 523679 470
32 564 144
909 999 174
56 58 33
69 6969 262
901 902 55
1 133 122
3 1 0
56 45 0
-3 3 0
3 -3 0
0 -3 0
0 3 0
-3 0 0
3 0 0
75 125 119
13 15 18
98 99 26
100 101 26
45 54 105
254 6235 262
68 90 116
32 244 128
89 799 171
5 55 113
5 555 144
55 555 144
9 1295 182
52 65 113
90 90900 351
45 24 0
0 23 0
68 456 144
987 6543 262
4321 987 0
24 560 144
8 7 0
9 87 116
654 76576 340
89 233432 443
898 3543 217
9 1 0
242 2344 183
8909 9098 247
56 65 108
65 56 0
9876 58853 340
4 34 112
5 53 112
909 8788 262
4 2 0
1 9876 262