[I 2021-08-16 10:38:54.191 ServerApp] jupyterlab | extension was successfully linked.
[I 2021-08-16 10:38:54.915 ServerApp] nbclassic | extension was successfully linked.
[I 2021-08-16 10:38:55.019 ServerApp] nbclassic | extension was successfully loaded.
[I 2021-08-16 10:38:55.020 LabApp] JupyterLab extension loaded from /Users/jacobschwartz/.pyenv/versions/3.9.5/lib/python3.9/site-packages/jupyterlab
[I 2021-08-16 10:38:55.021 LabApp] JupyterLab application directory is /Users/jacobschwartz/.pyenv/versions/3.9.5/share/jupyter/lab
[I 2021-08-16 10:38:55.026 ServerApp] jupyterlab | extension was successfully loaded.
[I 2021-08-16 10:38:55.027 ServerApp] Serving notebooks from local directory: /Users/jacobschwartz/git/notebook
[I 2021-08-16 10:38:55.028 ServerApp] Jupyter Server 1.8.0 is running at:
[I 2021-08-16 10:38:55.028 ServerApp] http://localhost:8888/lab?token=4c3cdbdb12054581daeb2bf713e2e95d6cb3840b1dc13c5f
[I 2021-08-16 10:38:55.028 ServerApp]     http://127.0.0.1:8888/lab?token=4c3cdbdb12054581daeb2bf713e2e95d6cb3840b1dc13c5f
[I 2021-08-16 10:38:55.028 ServerApp] Use Control-C to stop this server and shut down all kernels (twice to skip confirmation).
[C 2021-08-16 10:38:55.037 ServerApp] 
    
    To access the server, open this file in a browser:
        file:///Users/jacobschwartz/Library/Jupyter/runtime/jpserver-45146-open.html
    Or copy and paste one of these URLs:
        http://localhost:8888/lab?token=4c3cdbdb12054581daeb2bf713e2e95d6cb3840b1dc13c5f
        http://127.0.0.1:8888/lab?token=4c3cdbdb12054581daeb2bf713e2e95d6cb3840b1dc13c5f
[I 2021-08-16 10:38:59.561 ServerApp] interrupted
Serving notebooks from local directory: /Users/jacobschwartz/git/notebook
0 active kernels
Jupyter Server 1.8.0 is running at:
http://localhost:8888/lab?token=4c3cdbdb12054581daeb2bf713e2e95d6cb3840b1dc13c5f
    http://127.0.0.1:8888/lab?token=4c3cdbdb12054581daeb2bf713e2e95d6cb3840b1dc13c5f
Shutdown this Jupyter server (y/[n])? [C 2021-08-16 10:39:01.063 ServerApp] received signal 2, stopping
[I 2021-08-16 10:39:01.111 ServerApp] Shutting down 0 kernels
[W 2021-08-16 10:39:01.112 LabApp] Could not determine jupyterlab build status without nodejs
[I 2021-08-16 10:39:01.128 ServerApp] Shutting down 0 terminals
[C 2021-08-16 10:39:01.283 ServerApp] received signal 2, stopping
[C 2021-08-16 10:39:01.501 ServerApp] received signal 2, stopping
[I 2021-08-16 10:39:52.793 ServerApp] jupyterlab | extension was successfully linked.
[I 2021-08-16 10:39:53.519 ServerApp] nbclassic | extension was successfully linked.
[I 2021-08-16 10:39:53.622 ServerApp] nbclassic | extension was successfully loaded.
[I 2021-08-16 10:39:53.623 LabApp] JupyterLab extension loaded from /Users/jacobschwartz/.pyenv/versions/3.9.5/lib/python3.9/site-packages/jupyterlab
[I 2021-08-16 10:39:53.623 LabApp] JupyterLab application directory is /Users/jacobschwartz/.pyenv/versions/3.9.5/share/jupyter/lab
[I 2021-08-16 10:39:53.629 ServerApp] jupyterlab | extension was successfully loaded.
[I 2021-08-16 10:39:53.631 ServerApp] Serving notebooks from local directory: /Users/jacobschwartz/git/notebook
[I 2021-08-16 10:39:53.631 ServerApp] Jupyter Server 1.8.0 is running at:
[I 2021-08-16 10:39:53.631 ServerApp] http://localhost:8888/lab?token=c1d7118492585422580cce808df913c8a7174f0537d187a8
[I 2021-08-16 10:39:53.631 ServerApp]     http://127.0.0.1:8888/lab?token=c1d7118492585422580cce808df913c8a7174f0537d187a8
[I 2021-08-16 10:39:53.631 ServerApp] Use Control-C to stop this server and shut down all kernels (twice to skip confirmation).
[C 2021-08-16 10:39:53.654 ServerApp] 
    
    To access the server, open this file in a browser:
        file:///Users/jacobschwartz/Library/Jupyter/runtime/jpserver-45198-open.html
    Or copy and paste one of these URLs:
        http://localhost:8888/lab?token=c1d7118492585422580cce808df913c8a7174f0537d187a8
        http://127.0.0.1:8888/lab?token=c1d7118492585422580cce808df913c8a7174f0537d187a8
