{
  "name" : "brokerage_data_etl_new",
  "description" : "",
  "role" : "arn:aws:iam::540599139109:role/RedshiftETLRole",
  "executionProperty" : {
    "maxConcurrentRuns" : 1
  },
  "command" : {
    "name" : "glueetl",
    "scriptLocation" : "s3://aws-glue-assets-540599139109-us-east-1/scripts/brokerage_data_etl_new.py",
    "pythonVersion" : "3"
  },
  "defaultArguments" : {
    "--enable-metrics" : "true",
    "--enable-spark-ui" : "true",
    "--spark-event-logs-path" : "s3://aws-glue-assets-540599139109-us-east-1/sparkHistoryLogs/",
    "--enable-job-insights" : "true",
    "--enable-glue-datacatalog" : "true",
    "--enable-continuous-cloudwatch-log" : "true",
    "--job-bookmark-option" : "job-bookmark-disable",
    "--job-language" : "python",
    "--TempDir" : "s3://aws-glue-assets-540599139109-us-east-1/temporary/"
  },
  "maxRetries" : 3,
  "allocatedCapacity" : 10,
  "timeout" : 2880,
  "maxCapacity" : 10.0,
  "glueVersion" : "3.0",
  "numberOfWorkers" : 10,
  "workerType" : "G.1X",
  "executionClass" : "STANDARD",
  "sourceControlDetails" : {
    "provider" : "GITHUB",
    "repository" : "Data",
    "branch" : "main",
    "folder" : "brokerage_data_etl_new"
  }
}