{
  "name" : "ajg_etl_responses",
  "description" : "",
  "role" : "arn:aws:iam::540599139109:role/RedshiftETLRole",
  "executionProperty" : {
    "maxConcurrentRuns" : 1
  },
  "command" : {
    "name" : "glueetl",
    "scriptLocation" : "s3://aws-glue-assets-540599139109-us-east-1/scripts/ajg_etl_responses.py",
    "pythonVersion" : "3"
  },
  "defaultArguments" : {
    "--class" : "GlueApp",
    "--enable-metrics" : "true",
    "--enable-spark-ui" : "true",
    "--spark-event-logs-path" : "s3://aws-glue-assets-540599139109-us-east-1/sparkHistoryLogs/",
    "--enable-glue-datacatalog" : "true",
    "--enable-continuous-cloudwatch-log" : "true",
    "--job-bookmark-option" : "job-bookmark-disable",
    "--job-language" : "python",
    "--TempDir" : "s3://aws-glue-assets-540599139109-us-east-1/temporary/"
  },
  "connections" : {
    "connections" : [ "prod" ]
  },
  "maxRetries" : 3,
  "allocatedCapacity" : 20,
  "timeout" : 2880,
  "maxCapacity" : 20.0,
  "glueVersion" : "2.0",
  "numberOfWorkers" : 10,
  "workerType" : "G.2X",
  "codeGenConfigurationNodes" : "{\"node-1634835951314\":{\"CatalogSource\":{\"Database\":\"production\",\"Name\":\"responses_response\",\"Table\":\"indio_public_responses_response\"}},\"node-1634835919040\":{\"CatalogSource\":{\"Database\":\"production\",\"Name\":\"clients_client\",\"Table\":\"indio_public_clients_client\"}},\"node-1648745997991\":{\"SelectFields\":{\"Inputs\":[\"node-1634837125412\"],\"Name\":\"select_clients_client_fields\",\"Paths\":[[\"id\"]]}},\"node-1634837125412\":{\"Filter\":{\"Filters\":[{\"Negated\":false,\"Operation\":\"EQ\",\"Values\":[{\"Type\":\"COLUMNEXTRACTED\",\"Value\":[\"brokerage_id\"]},{\"Type\":\"CONSTANT\",\"Value\":[\"540\"]}]}],\"Inputs\":[\"node-1634835919040\"],\"LogicalOperator\":\"AND\",\"Name\":\"filter_on_brokerage_540\"}},\"node-1648744672307\":{\"SelectFields\":{\"Inputs\":[\"node-1634836864438\"],\"Name\":\"select_client_fields_from_responses\",\"Paths\":[[\"deleted\"],[\"created\"],[\"form_field_id\"],[\"form_bundle_id\"],[\"id\"],[\"response_row_id\"],[\"author_id\"],[\"updated\"],[\"client_id\"],[\"_value_id\"]]}},\"node-1634836864438\":{\"Join\":{\"Columns\":[{\"From\":\"node-1634835951314\",\"Keys\":[[\"client_id\"]]},{\"From\":\"node-1634836773970\",\"Keys\":[[\"clients_client_id\"]]}],\"Inputs\":[\"node-1634835951314\",\"node-1634836773970\"],\"JoinType\":\"leftsemi\",\"Name\":\"join_clients_responses\"}},\"node-1634836773970\":{\"ApplyMapping\":{\"Inputs\":[\"node-1648745997991\"],\"Mapping\":[{\"Dropped\":false,\"FromPath\":[\"id\"],\"FromType\":\"int\",\"ToKey\":\"clients_client_id\",\"ToType\":\"int\"}],\"Name\":\"rename_clients_client_keys\"}},\"node-1634840396486\":{\"CustomCode\":{\"ClassName\":\"write_responses_response\",\"Code\":\"glueContext.write_dynamic_frame.from_jdbc_conf(\\n\\tframe = dfc.select(list(dfc.keys())[0]),\\n\\tcatalog_connection = \\\"redshift-ajg\\\",\\n\\tconnection_options = {\\\"dbtable\\\": \\\"responses_response\\\", \\\"database\\\": \\\"indio\\\", \\\"preactions\\\":\\\"TRUNCATE TABLE responses_response\\\"},\\n\\tredshift_tmp_dir = args[\\\"TempDir\\\"])\",\"Inputs\":[\"node-1648744672307\"],\"Name\":\"write_responses_response\"}}}",
  "sourceControlDetails" : {
    "provider" : "GITHUB",
    "repository" : "Data",
    "branch" : "main",
    "folder" : "ajg_etl_responses"
  }
}