{
  "name" : "clients_client__audit",
  "description" : "",
  "role" : "arn:aws:iam::540599139109:role/RedshiftETLRole",
  "executionProperty" : {
    "maxConcurrentRuns" : 1
  },
  "command" : {
    "name" : "glueetl",
    "scriptLocation" : "s3://aws-glue-assets-540599139109-us-east-1/scripts/clients_client__audit.py",
    "pythonVersion" : "3"
  },
  "defaultArguments" : {
    "--job-bookmark-option" : "job-bookmark-enable",
    "--spark-event-logs-path" : "s3://aws-glue-assets-540599139109-us-east-1/sparkHistoryLogs/",
    "--enable-job-insights" : "false",
    "--job-language" : "python",
    "--TempDir" : "s3://aws-glue-temporary-540599139109-us-east-1/luis/"
  },
  "connections" : {
    "connections" : [ "analytics", "pde_release", "prod", "prod_414", "prod_replica", "redshift-ajg" ]
  },
  "maxRetries" : 0,
  "allocatedCapacity" : 10,
  "timeout" : 2880,
  "maxCapacity" : 10.0,
  "glueVersion" : "2.0",
  "numberOfWorkers" : 10,
  "workerType" : "G.1X",
  "executionClass" : "STANDARD",
  "sourceControlDetails" : {
    "provider" : "GITHUB",
    "repository" : "Data",
    "branch" : "main",
    "folder" : "clients_client__audit"
  }
}