    1  ls
    2  sudo apt install terminator
    3  sudo apt install vim
    4  sudo apt install pdftk
    5  sudo apt install zenity
    6  sudo apt autoremove
    7  sudo apt install zenity
    8  sudo apt update
    9  clear
   10  ls
   11  cd Documentos/Jackson/
   12  ls
   13  mkdir reposicao
   14  ls
   15  cd reposicao/
   16  mkdir prova1 prova2
   17  ls
   18  cd ./
   19  cd ../
   20  ls
   21  mkdir projeto-final
   22  ls
   23  history > configuracao-inicial.txt
