{
    "edges": [
        {
            "id": 0,
            "size": 5,
            "source": 0,
            "target": 1
        },
        {
            "id": 1,
            "size": 5,
            "source": 0,
            "target": 9
        },
        {
            "id": 2,
            "size": 5,
            "source": 1,
            "target": 2
        },
        {
            "id": 3,
            "size": 5,
            "source": 1,
            "target": 6
        },
        {
            "id": 4,
            "size": 5,
            "source": 2,
            "target": 3
        },
        {
            "id": 5,
            "size": 5,
            "source": 2,
            "target": 4
        },
        {
            "id": 6,
            "size": 5,
            "source": 4,
            "target": 5
        },
        {
            "id": 7,
            "size": 5,
            "source": 4,
            "target": 8
        },
        {
            "id": 8,
            "size": 5,
            "source": 5,
            "target": 13
        },
        {
            "id": 9,
            "size": 5,
            "source": 6,
            "target": 7
        },
        {
            "id": 10,
            "size": 5,
            "source": 6,
            "target": 10
        },
        {
            "id": 11,
            "size": 5,
            "source": 7,
            "target": 8
        },
        {
            "id": 12,
            "size": 5,
            "source": 7,
            "target": 11
        },
        {
            "id": 13,
            "size": 5,
            "source": 8,
            "target": 12
        }
    ],
    "lengthStorePath": 52.070884704589844,
    "nodes": [
        {
            "id": 0,
            "label": "0",
            "size": 1,
            "x": 0.0,
            "y": 0.0
        },
        {
            "id": 1,
            "label": "1",
            "size": 1,
            "x": 1.372,
            "y": 0.0
        },
        {
            "id": 2,
            "label": "2",
            "size": 1,
            "x": 5.487,
            "y": 0.0
        },
        {
            "id": 3,
            "label": "3",
            "size": 1,
            "x": 5.487,
            "y": 0.2
        },
        {
            "id": 4,
            "label": "4",
            "size": 1,
            "x": 9.602,
            "y": 0.0
        },
        {
            "id": 5,
            "label": "5",
            "size": 1,
            "x": 10.974,
            "y": 0.0
        },
        {
            "id": 6,
            "label": "6",
            "size": 1,
            "x": 1.372,
            "y": 5.486
        },
        {
            "id": 7,
            "label": "7",
            "size": 1,
            "x": 5.486,
            "y": 5.486
        },
        {
            "id": 8,
            "label": "8",
            "size": 1,
            "x": 9.602,
            "y": 5.486
        },
        {
            "id": 9,
            "label": "9",
            "size": 1,
            "x": 0.0,
            "y": 11.887
        },
        {
            "id": 10,
            "label": "10",
            "size": 1,
            "x": 1.372,
            "y": 11.887
        },
        {
            "id": 11,
            "label": "11",
            "size": 1,
            "x": 5.487,
            "y": 11.887
        },
        {
            "id": 12,
            "label": "12",
            "size": 1,
            "x": 9.602,
            "y": 11.887
        },
        {
            "id": 13,
            "label": "13",
            "size": 1,
            "x": 10.974,
            "y": 11.887
        }
    ],
    "storePath": [
        6,
        1,
        0,
        3,
        2,
        5,
        4,
        8,
        12,
        13,
        11,
        10,
        9,
        7
    ]
}
