..............
----------------------------------------------------------------------
Ran 14 tests in 1.556s

OK
Name             Stmts   Miss  Cover   Missing
----------------------------------------------
Collatz.py          60      0   100%
TestCollatz.py      59      0   100%
----------------------------------------------
TOTAL              119      0   100%
=======


