.............................
----------------------------------------------------------------------
Ran 29 tests in 0.736s

OK
Name             Stmts   Miss Branch BrPart  Cover   Missing
------------------------------------------------------------
Collatz.py          59      0     38      1    99%   56->74
TestCollatz.py     108      0      0      0   100%
------------------------------------------------------------
TOTAL              167      0     38      1    99%
