................
----------------------------------------------------------------------
Ran 16 tests in 0.001s

OK
Name             Stmts   Miss Branch BrPart  Cover   Missing
------------------------------------------------------------
Collatz.py          54      6     26      4    88%   17, 31-32, 53-54, 83, 16->17, 30->31, 34->13, 82->83
TestCollatz.py      74      0      0      0   100%
------------------------------------------------------------
TOTAL              128      6     26      4    94%
