.................
----------------------------------------------------------------------
Ran 17 tests in 1.194s

OK
Name             Stmts   Miss Branch BrPart  Cover   Missing
------------------------------------------------------------
Collatz.py          30      0     14      0   100%
TestCollatz.py      78      0      0      0   100%
------------------------------------------------------------
TOTAL              108      0     14      0   100%
