1 10 20
100 200 125
201 210 89
900 1000 174
368397 204446 443
119226 955635 525
749845 20647 509
732615 571313 509
324101 137540 443
504792 213719 449
720928 541338 509
45740 58686 340
764517 237026 509
413919 221818 449
331098 165759 443
545962 421876 470
1193 155935 375
382082 25702 443
43659 872741 525
56747 636541 509
880568 68569 525
531224 641199 509
1669 642340 509
871280 179612 525
975957 472134 525
850468 481884 525
878180 854507 432
216708 367353 443
334406 955367 525
351092 61491 443
654642 296587 509
628768 48376 509
782410 773480 437
482741 353953 449
889892 235053 525
192873 355090 443
549599 510607 470
815647 518569 509
710323 316456 509
538215 968059 525
454368 845583 525
445148 817460 509
581391 119080 470
578290 57692 470
841259 881635 432
874053 853479 432
238258 659318 509
321864 562621 470
742323 897884 525
136321 183847 383
921372 118672 525
613770 921833 525
670073 566768 509
792292 604878 509
13293 466550 449
525030 296914 470
698214 700143 367
352087 534844 470
508814 258907 449
897195 441140 525
963420 941443 414
409057 878265 525
847259 712136 525
586263 836892 509
775684 14484 509
440700 644192 509
89508 419084 449
128726 964005 525
225418 959407 525
479522 942607 525
957569 957582 246
742274 350789 509
803720 878866 525
130355 890714 525
183945 398671 443
901547 585795 525
833261 927450 525
978654 276842 525
492817 93692 449
85699 243047 443
219572 15878 386
622247 592123 447
354542 317693 441
301420 948133 525
656755 556577 509
162323 593467 470
446426 102801 449
657224 554630 509
956421 878209 507
905431 141485 525
326734 901605 525
997387 696077 525
632983 378260 509
939436 264218 525
593339 828018 509
850003 654936 525
785440 985331 525
603437 996889 525
328017 490964 449
944652 965643 414
580203 597296 434
643017 349142 509
833586 474118 509
592894 415503 470
948368 319743 525
888081 97459 525
850753 60675 525
574679 23454 470
336614 568110 470
768860 643915 504
633457 736698 504
662603 741978 504
552073 318379 470
626364 937018 525
897341 457343 525
851654 486519 525
201156 71078 383
978481 781998 525
885710 99684 525
915923 200483 525
481996 9685 449
125901 507854 449
242621 308527 407
211545 632812 509
660905 823130 504
887816 641517 525
949881 589836 525
456960 76886 449
131567 270653 443
737054 61869 509
404226 32642 443
539442 860958 525
684225 777194 504
127524 808430 509
583964 31165 470
146439 471868 449
549749 336186 470
206090 769473 509
355197 680573 509
294159 495297 449
191361 541913 470
843433 482138 525
750381 281371 509
844726 205785 525
999772 950527 458
710179 687527 504
145582 838857 525
137550 104234 354
105511 781583 509
635410 169681 509
333959 48170 443
959225 49779 525
523379 545802 408
556650 534234 452
