                  ___          _____          ___
      ___        /  /\        /  /::\        /  /\
     /  /\      /  /::\      /  /:/\:\      /  /::\
    /  /:/     /  /:/\:\    /  /:/  \:\    /  /:/\:\
   /  /:/     /  /:/  \:\  /__/:/ \__\:|  /  /:/  \:\
  /  /::\    /__/:/ \__\:\ \  \:\ /  /:/ /__/:/ \__\:\
 /__/:/\:\   \  \:\ /  /:/  \  \:\  /:/  \  \:\ /  /:/
 \__\/  \:\   \  \:\  /:/    \  \:\/:/    \  \:\  /:/
      \  \:\   \  \:\/:/      \  \::/      \  \:\/:/
       \__\/    \  \::/        \__\/        \  \::/
                 \__\/                       \__\/