Place,Name,BirthDate,Sex,State,Division,Equipment,BodyweightKg,WeightClassKg,Squat1Kg,Squat2Kg,Squat3Kg,Best3SquatKg,Bench1Kg,Bench2Kg,Bench3Kg,Best3BenchKg,Deadlift1Kg,Deadlift2Kg,Deadlift3Kg,Best3DeadliftKg,TotalKg,Event
1,Megan Janes,,F,BC,Sub-Juniors,Raw,62.1,63,102.5,110,-117.5,110,57.5,62.5,65,65,135,142.5,151,151,326,SBD
1,Natasha Klair,,F,BC,Sub-Juniors,Raw,133,84+,105,110,115,115,77.5,82.5,87.5,87.5,110,120,127.5,127.5,330,SBD
1,Liselle Wong,,F,BC,Juniors,Raw,42.3,43,60,62.5,-73.5,62.5,37.5,40,42,42,90,97.5,-104.5,97.5,202,SBD
1,Christilyn Joy Arjona,,F,AB,Juniors,Raw,46.7,47,75,82.5,87.5,87.5,60,-65.5,-65.5,60,110,125,-140.5,125,272.5,SBD
1,Fiona Chen,,F,BC,Juniors,Raw,51.1,52,120,-125,-125,120,62.5,-67.5,-67.5,62.5,-152.5,157.5,-162.5,157.5,340,SBD
1,Sara Fiorvento,1999-01-04,F,BC,Juniors,Raw,56.2,57,90,95,100,100,50,55,57.5,57.5,95,100,105,105,262.5,SBD
1,Maddie Warren,,F,BC,Juniors,Raw,61.8,63,125,130,132.5,132.5,67.5,70,-72.5,70,152.5,157.5,160,160,362.5,SBD
2,Pankita Bains,,F,BC,Juniors,Raw,62,63,90,95,100,100,40,45,-47.5,45,95,102.5,107.5,107.5,252.5,SBD
1,Michelle Irvine,,F,BC,Juniors,Raw,67.3,69,125,132.5,-140,132.5,60,-65,-65,60,125,132.5,137.5,137.5,330,SBD
1,Emily Wiggins,,F,BC,Juniors,Raw,71.07,76,135,145,150,150,100,-105.5,105.5,105.5,160,170,175,175,430.5,SBD
2,Lily Riggs,,F,BC,Juniors,Raw,74.9,76,147.5,155,160,160,72.5,77.5,80,80,160,172.5,177.5,177.5,417.5,SBD
3,Emily Epp,,F,BC,Juniors,Raw,74.83,76,107.5,112.5,115,115,70,75,-77.5,75,127.5,135,137.5,137.5,327.5,SBD
DQ,Hannah Bugas,,F,BC,Juniors,Raw,83.03,84,-135,-135,-135,,,,,,,,,,,SBD
1,Breana Andrews,,F,NL,Juniors,Raw,98.7,84+,162.5,170,175,175,57.5,62.5,-70,62.5,157.5,167.5,175,175,412.5,SBD
1,Rhonda Wong,,F,AB,Open,Raw,46.3,47,110,117.5,-122.5,117.5,57.5,62.5,65,65,132.5,140,145,145,327.5,SBD
2,Denise Loraine Sopena,,F,BC,Open,Raw,46.6,47,102.5,112.5,117.5,117.5,55,-60,60,60,130,140,145,145,322.5,SBD
3,Madeleine Diaz,,F,BC,Open,Raw,46.2,47,70,75,-82.5,75,45,50,55,55,120,127.5,135,135,265,SBD
1,Marie Jenevieve Joaquin,,F,BC,Open,Raw,51.2,52,132.5,140,145,145,72.5,77.5,80,80,145,155,167.5,167.5,392.5,SBD
2,Catherine Nguyen,,F,BC,Open,Raw,51.1,52,102.5,107.5,117.5,117.5,62.5,67.5,-72.5,67.5,137.5,145,152.5,152.5,337.5,SBD
3,Kelley Hindley,,F,BC,Open,Raw,49,52,95,-100,100,100,45,47.5,50,50,120,130,135,135,285,SBD
4,Catherine Li,,F,BC,Open,Raw,51,52,90,95,100,100,50,55,-60,55,110,120,-127.5,120,275,SBD
1,Tu Le #1,,F,BC,Open,Raw,56.7,57,120,127.5,132.5,132.5,62.5,65,67.5,67.5,132.5,142.5,150,150,350,SBD
2,Emily Stearns,,F,AB,Open,Raw,56.4,57,120,125,-127.5,125,75,77.5,-80,77.5,140,142.5,-145,142.5,345,SBD
3,Hannah Southwood,,F,BC,Open,Raw,55.4,57,102.5,110,-115,110,67.5,72.5,77.5,77.5,140,150,-162.5,150,337.5,SBD
4,Pei Chen,,F,BC,Open,Raw,55.7,57,115,122.5,-127.5,122.5,62.5,-67.5,-67.5,62.5,132.5,142.5,-147.5,142.5,327.5,SBD
5,Angelika Ballesteros,,F,MB,Open,Raw,56.6,57,102.5,110,112.5,112.5,60,62.5,65,65,132.5,142.5,-147.5,142.5,320,SBD
6,Jessica Ho,,F,BC,Open,Raw,55.7,57,125,132.5,-137.5,132.5,60,62.5,65,65,112.5,117.5,122.5,122.5,320,SBD
7,Uyen Huynh,,F,BC,Open,Raw,54.4,57,-102.5,102.5,115,115,47.5,52.5,57.5,57.5,105,112.5,125,125,297.5,SBD
1,Teresa Parsons,,F,AB,Open,Raw,62.2,63,152.5,160,-165,160,95,102.5,-108,102.5,177.5,190,198.5,198.5,461,SBD
2,Diana Foxall,,F,BC,Open,Raw,61.7,63,115,122.5,130,130,82.5,87.5,90,90,155,165,172.5,172.5,392.5,SBD
3,Regine Mae Tolentino,,F,MB,Open,Raw,60.6,63,130,140,147.5,147.5,62.5,67.5,-70,67.5,145,152.5,162.5,162.5,377.5,SBD
4,Jessica Dong,,F,BC,Open,Raw,60.2,63,125,130,137.5,137.5,60,65,70,70,160,167.5,-180,167.5,375,SBD
5,Chubing Liang,,F,BC,Open,Raw,62.7,63,117.5,122.5,127.5,127.5,65,67.5,70,70,165,175,-182.5,175,372.5,SBD
6,Glynis Valguna,,F,BC,Open,Raw,61.7,63,95,102.5,110,110,67.5,72.5,-75,72.5,125,-135,-137.5,125,307.5,SBD
7,Niloufar Karamatpanah,,F,BC,Open,Raw,61.7,63,90,95,100,100,55,60,-62.5,60,125,132.5,137.5,137.5,297.5,SBD
8,Melissa Perry,,F,MB,Open,Raw,62.8,63,-72.5,72.5,77.5,77.5,37.5,40,-45,40,102.5,107.5,112.5,112.5,230,SBD
1,Jasmine Bartlett,,F,BC,Open,Raw,68,69,125,132.5,-137.5,132.5,70,-72.5,72.5,72.5,157.5,165,170,170,375,SBD
2,Denae Swadden,,F,BC,Open,Raw,68.6,69,112.5,120,-125,120,70,75,77.5,77.5,150,160,162.5,162.5,360,SBD
3,Magdalena Mellema-Morgan,,F,BC,Open,Raw,67.8,69,110,117.5,122.5,122.5,70,75,77.5,77.5,147.5,152.5,157.5,157.5,357.5,SBD
4,Nicole Hawe,,F,BC,Open,Raw,66.6,69,125,135,137.5,137.5,65,70,72.5,72.5,135,145,-155,145,355,SBD
5,Natasha Kozak,,F,BC,Open,Raw,67,69,110,117.5,122.5,122.5,60,65,67.5,67.5,145,157.5,165,165,355,SBD
6,Lindsey Welgush,,F,BC,Open,Raw,66.4,69,135,142.5,-147.5,142.5,52.5,-55,55,55,-145,145,-167.5,145,342.5,SBD
7,Camilla Mann,,F,BC,Open,Raw,66.9,69,87.5,95,-100,95,65,-70,-70,65,135,145,152.5,152.5,312.5,SBD
1,Lisa Kitagawa,,F,BC,Open,Raw,73.5,76,150,165,-167.5,165,72.5,82.5,-85,82.5,172.5,190,-200,190,437.5,SBD
2,Jennifer Luther-Thomas,,F,BC,Open,Raw,75.9,76,157.5,167.5,175,175,72.5,77.5,-82.5,77.5,137.5,150,160,160,412.5,SBD
3,Andrea Chee,,F,BC,Open,Raw,74.3,76,147.5,155,157.5,157.5,67.5,72.5,-75,72.5,162.5,-172.5,-172.5,162.5,392.5,SBD
4,Shadie Bourget,,F,BC,Open,Raw,75.3,76,120,132.5,-137.5,132.5,85,92.5,-97.5,92.5,140,160,-170,160,385,SBD
5,Baylie Gigolyk,,F,MB,Open,Raw,75,76,127.5,135,140,140,65,70,-72.5,70,145,152.5,-160,152.5,362.5,SBD
6,Andrea Sebest,,F,BC,Open,Raw,74.5,76,115,120,125,125,60,-65,65,65,135,142.5,150,150,340,SBD
7,Haley Wilson,,F,BC,Open,Raw,73.2,76,120,125,130,130,57.5,62.5,-65,62.5,135,145,-152.5,145,337.5,SBD
8,Hailey Holliday,,F,BC,Open,Raw,73.4,76,110,117.5,-122.5,117.5,70,75,77.5,77.5,120,-127.5,135,135,330,SBD
1,Melissa Kasper,,F,BC,Open,Raw,80,84,145,157.5,-162.5,157.5,72.5,-77.5,-77.5,72.5,165,180,-187.5,180,410,SBD
2,Melanie Ong,,F,BC,Open,Raw,77.8,84,127.5,135,140,140,67.5,72.5,77.5,77.5,127.5,135,140,140,357.5,SBD
3,Anca Bosnea,,F,BC,Open,Raw,82.5,84,120,127.5,132.5,132.5,62.5,67.5,70,70,127.5,137.5,147.5,147.5,350,SBD
1,Mackenzie Lee,,F,BC,Open,Raw,111.5,84+,192.5,202.5,212.5,212.5,120,130,136.5,136.5,200,215,227.5,227.5,576.5,SBD
2,Anne Andres,,F,AB,Open,Raw,104.5,84+,-177.5,-177.5,177.5,177.5,110,115,-117.5,115,222.5,227.5,-232.5,227.5,520,SBD
3,Tammy Drover,,F,BC,Open,Raw,95,84+,157.5,167.5,175,175,87.5,95,-100,95,142.5,155,-162.5,155,425,SBD
4,Barbara-Ann Kubb,,F,BC,Open,Raw,118.6,84+,152.5,162.5,170,170,77.5,82.5,-87.5,82.5,145,160,167.5,167.5,420,SBD
5,Stephanie Wilson #3,,F,BC,Open,Raw,142.4,84+,-165,-165,165,165,-90,90,-92.5,90,-120,120,130,130,385,SBD
6,Jessica Hume,,F,BC,Open,Raw,92.5,84+,142.5,152.5,157.5,157.5,57.5,65,-72.5,65,147.5,157.5,-162.5,157.5,380,SBD
7,Sharon Wekel,,F,BC,Open,Raw,126.8,84+,105,112.5,117.5,117.5,65,67.5,70,70,135,145,155,155,342.5,SBD
1,Michelle Vandegriend,,F,AB,Masters 1,Raw,55.81,57,90,95,-105,95,55,62.5,65,65,130,140,150,150,310,SBD
2,Asia Young,,F,BC,Masters 1,Raw,54.87,57,67.5,72.5,80,80,55,-62.5,62.5,62.5,75,80,-102.5,80,222.5,SBD
1,Janie Jacobucci,,F,MB,Masters 1,Raw,60.93,63,130,-137.5,137.5,137.5,72.5,-77.5,77.5,77.5,152.5,162.5,169,169,384,SBD
2,Tara Bohune,,F,BC,Masters 1,Raw,61.44,63,95,100,102.5,102.5,62.5,65,-67.5,65,157.5,163,168,168,335.5,SBD
3,Nicole Hart #1,,F,BC,Masters 1,Raw,61.53,63,100,107.5,112.5,112.5,52.5,57.5,60,60,110,-117.5,-117.5,110,282.5,SBD
1,Carmela Smythe,,F,BC,Masters 1,Raw,67.24,69,100,102.5,-105,102.5,60,-65,-65,60,125,132.5,-137.5,132.5,295,SBD
1,Morgan Haupt,,F,BC,Masters 1,Raw,83.58,84,120,125,130,130,70,72.5,-75,72.5,137.5,147.5,155,155,357.5,SBD
2,Hannah Gray,,F,AB,Masters 1,Raw,83.39,84,120,-127.5,127.5,127.5,57.5,60,-62.5,60,130,140,-145,140,327.5,SBD
1,Aimee Mergaert,,F,BC,Masters 1,Raw,132.66,84+,145,155,165,165,80,85,90,90,145,155,165,165,420,SBD
2,Kimberley Hess,,F,BC,Masters 1,Raw,104.76,84+,130,140,-147.5,140,70,75,-80,75,155,165,170,170,385,SBD
3,Dana Sandler,,F,AB,Masters 1,Raw,93.82,84+,105,115,127.5,127.5,80,85,-87.5,85,137.5,147.5,152.5,152.5,365,SBD
4,Mary-Ann Middleton,,F,BC,Masters 1,Raw,91.22,84+,97.5,107.5,115,115,55,60,-62.5,60,110,120,130,130,305,SBD
1,Janique Lafond,,F,AB,Masters 2,Raw,50.55,52,97.5,105,-111,105,47.5,-52.5,-52.5,47.5,107.5,117.5,-122.5,117.5,270,SBD
1,Wendy Yamazaki,,F,BC,Masters 2,Raw,55.35,57,80,85,-87.5,85,55,57.5,-60,57.5,112.5,122.5,-125,122.5,265,SBD
2,Meghan O'Connell,,F,BC,Masters 2,Raw,55.94,57,62.5,70,72.5,72.5,37.5,45,-47.5,45,80,90,97.5,97.5,215,SBD
1,Neilane Mayhew,,F,BC,Masters 2,Raw,62.71,63,85,92.5,97.5,97.5,42.5,45,47.5,47.5,115,117.5,130,130,275,SBD
2,Candace Daher,,F,MB,Masters 2,Raw,60.16,63,-87.5,87.5,-95,87.5,50,-52.5,-52.5,50,127.5,132.5,137.5,137.5,275,SBD
1,Kathleen Thomson,,F,BC,Masters 2,Raw,70.79,76,97.5,105,107.5,107.5,-52.5,55,57.5,57.5,110,120,-127.5,120,285,SBD
1,Katherine Lawrence,,F,BC,Masters 2,Raw,82.3,84,135,142.5,150,150,67.5,72.5,-75,72.5,147.5,157.5,-160,157.5,380,SBD
1,Brenda Lee Billings,,F,MB,Masters 2,Raw,100.17,84+,115,117.5,122.5,122.5,50,52.5,55,55,112.5,115,122.5,122.5,300,SBD
1,Monica Ma,,F,BC,Masters 3,Raw,43.44,47,60,65,67.5,67.5,32.5,35,-37.5,35,90,95,100,100,202.5,SBD
1,Sharlene Brunjes,,F,BC,Masters 3,Raw,60.49,63,77.5,85,90,90,37.5,40,-42.5,40,110,120,-130,120,250,SBD
1,Gail-Ann Breese,,F,MB,Masters 3,Raw,65.98,69,90,97.5,100,100,52.5,-55,55,55,130,137.5,-145,137.5,292.5,SBD
2,Katherine Sartor,,F,BC,Masters 3,Raw,63.16,69,77.5,85,90,90,42.5,47.5,52.5,52.5,82.5,92.5,-107.5,92.5,235,SBD
1,Margot Croft,,F,BC,Masters 3,Raw,89.87,84+,82.5,87.5,92.5,92.5,52.5,55,-60,55,117.5,125,127.5,127.5,275,SBD
1,Kathlyn Jensen,,F,BC,Masters 4,Raw,59.93,63,-45,-45,45,45,42.5,-45,45,45,85,90,95,95,185,SBD
1,Ryan Semkiw,,M,BC,Sub-Juniors,Raw,63.2,66,105,-115,-117.5,105,60,-67.5,-70,60,145,147.5,-167.5,147.5,312.5,SBD
1,Kostyantyn Sosnyk,,M,BC,Sub-Juniors,Raw,71.84,74,205,215,-220,215,132.5,140,146.5,146.5,205,225,-240,225,586.5,SBD
2,Vincent Lo,,M,BC,Sub-Juniors,Raw,73.5,74,-192.5,-192.5,192.5,192.5,127.5,132.5,-137.5,132.5,220,-232.5,-232.5,220,545,SBD
3,Luke DeBoer,,M,AB,Sub-Juniors,Raw,73.09,74,182.5,195,-200,195,110,120,-125,120,200,215,-227.5,215,530,SBD
4,Bryan Rono,,M,BC,Sub-Juniors,Raw,72.01,74,162.5,172.5,-177.5,172.5,77.5,85,-90,85,192.5,202.5,210,210,467.5,SBD
5,Jason Ho Ho,,M,BC,Sub-Juniors,Raw,70.28,74,142.5,152.5,157.5,157.5,85,-90,92.5,92.5,172.5,185,192.5,192.5,442.5,SBD
1,Ryan Christopher Ho,,M,BC,Sub-Juniors,Raw,82.52,83,172.5,182.5,195,195,102.5,112.5,-120,112.5,200,-212.5,-212.5,200,507.5,SBD
1,Qiming Fan,,M,BC,Sub-Juniors,Raw,92.36,93,-215,-225,225,225,130,138,143,143,215,227.5,-241.5,227.5,595.5,SBD
2,Wayde Chan,,M,BC,Sub-Juniors,Raw,92.01,93,-175,195,-207.5,195,-95,102.5,-107.5,102.5,200,220,232.5,232.5,530,SBD
3,Jonas Mcallister,,M,BC,Sub-Juniors,Raw,90.39,93,175,190,192.5,192.5,105,112.5,-120,112.5,195,207.5,210,210,515,SBD
4,Mandeep Shoker,,M,BC,Sub-Juniors,Raw,91.16,93,165,185,-190,185,90,100,107.5,107.5,170,185,197.5,197.5,490,SBD
1,Carsen Phillips,,M,BC,Sub-Juniors,Raw,130.09,120+,250,260,-265,260,155,165,170,170,230,240,252.5,252.5,682.5,SBD
2,John Paul Ferrer,,M,BC,Sub-Juniors,Raw,133.56,120+,225,235,-250,235,130,140,145,145,250,260,278,278,658,SBD
1,Dickson Giang,,M,BC,Juniors,Raw,57.9,59,170,177.5,185,185,120,-125.5,125.5,125.5,230,-242.5,-242.5,230,540.5,SBD
2,Julian Ka Jun Mok,,M,BC,Juniors,Raw,58.2,59,160,170,177.5,177.5,80,87.5,95,95,210,-230,-230,210,482.5,SBD
3,Patrick Encarnacion,,M,MB,Juniors,Raw,58.3,59,137.5,142.5,147.5,147.5,80,85,-90,85,162.5,170,182.5,182.5,415,SBD
1,Mark Robles,,M,BC,Juniors,Raw,64.9,66,160,-175,-175,160,102.5,107.5,110,110,250,-260,-260,250,520,SBD
2,Aldrin De Asis,,M,BC,Juniors,Raw,63.8,66,145,-157.5,157.5,157.5,-112.5,112.5,-120,112.5,190,202.5,212.5,212.5,482.5,SBD
1,Hongming Tong,,M,AB,Juniors,Raw,73.33,74,230,245,255,255,150,157.5,162.5,162.5,257.5,277.5,290,290,707.5,SBD
2,Rheyden Le,,M,BC,Juniors,Raw,72.9,74,210,222.5,230,230,130,132.5,135,135,242.5,257.5,265,265,630,SBD
3,Logan Heffron,,M,AB,Juniors,Raw,72.88,74,200,210,220,220,132.5,135,140,140,245,252.5,265,265,625,SBD
4,Damian Hu,,M,BC,Juniors,Raw,72.84,74,220,-230,230,230,135,-142.5,-142.5,135,250,260,-262.5,260,625,SBD
5,Brandon Logan,,M,AB,Juniors,Raw,73.52,74,185,200,207.5,207.5,137.5,142.5,150,150,227.5,237.5,242.5,242.5,600,SBD
6,Namca Nguyen,,M,SK,Juniors,Raw,73.9,74,177.5,187.5,192.5,192.5,105,110,115,115,225,237.5,245,245,552.5,SBD
7,Jeffrey Choi,,M,BC,Juniors,Raw,72.04,74,-165,-172.5,172.5,172.5,115,122.5,127.5,127.5,185,195,202.5,202.5,502.5,SBD
DQ,Mario Ochoa,,M,AB,Juniors,Raw,72.37,74,165,-175,-175,165,-102.5,-112.5,-112.5,,,,,,,SBD
1,Burkely Theriault,,M,BC,Juniors,Raw,79.97,83,-235,-252.5,252.5,252.5,140,150,160,160,252.5,265,280,280,692.5,SBD
2,Kevin Belonio,,M,BC,Juniors,Raw,81.74,83,-260,260,-273,260,137.5,140,142.5,142.5,262.5,265,277.5,277.5,680,SBD
3,Michael Pacis,,M,AB,Juniors,Raw,81.85,83,205,220,227.5,227.5,137.5,147.5,-152.5,147.5,257.5,-272.5,277.5,277.5,652.5,SBD
4,Curtis Nelson,,M,BC,Juniors,Raw,81.88,83,210,225,237.5,237.5,142.5,150,155,155,230,242.5,247.5,247.5,640,SBD
5,Joshua Robles Jaurigue,,M,BC,Juniors,Raw,80.89,83,205,210,220,220,145,-150,-150,145,250,260,-282.5,260,625,SBD
6,Tung Hsuan Yen,,M,BC,Juniors,Raw,78.59,83,195,-202.5,-202.5,195,162.5,172.5,177.5,177.5,235,247.5,-265,247.5,620,SBD
7,Elvin Limpin,,M,AB,Juniors,Raw,81.4,83,190,200,207.5,207.5,130,137.5,142.5,142.5,192.5,212.5,-230,212.5,562.5,SBD
8,Harshabad Kang,,M,BC,Juniors,Raw,81.44,83,180,185,190,190,107.5,115,-117.5,115,235,242.5,250,250,555,SBD
9,Johnson Nguyen,,M,BC,Juniors,Raw,80.18,83,182.5,195,202.5,202.5,132.5,140,145,145,180,192.5,205,205,552.5,SBD
10,Lanz Salviejo,,M,BC,Juniors,Raw,81.03,83,175,-182.5,192.5,192.5,120,-125,-125,120,225,-237.5,-237.5,225,537.5,SBD
11,Brandon Ly,,M,BC,Juniors,Raw,78.11,83,-165,-175,175,175,95,102.5,105,105,200,207.5,-212.5,207.5,487.5,SBD
12,Ice Gerard Rabonza,,M,BC,Juniors,Raw,78.78,83,100,-102.5,-175,100,90,-150,-170,90,125,,,125,315,SBD
1,Alexander Wei Rui Ang,2000-01-07,M,BC,Juniors,Raw,92.03,93,250,-265,265,265,155,162.5,-167.5,162.5,315,335,-347.5,335,762.5,SBD
2,Carlo Hung,,M,BC,Juniors,Raw,89.93,93,215,225,-235,225,165,172.5,-177.5,172.5,265,280,-290,280,677.5,SBD
3,Mohanad Ibrahiem,,M,AB,Juniors,Raw,91.14,93,205,217.5,222.5,222.5,142.5,150,152.5,152.5,230,252.5,260,260,635,SBD
4,Bryan Yuen,,M,BC,Juniors,Raw,92.04,93,250,-265,-270,250,142.5,147.5,-152.5,147.5,230,-245,-245,230,627.5,SBD
5,Davis Hogg,,M,BC,Juniors,Raw,89.67,93,210,215,-230,215,125,132.5,-140,132.5,235,-250,252.5,252.5,600,SBD
6,Luc Renaud,,M,BC,Juniors,Raw,91.67,93,200,210,220,220,137.5,145,150,150,210,222.5,230,230,600,SBD
7,Parker Cole Wengryn,,M,AB,Juniors,Raw,91.2,93,215,225,230,230,115,122.5,127.5,127.5,230,240,242.5,242.5,600,SBD
8,Patrick Mok,,M,BC,Juniors,Raw,91.29,93,192.5,205,-215,205,115,120,-125,120,-215,215,235,235,560,SBD
9,David Thomas #18,,M,BC,Juniors,Raw,87.49,93,190,205,-210,205,110,120,125,125,215,230,-240,230,560,SBD
10,Gurjant Dhillon,,M,BC,Juniors,Raw,89.84,93,165,170,177.5,177.5,110,115,120,120,-232.5,240,247.5,247.5,545,SBD
1,Thomas Johnston #5,,M,BC,Juniors,Raw,101.84,105,250,-260,260,260,145,152.5,-160,152.5,-290,290,305,305,717.5,SBD
2,Mohit Parmar,,M,BC,Juniors,Raw,101.63,105,-215,220,222.5,222.5,125,135,142.5,142.5,235,245,255,255,620,SBD
3,Louis Latour,,M,BC,Juniors,Raw,100.56,105,185,195,207.5,207.5,135,147.5,157.5,157.5,215,240,252.5,252.5,617.5,SBD
4,Alexander Caflisch,,M,BC,Juniors,Raw,100.46,105,160,182.5,187.5,187.5,112.5,122.5,125,125,-212.5,217.5,-227.5,217.5,530,SBD
5,Gavin Appleton,,M,BC,Juniors,Raw,97.8,105,162.5,172.5,182.5,182.5,115,120,122.5,122.5,202.5,212.5,-215,212.5,517.5,SBD
1,Zaid Ibrahiem,,M,AB,Juniors,Raw,117.92,120,-255,-255,255,255,162.5,-170,-170,162.5,285,302.5,312.5,312.5,730,SBD
2,Colton Lajeunesse,,M,BC,Juniors,Raw,119.43,120,262.5,-267.5,270,270,167.5,-175,175,175,275,285,-292.5,285,730,SBD
3,Conor Mclaughin,,M,BC,Juniors,Raw,108.3,120,230,235,242.5,242.5,135,142.5,-145,142.5,257.5,267.5,277.5,277.5,662.5,SBD
4,Ethan Francis Edwards-joyce,,M,BC,Juniors,Raw,108.48,120,225,237.5,242.5,242.5,137.5,147.5,-155,147.5,235,255,-272.5,255,645,SBD
1,David Guangyao Lee,,M,BC,Open,Raw,58.6,59,-175,175,-182.5,175,115,120,-122.5,120,200,210,220,220,515,SBD
DQ,Benjamin Yu,,M,BC,Open,Raw,58.63,59,160,170,-177.5,170,-130,-130,130,130,-190,-195,-195,,,SBD
1,Stephen Cascioli,,M,BC,Open,Raw,65.68,66,195,205,215,215,130,137.5,142.5,142.5,220,230,-237.5,230,587.5,SBD
2,Jayms Kornelsen,,M,MB,Open,Raw,64.73,66,175,185,192.5,192.5,117.5,125,-130,125,220,237.5,245,245,562.5,SBD
3,Brennan Sampson,,M,MB,Open,Raw,65,66,147.5,155,162.5,162.5,105,112.5,-117.5,112.5,180,192.5,205,205,480,SBD
4,Benjamin Wangsawidjaja,,M,BC,Open,Raw,65.39,66,150,-160,160,160,117.5,-120,-120,117.5,-175,185,192.5,192.5,470,SBD
5,Jordan Smith #2,,M,MB,Open,Raw,64.64,66,165,-172.5,-172.5,165,110,-115,-115,110,185,192.5,-205,192.5,467.5,SBD
6,Rohit Malyala,,M,BC,Open,Raw,65.11,66,142.5,155,160,160,87.5,95,-100,95,190,205,-215,205,460,SBD
1,Jonathan Cruz #1,,M,BC,Open,Raw,72.5,74,227.5,237.5,245,245,147.5,152.5,-157.5,152.5,270,282.5,290,290,687.5,SBD
2,Thomas Pham,,M,BC,Open,Raw,73.5,74,200,210,220,220,142.5,150,157.5,157.5,270,282.5,-292.5,282.5,660,SBD
3,Murad Abbasov,,M,BC,Open,Raw,73.8,74,225,235,-240,235,142.5,150,155,155,235,-245,-245,235,625,SBD
4,Aaron Dixon,,M,BC,Open,Raw,74,74,210,215,-217.5,215,110,115,120,120,245,260,-272.5,260,595,SBD
5,Amado Cruz,,M,BC,Open,Raw,74,74,-207.5,217.5,230,230,105,112.5,-120,112.5,215,227.5,242.5,242.5,585,SBD
6,Daniel Nhung,,M,BC,Open,Raw,73.5,74,-185,185,-195,185,140,147.5,-150,147.5,220,232.5,242.5,242.5,575,SBD
7,Vasyl Frenchko,,M,BC,Open,Raw,73.3,74,205,215,-220,215,130,137.5,-142.5,137.5,205,215,-227.5,215,567.5,SBD
8,Yi-hsuan Andy Liao,,M,BC,Open,Raw,71.9,74,165,175,-182.5,175,147.5,155,-160,155,205,-220,220,220,550,SBD
9,Cody Dietrich,,M,MB,Open,Raw,72.4,74,170,175,185,185,112.5,117.5,122.5,122.5,227.5,240,-247.5,240,547.5,SBD
10,Robert Lim,,M,BC,Open,Raw,72.5,74,175,182.5,-187.5,182.5,130,135,-137.5,135,210,-227.5,-227.5,210,527.5,SBD
11,Anton Lin,,M,BC,Open,Raw,73.3,74,172.5,190,195,195,90,97.5,100,100,210,-230,230,230,525,SBD
12,Amos So,,M,BC,Open,Raw,72.3,74,-162.5,-162.5,162.5,162.5,142.5,150,-155,150,205,-215,-215,205,517.5,SBD
13,Matthew Lee,,M,BC,Open,Raw,73,74,147.5,152.5,155,155,100,102.5,105,105,192.5,202.5,-205,202.5,462.5,SBD
DQ,Vincent Wong,,M,BC,Open,Raw,70.4,74,190,205,-210,205,122.5,-127.5,-127.5,122.5,-247.5,-247.5,-247.5,,,SBD
1,Divine Wekwa,,M,BC,Open,Raw,81.49,83,-272.5,-272.5,272.5,272.5,150,-160,-160,150,280,290,-305,290,712.5,SBD
2,Bryce Thomson,,M,BC,Open,Raw,81.7,83,245,257.5,265,265,130,137.5,140,140,270,285,-292.5,285,690,SBD
3,Bryan Wong #1,,M,BC,Open,Raw,82.54,83,205,215,225,225,125,130,135,135,-255,-255,255,255,615,SBD
4,Carter Watts,,M,BC,Open,Raw,79.88,83,187.5,197.5,210,210,130,140,147.5,147.5,-230,245,257.5,257.5,615,SBD
5,Justin Schubert,,M,BC,Open,Raw,82.69,83,205,215,-217.5,215,-145,-145,145,145,235,-242.5,-242.5,235,595,SBD
6,Michael Brion,,M,BC,Open,Raw,81.86,83,190,200,-205,200,142.5,147.5,152.5,152.5,240,-255,-267.5,240,592.5,SBD
7,Michael Jaehwan Lee,,M,BC,Open,Raw,79.59,83,197.5,210,220,220,117.5,125,127.5,127.5,217.5,232.5,-240,232.5,580,SBD
8,Thomas Pachal,,M,MB,Open,Raw,82.08,83,185,195,200,200,-132.5,132.5,137.5,137.5,215,225,235,235,572.5,SBD
9,Zayne Jones,,M,BC,Open,Raw,78.95,83,192.5,207.5,217.5,217.5,102.5,110,115,115,195,210,225,225,557.5,SBD
10,Chun-huan Andy Tai,,M,BC,Open,Raw,81.86,83,162.5,170,177.5,177.5,140,145,147.5,147.5,195,207.5,215,215,540,SBD
11,Kevin Van Nguyen,,M,BC,Open,Raw,81.8,83,192.5,202.5,-207.5,202.5,25,75,95,95,225,235,-242.5,235,532.5,SBD
12,Nathan Tsui,,M,BC,Open,Raw,82.01,83,170,180,-190,180,105,-115,115,115,-192.5,192.5,-210,192.5,487.5,SBD
1,Jeffrey Zhang,,M,BC,Open,Raw,92.79,93,265,280,290,290,165,175,180,180,290,-307.5,-307.5,290,760,SBD
2,Zachary Reimer,,M,BC,Open,Raw,92.7,93,275,285,-287.5,285,155,-160,-160,155,280,290,-292.5,290,730,SBD
3,Kenneth Mann,,M,BC,Open,Raw,90.87,93,207.5,217.5,-227.5,217.5,140,-145,145,145,230,240,252.5,252.5,615,SBD
4,Stephen Sulik,,M,MB,Open,Raw,92.42,93,207.5,217.5,-222.5,217.5,-145,145,150,150,210,220,-232.5,220,587.5,SBD
5,Shai Fridboim,,M,MB,Open,Raw,92.9,93,-205,-205,205,205,110,115,120,120,230,240,-247.5,240,565,SBD
6,Danny Astefan,,M,BC,Open,Raw,90.9,93,202.5,210,217.5,217.5,-102.5,105,-110,105,210,-220,225,225,547.5,SBD
7,Ian Cleary,,M,BC,Open,Raw,87.45,93,170,177.5,185,185,135,142.5,150,150,195,205,212.5,212.5,547.5,SBD
8,Chad Nabe,,M,BC,Open,Raw,88.67,93,182.5,192.5,205,205,117.5,127.5,-135,127.5,205,215,-227.5,215,547.5,SBD
9,Chenghao Qi,,M,BC,Open,Raw,90.9,93,155,165,-175,165,125,130,135,135,215,225,-235,225,525,SBD
10,Russell Carleton,,M,BC,Open,Raw,91.14,93,160,165,-172.5,165,125,-130,130,130,215,227.5,-235,227.5,522.5,SBD
11,Woohyun Choi,,M,BC,Open,Raw,91,93,160,167.5,172.5,172.5,115,120,-122.5,120,195,205,210,210,502.5,SBD
12,Taylor Patten,,M,BC,Open,Raw,88.1,93,155,165,-172.5,165,115,122.5,-127.5,122.5,202.5,215,-230,215,502.5,SBD
13,Paul Lastica,,M,BC,Open,Raw,90.3,93,-180,180,185,185,100,105,110,110,190,197.5,205,205,500,SBD
14,David Dar,,M,BC,Open,Raw,85.3,93,165,170,180,180,105,112.5,-115,112.5,175,190,-200,190,482.5,SBD
DQ,Benjamin Barak,,M,BC,Open,Raw,90,93,-165,165,180,180,-135,-140,-140,,,,,,,SBD
1,Alex Clayton #1,,M,MB,Open,Raw,101.65,105,275,282.5,-290,282.5,167.5,-177.5,-177.5,167.5,280,295,302.5,302.5,752.5,SBD
2,Michael Crowe,,M,AB,Open,Raw,103.6,105,225,232.5,240,240,152.5,160,-165,160,265,275,285,285,685,SBD
3,Alexander Mackinnon,,M,BC,Open,Raw,102.8,105,255,265,275,275,135,140,147.5,147.5,235,245,255,255,677.5,SBD
4,Christopher Handel,,M,AB,Open,Raw,101.95,105,240,-255,255,255,132.5,137.5,-142.5,137.5,260,275,282.5,282.5,675,SBD
5,Matthew Rud,,M,BC,Open,Raw,103.6,105,217.5,227.5,240,240,145,152.5,157.5,157.5,245,260,275,275,672.5,SBD
6,Scott Little,,M,AB,Open,Raw,97.8,105,225,-240,240,240,145,155,-157.5,155,250,265,-272.5,265,660,SBD
7,Darius Mavis,,M,BC,Open,Raw,94.7,105,212.5,230,240,240,107.5,117.5,125,125,-262.5,262.5,295,295,660,SBD
8,David Twomey,,M,BC,Open,Raw,98.6,105,220,230,240,240,145,152.5,155,155,245,257.5,265,265,660,SBD
9,Samuel Glennie,,M,BC,Open,Raw,104.2,105,187.5,200,215,215,132.5,-150,-150,132.5,247.5,260,272.5,272.5,620,SBD
10,Graham Aarsen,,M,BC,Open,Raw,95,105,175,182.5,190,190,170,177.5,185,185,210,230,240,240,615,SBD
11,Timothy Branch,,M,BC,Open,Raw,97.8,105,195,205,217.5,217.5,125,132.5,-137.5,132.5,225,240,250,250,600,SBD
12,Rodney Pinchbeck,,M,BC,Open,Raw,93.9,105,192.5,202.5,210,210,142.5,147.5,-152.5,147.5,222.5,232.5,242.5,242.5,600,SBD
13,Drew Simpson #1,,M,BC,Open,Raw,96.5,105,192.5,202.5,207.5,207.5,117.5,125,130,130,-232.5,232.5,245,245,582.5,SBD
14,David Noma,,M,BC,Open,Raw,99.9,105,200,207.5,-210,207.5,140,145,150,150,210,220,222.5,222.5,580,SBD
1,Andrew Stewart #1,,M,BC,Open,Raw,112.12,120,245,257.5,267.5,267.5,167.5,175,180,180,260,275,290,290,737.5,SBD
2,Christopher Soo,,M,BC,Open,Raw,116.68,120,-260,260,-272.5,260,160,167.5,-175,167.5,290,310,-317.5,310,737.5,SBD
3,Andrew Langelaar,,M,MB,Open,Raw,118.1,120,250,265,275,275,155,170,175,175,270,285,-300,285,735,SBD
4,Alexander Malouin,,M,AB,Open,Raw,107.68,120,180,197.5,205,205,120,130,-135,130,200,220,230,230,565,SBD
5,Isaiah Wolf,,M,BC,Open,Raw,115.99,120,-160,165,180,180,140,150,-152.5,150,190,200,215,215,545,SBD
1,Omo-ode Iweh,,M,BC,Open,Raw,137.58,120+,272.5,285,295,295,182.5,195,202.5,202.5,330,-342.5,-342.5,330,827.5,SBD
2,Laine Jackart,,M,BC,Open,Raw,125.57,120+,270,285,292.5,292.5,175,185,190,190,290,317.5,325,325,807.5,SBD
3,Troy Martins,,M,BC,Open,Raw,162.01,120+,270,285,300,300,180,187.5,192.5,192.5,277.5,292.5,300,300,792.5,SBD
4,Trevor Patten,,M,BC,Open,Raw,127.09,120+,212.5,227.5,245,245,152.5,162.5,170,170,245,262.5,277.5,277.5,692.5,SBD
5,Jorge Icabalceta Aust,,M,BC,Open,Raw,126.62,120+,207.5,-212.5,-212.5,207.5,-122.5,125,132.5,132.5,220,230,-240,230,570,SBD
1,Marc Mazzocchi,,M,BC,Masters 1,Raw,91.95,93,190,200,210,210,115,120,125,125,225,235,245,245,580,SBD
1,Geoffrey Robinson,,M,BC,Masters 1,Raw,114.03,120,205,217.5,227.5,227.5,117.5,127.5,-137.5,127.5,217.5,230,-240,230,585,SBD
1,Ian Worland,,M,BC,Masters 2,Raw,65.54,66,-142.5,142.5,-150,142.5,75,-77.5,-77.5,75,155,160,165,165,382.5,SBD
1,R. Tyler McPhail,,M,BC,Masters 2,Raw,98.42,105,190,202.5,212.5,212.5,137.5,147.5,-152.5,147.5,197.5,210,-222.5,210,570,SBD
2,Keith Evans #2,,M,BC,Masters 2,Raw,104.16,105,175,185,190,190,-115,120,125,125,200,215,-220,215,530,SBD
3,Jovanni Sy,,M,AB,Masters 2,Raw,100.54,105,147.5,-157.5,157.5,157.5,100,-105,-105,100,165,177.5,-182.5,177.5,435,SBD
1,Rolf Popp,,M,BC,Masters 3,Raw,104.69,105,172.5,182.5,-195,182.5,125,140,142.5,142.5,192.5,217.5,227.5,227.5,552.5,SBD
DQ,John Quinton,,M,BC,Masters 3,Raw,132.38,120+,-165,-165,-165,,,,,,,,,,,SBD
1,Donald Lovell,,M,BC,Masters 4,Raw,64.7,66,95,102.5,107.5,107.5,53,57.5,62.5,62.5,155,165,-175,165,335,SBD
1,Brent Davis,,M,BC,Masters 4,Raw,78.39,83,125,135,-140,135,80,-90,90,90,140,150,160,160,385,SBD
1,Sylvia Stockall-Douglas,,F,BC,Masters 3,Single-ply,62.68,63,70,85,-95,85,55,60,62.5,62.5,100,125,-140,125,272.5,SBD
1,Dustin Fraser,,M,SK,Open,Single-ply,92.68,93,270,280,-282.5,280,-177.5,177.5,185,185,260,272.5,280,280,745,SBD
2,Mehar Bhogal,,M,BC,Open,Single-ply,92.56,93,250,257.5,-267.5,257.5,207.5,215,217.5,217.5,235,255,267.5,267.5,742.5,SBD
1,Arshia Arshadi,,M,AB,Open,Single-ply,104.64,105,235,-245,-245,235,-192.5,195,200,200,235,-250,250,250,685,SBD
1,Cynthia Leighton,,F,BC,Masters 1,Raw,59.1,63,,,,,80,85,88,88,,,,,88,B
1,Carmela Smythe,,F,BC,Masters 1,Raw,66.9,69,,,,,60,65,67.5,67.5,,,,,67.5,B
1,Dana Sandler,,F,AB,Masters 1,Raw,93,84+,,,,,77.5,-85,85,85,,,,,85,B
2,Mary-Ann Middleton,,F,BC,Masters 1,Raw,91,84+,,,,,52.5,57.5,60,60,,,,,60,B
1,Monica Wille,,F,BC,Masters 3,Raw,83.1,84,,,,,72.5,77.5,80,80,,,,,80,B
1,Patricia Kowal,,F,BC,Masters 4,Raw,62,63,,,,,52.5,55,57.5,57.5,,,,,57.5,B
DQ,Rayan Armon Kia,,M,BC,Sub-Juniors,Raw,48.5,53,,,,,-86,-89,-89,,,,,,,B
1,Alexander Be,,M,BC,Sub-Juniors,Raw,69,74,,,,,60,-77.5,80,80,,,,,80,B
1,Kyle Tam,,M,BC,Open,Raw,65,66,,,,,-120,120,-122.5,120,,,,,120,B
1,Jeremy Klaus,,M,BC,Open,Raw,82.1,83,,,,,157.5,167.5,-170,167.5,,,,,167.5,B
1,Connor Trotter,,M,BC,Open,Raw,92.4,93,,,,,167.5,177.5,-182.5,177.5,,,,,177.5,B
1,Graham Aarsen,,M,BC,Open,Raw,94.8,105,,,,,165,175,182.5,182.5,,,,,182.5,B
2,David Noma,,M,BC,Open,Raw,99.9,105,,,,,145,152.5,-155,152.5,,,,,152.5,B
1,Frederic Fabi,,M,BC,Open,Raw,112.8,120,,,,,157.5,165,-172.5,165,,,,,165,B
2,Isaiah Wolf,,M,BC,Open,Raw,114.7,120,,,,,145,-152.5,-155,145,,,,,145,B
1,Ramis Be,,M,BC,Masters 2,Raw,76,83,,,,,130,-142.5,-142.5,130,,,,,130,B
1,Ward Plunet,,M,BC,Masters 3,Raw,64.3,66,,,,,65,70,72.5,72.5,,,,,72.5,B
1,Tommy Hoekstra,,M,AB,Masters 3,Raw,123.8,120+,,,,,135,140,145,145,,,,,145,B
2,John Quinton,,M,BC,Masters 3,Raw,132.9,120+,,,,,130,-137.5,-137.5,130,,,,,130,B
1,Don Lovell,,M,BC,Masters 4,Raw,64.3,66,,,,,50.5,55,60,60,,,,,60,B
1,Robin Wass,,M,NL,Masters 4,Raw,71.9,74,,,,,110,115,120,120,,,,,120,B
1,Sylvia Stockall-Douglas,,F,BC,Masters 3,Single-ply,63,63,,,,,55,75,-80,75,,,,,75,B
