{
    "user": {
        "email": "emailexample@email.com",
        "username": "exampleusername",
        "bio": null,
        "image": null,
        "token": "eyJhbGciOiJIUzI1NiIsInR5cCI6IkpXVCJ9.eyJlbWFpbCI6ImVtYWlsMzY0ODM2QGVtYWlsLmNvbSIsInVzZXJuYW1lIjoiYmRiZGtlbmRsa2RtbHNkayIsImlhdCI6MTY1Mzk5MTQ5NywiZXhwIjoxNjU5MTc1NDk3fQ.dIqidx1ak8ZgmA7kgOE3Wob9stnckDJ4tccMZA12A3E"
    }
}