Division,WeightClassKg,Place,Name,Team,BodyweightKg,Best3SquatKg,Best3BenchKg,Best3DeadliftKg,TotalKg,Equipment,Event,Sex
Boys,51.71,1,Johnny Adair,Sealy,48.99,154.22,74.84,170.1,399.16,Single-ply,SBD,M
Boys,51.71,2,Richie Villa,Bloomington,50.8,120.2,86.18,145.15,351.53,Single-ply,SBD,M
Boys,51.71,3,Jesse Jarmillo,Smithville,51.71,129.27,72.57,136.08,337.93,Single-ply,SBD,M
Boys,51.71,4,Jason Samaniego,Altair Rice,50.26,106.59,56.7,127.01,290.3,Single-ply,SBD,M
Boys,51.71,5,Troy Ogg,La Grange,50.35,92.99,63.5,104.33,260.82,Single-ply,SBD,M
Boys,51.71,6,Hunter Keszler,Ganado,50.35,102.06,54.43,97.52,254.01,Single-ply,SBD,M
Boys,51.71,7,Adam Morton,Louise,39.92,92.99,43.09,99.79,235.87,Single-ply,SBD,M
Boys,51.71,8,Chris Dickson,East Bernard,44.45,81.65,40.82,81.65,204.12,Single-ply,SBD,M
Boys,55.79,1,Michael Hernandez #6,East Bernard,55.79,129.27,77.11,154.22,360.61,Single-ply,SBD,M
Boys,59.87,2,Eric Bond,Bastrop,55.97,117.93,72.57,129.27,319.78,Single-ply,SBD,M
Boys,55.79,3,Matthew Galvez,El Maton Tidehaven,54.88,120.2,81.65,113.4,315.25,Single-ply,SBD,M
Boys,55.79,4,Luis Grijalva,Wallis Brazos,53.52,106.59,61.23,133.81,301.64,Single-ply,SBD,M
Boys,55.79,5,Rolando Moreno,Weimar,55.34,90.72,79.38,120.2,290.3,Single-ply,SBD,M
Boys,55.79,6,Chris Glass,Ganado,55.79,106.59,56.7,124.74,288.03,Single-ply,SBD,M
Boys,55.79,7,Hunter Shoppa,East Bernard,55.79,104.33,70.31,74.84,249.48,Single-ply,SBD,M
Boys,59.87,1,Jonathon Hardeway,Edna,58.51,165.56,115.67,185.97,467.2,Single-ply,SBD,M
Boys,59.87,2,Ubaldo Guzman,Weimar,59.87,167.83,111.13,172.37,451.32,Single-ply,SBD,M
Boys,59.87,3,Jorge Sanchez,Weimar,59.42,149.69,83.91,172.37,405.97,Single-ply,SBD,M
Boys,59.87,4,Kristian Grifaldo,Edna,59.42,167.83,83.91,154.22,405.97,Single-ply,SBD,M
Boys,59.87,5,Vinnie Maldanado,Smithville,56.7,138.35,97.52,163.29,399.16,Single-ply,SBD,M
Boys,59.87,6,Edder Ramirez,Brookshire Royal,58.97,124.74,74.84,142.88,342.46,Single-ply,SBD,M
Boys,59.87,7,Tyler Kurtz,East Bernard,58.06,120.2,56.7,136.08,312.98,Single-ply,SBD,M
Boys,67.13,1,Zach Konieczny,Sealy,65.77,174.63,117.93,179.17,471.74,Single-ply,SBD,M
Boys,67.13,2,Tomas Moreno,Weimar,61.69,176.9,90.72,188.24,455.86,Single-ply,SBD,M
Boys,67.13,3,Lance Howard,Altair Rice,63.41,183.7,97.52,172.37,453.59,Single-ply,SBD,M
Boys,67.13,4,Joseph Whitley,Altair Rice,67.13,163.29,99.79,181.44,444.52,Single-ply,SBD,M
Boys,67.13,5,Joe Flores,El Campo,62.6,154.22,124.74,158.76,437.72,Single-ply,SBD,M
Boys,74.84,6,Marcus Reed,Bastrop,67.36,163.29,99.79,172.37,435.45,Single-ply,SBD,M
Boys,67.13,7,Jeremy Jarrett,Edna,65.77,172.37,90.72,158.76,421.84,Single-ply,SBD,M
Boys,67.13,8,Eric Sanchez,Wallis Brazos,66.68,156.49,86.18,167.83,410.5,Single-ply,SBD,M
Boys,67.13,9,Derek Sless,Louise,66.68,154.22,95.25,156.49,405.97,Single-ply,SBD,M
Boys,67.13,10,Josh Mora,Wallis Brazos,63.96,149.69,90.72,158.76,399.16,Single-ply,SBD,M
Boys,67.13,11,Caleb Jones #6,Van Vleck,64.86,136.08,104.33,158.76,399.16,Single-ply,SBD,M
Boys,67.13,12,Tyler Garza,Boling,65.32,142.88,83.91,170.1,396.89,Single-ply,SBD,M
Boys,67.13,13,Juan Zamudio,Ganado,66.68,136.08,102.06,149.69,387.82,Single-ply,SBD,M
Boys,67.13,14,Gerardo Paredes,Brookshire Royal,62.6,142.88,86.18,131.54,360.61,Single-ply,SBD,M
Boys,67.13,15,Jerry Carrascora,El Campo,66.68,129.27,92.99,136.08,358.34,Single-ply,SBD,M
Boys,67.13,16,Gabe Valladares,Van Vleck,66.68,115.67,74.84,142.88,333.39,Single-ply,SBD,M
Boys,67.13,17,Dillon Davis #2,La Grange,65.32,117.93,68.04,131.54,317.51,Single-ply,SBD,M
Boys,67.13,18,Jacob Blazek,East Bernard,63.05,115.67,65.77,124.74,306.17,Single-ply,SBD,M
Boys,67.13,19,Johnathan Shreckengost,Ganado,64.86,97.52,61.23,142.88,301.64,Single-ply,SBD,M
Boys,67.13,20,Kyle Tucker,Hempstead,63.96,102.06,65.77,131.54,299.37,Single-ply,SBD,M
Boys,74.84,1,Wayne Foston,Van Vleck,74.84,226.8,136.08,217.72,580.6,Single-ply,SBD,M
Boys,74.84,2,Michael Hernandez #9,Brookshire Royal,74.84,183.7,133.81,233.6,551.11,Single-ply,SBD,M
Boys,74.84,3,Darius Battles,Hempstead,71.67,204.12,131.54,213.19,548.85,Single-ply,SBD,M
Boys,74.84,4,Tyler Sample,Edna,72.12,204.12,120.2,199.58,523.9,Single-ply,SBD,M
Boys,74.84,5,DeRon Bullard,Giddings,74.84,192.78,113.4,204.12,510.29,Single-ply,SBD,M
Boys,74.84,6,Jamy Adams,Altair Rice,71.94,204.12,102.06,179.17,485.34,Single-ply,SBD,M
Boys,74.84,7,Jontrey Goff,East Bernard,73.94,192.78,99.79,183.7,476.27,Single-ply,SBD,M
Boys,74.84,8,Gabe Almeida,Bellville,73.48,192.78,83.91,190.51,467.2,Single-ply,SBD,M
Boys,74.84,9,Cutberto Ramos,Ganado,71.67,170.1,113.4,181.44,464.93,Single-ply,SBD,M
Boys,74.84,10,Sotero Lara,Giddings,74.39,167.83,99.79,192.78,460.4,Single-ply,SBD,M
Boys,74.84,11,Jose Guzman,Bloomington,74.84,158.76,95.25,201.85,455.86,Single-ply,SBD,M
Boys,74.84,12,Logan Henslee,Louise,72.12,163.29,117.93,170.1,451.32,Single-ply,SBD,M
Boys,74.84,13,Skylar Shimek,La Grange,71.21,149.69,86.18,158.76,394.63,Single-ply,SBD,M
Boys,74.84,14,Abraham Montes,El Campo,68.95,138.35,111.13,140.61,390.09,Single-ply,SBD,M
Boys,74.84,15,Jared Zbranek,El Maton Tidehaven,74.84,147.42,92.99,149.69,390.09,Single-ply,SBD,M
Boys,74.84,16,Joshua Bishop,Louise,74.84,147.42,88.45,147.42,383.29,Single-ply,SBD,M
Boys,74.84,17,Allan Zapata,Brookshire Royal,74.84,145.15,79.38,158.76,383.29,Single-ply,SBD,M
Boys,74.84,18,Tanner Nelson,Bastrop,69.85,136.08,77.11,158.76,371.95,Single-ply,SBD,M
Boys,74.84,19,Cedric Perkins,East Bernard,68.04,138.35,65.77,161.03,365.14,Single-ply,SBD,M
Boys,74.84,20,Joey Lilly,Hempstead,72.12,136.08,77.11,149.69,362.87,Single-ply,SBD,M
Boys,74.84,21,Dillon Kuhlman,Ganado,73.94,127.01,83.91,145.15,356.07,Single-ply,SBD,M
Boys,74.84,22,Martine Rosales,Weimar,70.31,117.93,86.18,149.69,353.8,Single-ply,SBD,M
Boys,74.84,23,Jack Delmar,East Bernard,70.76,127.01,77.11,142.88,347,Single-ply,SBD,M
Boys,74.84,24,Derek Meyers,Ganado,71.67,120.2,79.38,147.42,347,Single-ply,SBD,M
Boys,74.84,25,Andrew Kubena,East Bernard,71.21,115.67,68.04,147.42,331.12,Single-ply,SBD,M
Boys,74.84,26,Ke'Von Brown,Edna,69.4,102.06,63.5,142.88,308.44,Single-ply,SBD,M
Boys,74.84,27,Abraham Juarez,Altair Rice,74.84,90.72,81.65,136.08,308.44,Single-ply,SBD,M
Boys,74.84,28,Barrett Janecek,East Bernard,72.12,86.18,54.43,113.4,254.01,Single-ply,SBD,M
Boys,82.1,1,D'Vonte Daniels,La Grange,81.19,254.01,158.76,238.14,650.91,Single-ply,SBD,M
Boys,82.1,2,Tyler McCoy,Giddings,78.93,260.82,147.42,231.33,639.57,Single-ply,SBD,M
Boys,82.1,3,Sam Bryant,Van Vleck,80.74,229.06,147.42,258.55,635.03,Single-ply,SBD,M
Boys,82.1,4,Thomas Ewing,Giddings,81.19,208.65,108.86,215.46,532.97,Single-ply,SBD,M
Boys,82.1,5,Brandon Lineda,Smithville,78.93,185.97,111.13,188.24,485.34,Single-ply,SBD,M
Boys,82.1,6,Cade Cihal,Ganado,80.74,190.51,106.59,183.7,480.81,Single-ply,SBD,M
Boys,82.1,7,Thomas Aguilar,Wallis Brazos,82.1,174.63,111.13,181.44,467.2,Single-ply,SBD,M
Boys,82.1,8,Cesar Garcia,East Bernard,78.93,183.7,92.99,183.7,460.4,Single-ply,SBD,M
Boys,82.1,9,Joseph Mendoza,Giddings,75.75,158.76,86.18,190.51,435.45,Single-ply,SBD,M
Boys,82.1,10,Zeke Tsika,El Campo,79.83,154.22,106.59,163.29,424.11,Single-ply,SBD,M
Boys,82.1,11,Doane Howard,Bastrop,81.19,133.81,79.38,142.88,356.07,Single-ply,SBD,M
Boys,82.1,12,Nathan Tovar,East Bernard,78.93,138.35,77.11,124.74,340.19,Single-ply,SBD,M
Boys,82.1,13,Matthew Kubena,East Bernard,82.1,99.79,49.9,113.4,263.08,Single-ply,SBD,M
Boys,82.1,14,Lucas Smith,Van Vleck,78.93,83.91,58.97,88.45,231.33,Single-ply,SBD,M
Boys,82.1,15,Martin Lopez,Brookshire Royal,78.93,70.31,31.75,70.31,172.37,Single-ply,SBD,M
Boys,82.1,DQ,Devon Pinon,Bloomington,78.93,165.56,92.99,,,Single-ply,SBD,M
Boys,89.81,1,Joseph Glenn,Giddings,83.46,229.06,136.08,238.14,603.28,Single-ply,SBD,M
Boys,99.79,2,Abraham Castillo,Altair Rice,90.04,235.87,122.47,213.19,571.53,Single-ply,SBD,M
Boys,89.81,3,Demarcus Tillman,Altair Rice,86.95,208.65,115.67,201.85,526.17,Single-ply,SBD,M
Boys,89.81,4,Joe Woodson,El Maton Tidehaven,87.54,195.04,111.13,215.46,521.63,Single-ply,SBD,M
Boys,89.81,5,James Garner,Altair Rice,86.23,204.12,115.67,199.58,519.36,Single-ply,SBD,M
Boys,89.81,6,Jeff McDonald,Van Vleck,88.9,181.44,111.13,176.9,469.47,Single-ply,SBD,M
Boys,89.81,7,James Vernon,El Maton Tidehaven,83.46,188.24,97.52,179.17,464.93,Single-ply,SBD,M
Boys,89.81,8,Sean Torres,Altair Rice,88.9,192.78,90.72,179.17,462.66,Single-ply,SBD,M
Boys,89.81,9,Matt Lamb,Van Vleck,83.46,181.44,104.33,165.56,451.32,Single-ply,SBD,M
Boys,89.81,10,Chris Cabrera,Bloomington,85.73,179.17,102.06,170.1,451.32,Single-ply,SBD,M
Boys,89.81,11,Jesse Soria,Altair Rice,89.09,158.76,90.72,170.1,419.57,Single-ply,SBD,M
Boys,89.81,12,Kenyatte Woodard,Boling,87.54,142.88,95.25,149.69,387.82,Single-ply,SBD,M
Boys,89.81,13,Irving Olvera,Boling,83.46,131.54,95.25,149.69,376.48,Single-ply,SBD,M
Boys,89.81,14,Jacob Garbs,Wallis Brazos,83.46,145.15,79.38,145.15,369.68,Single-ply,SBD,M
Boys,89.81,15,Dalton Blankemeyer,Bellville,87.54,104.33,90.72,140.61,335.66,Single-ply,SBD,M
Boys,89.81,16,Aaron Kieler,East Bernard,85.28,127.01,72.57,131.54,331.12,Single-ply,SBD,M
Boys,89.81,17,Zach Riley,East Bernard,89.81,131.54,61.23,136.08,328.85,Single-ply,SBD,M
Boys,89.81,18,Austen Williams,Bellville,89.36,124.74,83.91,113.4,322.05,Single-ply,SBD,M
Boys,89.81,19,Cody Schindler,La Grange,85.28,124.74,68.04,124.74,317.51,Single-ply,SBD,M
Boys,89.81,DQ,Kody Suilivan,Bastrop,88.45,115.67,,,,Single-ply,SBD,M
Boys,99.79,1,Wayne Lum,Bastrop,96.62,249.48,136.08,235.87,621.42,Single-ply,SBD,M
Boys,99.79,2,Cole Mayo,Brookshire Royal,94.35,217.72,161.03,208.65,587.4,Single-ply,SBD,M
Boys,99.79,3,Damarious Bluntson,Brookshire Royal,95.25,233.6,113.4,210.92,557.92,Single-ply,SBD,M
Boys,99.79,4,Derrick Watson,La Grange,90.72,226.8,124.74,204.12,555.65,Single-ply,SBD,M
Boys,99.79,5,Case Silliman,Ganado,97.52,215.46,136.08,204.12,555.65,Single-ply,SBD,M
Boys,99.79,6,Alex Tamez,Louise,96.62,242.67,117.93,188.24,548.85,Single-ply,SBD,M
Boys,99.79,7,Brandon Garay,Van Vleck,98.43,195.04,136.08,204.12,535.24,Single-ply,SBD,M
Boys,99.79,8,Aric Matura,East Bernard,92.08,201.85,124.74,165.56,492.15,Single-ply,SBD,M
Boys,99.79,9,Brian Branecky,Bastrop,92.99,204.12,99.79,172.37,476.27,Single-ply,SBD,M
Boys,99.79,10,Chris Marquez,Giddings,95.71,181.44,106.59,174.63,462.66,Single-ply,SBD,M
Boys,99.79,11,Danny Calixto,El Maton Tidehaven,96.62,192.78,115.67,151.95,460.4,Single-ply,SBD,M
Boys,99.79,12,Kegan Bledsoe,Smithville,98.88,204.12,88.45,163.29,455.86,Single-ply,SBD,M
Boys,99.79,13,Jordan Darr,East Bernard,91.17,165.56,102.06,174.63,442.25,Single-ply,SBD,M
Boys,99.79,14,Tanner Chavana,Bloomington,97.07,181.44,102.06,151.95,435.45,Single-ply,SBD,M
Boys,99.79,15,Anthony Serio,Altair Rice,95.3,161.03,90.72,158.76,410.5,Single-ply,SBD,M
Boys,99.79,16,Max Aguayo,Bloomington,93.44,163.29,86.18,142.88,392.36,Single-ply,SBD,M
Boys,99.79,17,Joel Grimaldo,Hempstead,91.63,129.27,77.11,142.88,349.27,Single-ply,SBD,M
Boys,99.79,DQ,Warren Hernandez,Edna,93.44,149.69,,,,Single-ply,SBD,M
Boys,109.77,1,Morgan Hohle,Giddings,109.32,267.62,190.51,240.4,698.53,Single-ply,SBD,M
Boys,109.77,2,Rj Rubesh,Louise,109.32,276.69,156.49,215.46,648.64,Single-ply,SBD,M
Boys,109.77,3,Desmond Pulliam,Louise,103.87,226.8,149.69,238.14,614.62,Single-ply,SBD,M
Boys,109.77,4,Anthony Rivera,Bastrop,108.41,183.7,83.91,174.63,442.25,Single-ply,SBD,M
Boys,109.77,5,Robert Ortiz,El Maton Tidehaven,100.7,165.56,92.99,158.76,417.3,Single-ply,SBD,M
Boys,109.77,DQ,Justin McCarrell,Edna,109.77,176.9,,,,Single-ply,SBD,M
Boys,109.77,DQ,Emmanuel Salinas,Bellville,106.59,204.12,,,,Single-ply,SBD,M
Boys,124.74,1,Jesse Burtschell,Sealy,123.38,322.05,244.94,283.5,850.49,Single-ply,SBD,M
Boys,124.74,2,Jonovan Allen,Altair Rice,110.31,233.6,131.54,260.82,625.96,Single-ply,SBD,M
Boys,124.74,3,Chad Childs,La Grange,119.75,226.8,158.76,226.8,612.35,Single-ply,SBD,M
Boys,124.74,4,Jaylon Bradford,Louise,116.12,215.46,124.74,233.6,573.79,Single-ply,SBD,M
Boys,124.74,5,Denton Lesak,Ganado,124.28,215.46,117.93,206.38,539.77,Single-ply,SBD,M
Boys,124.74,6,Logan Robinson,Edna,119.75,213.19,111.13,199.58,523.9,Single-ply,SBD,M
Boys,124.74,7,Robert Kitchen,La Grange,124.74,219.99,131.54,156.49,508.02,Single-ply,SBD,M
Boys,124.74,8,Devin Roberts,Brookshire Royal,124.74,188.24,122.47,190.51,501.22,Single-ply,SBD,M
Boys,124.74,9,Daniel Velasquez,La Grange,122.02,190.51,106.59,163.29,460.4,Single-ply,SBD,M
Boys,124.74,10,Will Malek,Ganado,118.84,165.56,115.67,170.1,451.32,Single-ply,SBD,M
Boys,124.74+,1,Johnathan Ramirez,Giddings,145.15,235.87,151.95,226.8,614.62,Single-ply,SBD,M
Boys,124.74+,2,Chad Davis #3,Altair Rice,129.55,229.06,136.08,226.8,591.94,Single-ply,SBD,M
Boys,124.74+,3,Timmy Varela,Bellville,132.45,233.6,151.95,199.58,585.13,Single-ply,SBD,M
Boys,124.74+,4,Derek Fiew,Edna,143.79,258.55,113.4,190.51,562.45,Single-ply,SBD,M
Boys,124.74+,5,Luis Medina,Sealy,125.19,235.87,136.08,185.97,557.92,Single-ply,SBD,M
Boys,124.74+,6,Jody Lilley,Sealy,127.46,210.92,154.22,190.51,555.65,Single-ply,SBD,M
Boys,124.74+,7,Danny Bricker,Giddings,141.07,222.26,113.4,208.65,544.31,Single-ply,SBD,M
Boys,124.74+,8,Alec Gilliam,Bellville,133.36,199.58,149.69,192.78,542.04,Single-ply,SBD,M
Boys,124.74+,9,Robert Kubena,East Bernard,129.27,102.06,68.04,129.27,299.37,Single-ply,SBD,M
