Place,Name,Sex,BirthDate,Age,Equipment,Division,BodyweightKg,WeightClassKg,Squat1Kg,Squat2Kg,Squat3Kg,Best3SquatKg,Bench1Kg,Bench2Kg,Bench3Kg,Best3BenchKg,Deadlift1Kg,Deadlift2Kg,Deadlift3Kg,Best3DeadliftKg,TotalKg,Event
DQ,Helen Collier,F,2003-01-05,21,Wraps,J20-23,74.5,75,-105,-105,105,105,,,,,,,,,,SBD
1,Kat Biscocho,F,1997-04-29,27,Raw,Open,48,48,40,50,55,55,25,27.5,30,30,70,80,90,90,175,SBD
1,Dani Biscocho,F,1998-04-30,26,Raw,Open,51.4,52,100,107.5,-112.5,107.5,50,55,-60,55,110,120,127.5,127.5,290,SBD
2,Billie Zhang,F,1993-09-22,30,Raw,Open,50.95,52,60,65,-70,65,-35,35,37.5,37.5,90,-100,100,100,202.5,SBD
1,Charlotte Miller,F,1993-10-19,30,Wraps,Open,65.45,67.5,135,145,152.5,152.5,70,75,-80,75,140,150,160,160,387.5,SBD
1,Ines Naylor,F,1999-01-14,25,Wraps,Open,71.8,75,120,130,-140,130,65,70,72.5,72.5,120,130,142.5,142.5,345,SBD
2,Madeleine Villani,F,1997-05-21,27,Raw,Open,71.85,75,62.5,70,75,75,32.5,37.5,42.5,42.5,95,105,112.5,112.5,230,SBD
1,Hayley Bradley,F,1996-05-22,28,Raw,Open,79,82.5,115,122.5,127.5,127.5,70,75,-77.5,75,125,137.5,145,145,347.5,SBD
2,Cyntarrah Gallagher,F,1997-02-03,27,Raw,Open,76.25,82.5,110,120,125,125,52.5,57.5,-60,57.5,130,140,150,150,332.5,SBD
1,Snow Sulman,F,1996-03-04,28,Wraps,Open,83.85,90,-92.5,92.5,-105,92.5,-47.5,52.5,55,55,105,-115,-115,105,252.5,SBD
1,Abbey Humble,F,1994-04-14,30,Wraps,Open,119.4,125,165,180,192.5,192.5,67.5,75,77.5,77.5,170,190,-195,190,460,SBD
1,Verity Kalika,F,1994-10-05,29,Raw,Open,54.7,56,,,,,47.5,52.5,-55,52.5,135,145,-150,145,197.5,BD
1,Katie McKimmie,F,1996-10-14,27,Raw,Open,105.7,110,,,,,42.5,45,-47.5,45,95,105,110,110,155,BD
1,Yvonne Odell,F,1980-03-14,44,Single-ply,M40-49,76.75,82.5,,,,,65,70,-72.5,70,,,,,70,B
1,Esther Wang,F,1996-11-24,27,Raw,Open,55.35,56,,,,,,,,,135,145,-150,145,145,D
1,Haylee Antonio,F,1997-02-16,27,Raw,Open,170.1,140+,,,,,,,,,155,170,-180,170,170,D
1,Anthony Zanti,M,2001-03-31,23,Wraps,J20-23,79.5,82.5,-160,160,170,170,105,-112.5,-112.5,105,175,195,215,215,490,SBD
1,Darcy Madigan,M,2004-05-14,20,Wraps,J20-23,87.1,90,150,165,175,175,110,120,125,125,205,220,230,230,530,SBD
1,Vincent Baltazar,M,2001-08-12,22,Wraps,J20-23,98.5,100,170,185,-195,185,72.5,82.5,-90,82.5,160,175,187.5,187.5,455,SBD
1,Declan Heenan,M,2003-01-04,21,Raw,J20-23,108.3,110,195,205,210,210,120,127.5,-135,127.5,220,230,240,240,577.5,SBD
1,Richard Dienjes,M,1984-04-12,40,Wraps,M40-49,88.55,90,-180,200,210,210,110,-120,-120,110,230,250,260,260,580,SBD
1,Jaiden Roe,M,1999-11-24,24,Raw,Open,73.1,75,160,180,190,190,120,-125,130,130,-200,225,240.5,240.5,560.5,SBD
1,Christopher Kahovec,M,1987-07-15,36,Raw,Open,80.6,82.5,150,165,175,175,97.5,105,-110,105,180,195,-210,195,475,SBD
1,Thien-Chuong Vu,M,1998-02-11,26,Raw,Open,90,90,175,185,192.5,192.5,122.5,130,135,135,225,245,260,260,587.5,SBD
2,Anthony Briggs,M,1994-08-05,29,Raw,Open,83.55,90,200,210,-220,210,130,135,140.5,140.5,205,220,235,235,585.5,SBD
1,Daniel Featherston,M,1999-10-30,24,Raw,Open,99.4,100,200,220,,220,150,155,-160,155,245,260,275,275,650,SBD
2,Timothy Sharp #1,M,1994-01-12,30,Wraps,Open,94.3,100,175,185,195,195,95,102.5,,102.5,195,210,220,220,517.5,SBD
1,Aris Likiardopoulos,M,1990-05-25,34,Wraps,Open,109.95,110,145,160,,160,75,82.5,90,90,155,170,180,180,430,SBD
1,Ryan Elliot,M,1994-07-08,29,Wraps,Open,120.6,125,195,210,220,220,105,110,112.5,112.5,220,240,-250,240,572.5,SBD
2,Rhys McAlister,M,1999-04-14,25,Wraps,Open,122.5,125,155,167.5,175,175,62.5,72.5,80,80,175,190,205,205,460,SBD
1,Jo Cocker,M,1989-06-25,34,Wraps,Open,128.5,140,220,240,255,255,130,145,-160,145,260,285,300,300,700,SBD
1,Giacomo Singh Navagero,M,2007-07-04,16,Raw,T14-16,72.3,75,120,140,150,150,77.5,85,95,95,135,145,160,160,405,SBD
1,Ryan Baldacchino,M,1991-12-15,32,Single-ply,Open,121.25,125,220,240,,240,112.5,125,132.5,132.5,235,255,-272.5,255,627.5,SBD
1,Mike Van,M,1984-07-18,39,Raw,Open,131.9,140,,,,,92.5,100,-105,100,155,170,180,180,280,BD
1,Gavin Ratcliffe,M,1989-10-19,34,Raw,Open,110,110,,,,,195,202.5,-207.5,202.5,,,,,202.5,B
