Division,WeightClassKg,Place,Name,Team,BodyweightKg,Best3SquatKg,Best3BenchKg,Best3DeadliftKg,TotalKg,Equipment,Event,Sex,BirthDate
Boys,51.71,1,Julio Velasco,Brownsville Lopez,48.63,122.47,70.31,142.88,335.66,Single-ply,SBD,M,
Boys,51.71,2,Israel Juarez,San Benito,49.9,140.61,70.31,108.86,319.78,Single-ply,SBD,M,
Boys,51.71,3,Gabriel Ozuna,Edinburg Vela,51.3,102.06,58.97,115.67,276.69,Single-ply,SBD,M,
Boys,51.71,4,Aaron Flores #4,Edinburg Vela,51.35,61.23,61.23,104.33,226.8,Single-ply,SBD,M,
Boys,51.71,5,Joseph Brock,Brownsville Veterans Memorial,47.54,70.31,38.56,79.38,188.24,Single-ply,SBD,M,
Boys,55.79,1,Lucio Zamora,Brownsville Lopez,53.71,115.67,68.04,133.81,317.51,Single-ply,SBD,M,
Boys,59.87,1,Joe Sanchez,Brownsville Veterans Memorial,58.58,124.74,77.11,120.2,322.05,Single-ply,SBD,M,
Boys,67.13,1,Dylan Ybarra,San Benito,66.68,206.38,108.86,195.04,510.29,Single-ply,SBD,M,
Boys,67.13,2,Kyle Yanez,Edinburg Vela,66.76,197.31,106.59,197.31,501.22,Single-ply,SBD,M,
Boys,67.13,3,Yashid Cobos,Edinburg Vela,65.36,167.83,111.13,183.7,462.66,Single-ply,SBD,M,
Boys,74.84,1,Brandon Compian,San Benito,74.84,199.58,133.81,188.24,521.63,Single-ply,SBD,M,
Boys,74.84,2,Diego Sixtos,Brownsville Lopez,74.12,197.31,117.93,190.51,505.76,Single-ply,SBD,M,
Boys,74.84,3,Fernando Guzman,Edinburg Vela,74.12,170.1,127.01,188.24,485.34,Single-ply,SBD,M,
Boys,74.84,4,Brandon Chapa,Edinburg Vela,74.39,174.63,124.74,176.9,476.27,Single-ply,SBD,M,
Boys,74.84,5,Ivan Rangel,Brownsville Veterans Memorial,69.44,156.49,113.4,138.35,408.23,Single-ply,SBD,M,
Boys,74.84,6,Bryan Huffman,Edinburg Vela,71.67,145.15,92.99,163.29,401.43,Single-ply,SBD,M,
Boys,74.84,DQ,Troy Castillo,San Benito,70.76,181.44,,,,Single-ply,SBD,M,
Boys,74.84,DQ,Eddie Slovack,Brownsville Lopez,69.49,,,,,Single-ply,SBD,M,
Boys,82.1,1,Andrew Radar,Brownsville Lopez,77.56,224.53,124.74,199.58,548.85,Single-ply,SBD,M,
Boys,82.1,2,Ruben Trevino,Edinburg Vela,79.47,183.7,102.06,210.92,496.68,Single-ply,SBD,M,
Boys,82.1,3,Gary Bardales,Brownsville Veterans Memorial,80.83,183.7,97.52,156.49,437.72,Single-ply,SBD,M,
Boys,82.1,4,Miguel Selvera,Brownsville Veterans Memorial,81.69,165.56,106.59,158.76,430.91,Single-ply,SBD,M,
Boys,82.1,DQ,Atticus De Leon,San Benito,79.65,206.38,,,,Single-ply,SBD,M,
Boys,89.81,1,Robert Trevino,San Benito,88.18,242.67,131.54,235.87,610.08,Single-ply,SBD,M,
Boys,89.81,2,Tyler Hite,San Benito,87.15,208.65,133.81,206.38,548.85,Single-ply,SBD,M,
Boys,89.81,3,Jaime Martínez,Brownsville Veterans Memorial,84.41,204.12,115.67,172.37,492.15,Single-ply,SBD,M,
Boys,89.81,4,Jacob Rosas,Brownsville Veterans Memorial,88.9,192.78,124.74,158.76,476.27,Single-ply,SBD,M,
Boys,89.81,5,Sebastian Bautista,San Benito,85.09,174.63,111.13,183.7,469.47,Single-ply,SBD,M,
Boys,89.81,DQ,Joshua Gallegos,Edinburg Vela,85.32,183.7,,,,Single-ply,SBD,M,
Boys,99.79,1,Nova Bajaran,San Benito,93.44,244.94,136.08,199.58,580.6,Single-ply,SBD,M,
Boys,99.79,2,Omar Cervantes,Brownsville Lopez,94.85,244.94,142.88,183.7,571.53,Single-ply,SBD,M,
Boys,99.79,3,Christian de la Garza,Brownsville Veterans Memorial,93.49,174.63,124.74,165.56,464.93,Single-ply,SBD,M,
Boys,109.77,1,Nate Garcia,San Benito,109.77,254.01,142.88,249.48,646.37,Single-ply,SBD,M,
Boys,109.77,2,Bryan Chavez,Brownsville Veterans Memorial,109.77,215.46,131.54,244.94,591.94,Single-ply,SBD,M,
Boys,109.77,DQ,Christian Rios,Edinburg Vela,99.84,192.78,,,,Single-ply,SBD,M,
Boys,124.74,1,Vicente Meza,Edinburg Vela,113.85,213.19,167.83,210.92,591.94,Single-ply,SBD,M,
Boys,124.74,2,Oscar Nieves,Brownsville Lopez,122.47,226.8,149.69,215.46,591.94,Single-ply,SBD,M,
Boys,124.74,3,Brandon Longoria,Brownsville Lopez,119.79,215.46,120.2,215.46,551.11,Single-ply,SBD,M,
Boys,124.74,4,Avery Breeden,Brownsville Veterans Memorial,115.3,219.99,138.35,183.7,542.04,Single-ply,SBD,M,
Boys,124.74,5,Matt Pinion,Brownsville Veterans Memorial,116.94,165.56,131.54,165.56,462.66,Single-ply,SBD,M,
Boys,124.74,DQ,Jonathon Paniagua,Brownsville Lopez,111.22,170.1,,,,Single-ply,SBD,M,
Boys,139.71,1,Marco Gamez,Edinburg Vela,136.62,256.28,174.63,247.21,678.12,Single-ply,SBD,M,
Boys,139.71,2,Frank Medina,San Benito,132.9,249.48,149.69,229.06,628.23,Single-ply,SBD,M,
Boys,139.71,3,Luis Rosalez,Brownsville Veterans Memorial,128,183.7,117.93,167.83,469.47,Single-ply,SBD,M,
Boys,139.71,4,Arturo Ruiz,Brownsville Lopez,127.46,136.08,61.23,170.1,367.41,Single-ply,SBD,M,
Boys,139.71,DQ,Matthew Vasquez,Brownsville Lopez,128,142.88,65.77,,,Single-ply,SBD,M,
Boys,139.71,DQ,Jose Martinez #3,San Benito,136.08,,,,,Single-ply,SBD,M,
