Name,BirthDate,Team,Sex,Age,Division,BodyweightKg,WeightClassKg,Squat1Kg,Squat2Kg,Squat3Kg,Squat4Kg,Best3SquatKg,Bench1Kg,Bench2Kg,Bench3Kg,Best3BenchKg,Deadlift1Kg,Deadlift2Kg,Deadlift3Kg,Best3DeadliftKg,TotalKg,Event,Equipment,Place
Karla Cabargas,1990-03-05,Hercules,F,31,Open,50.7,52,70,80,-90,,80,25,-30,30,30,80,90,105,105,215,SBD,Wraps,2
Cecilia Baeza,1969-12-21,Genesis,F,51,Open,52,52,-80,80,85,,85,30,35,37.5,37.5,90,100,105,105,227.5,SBD,Wraps,1
Adamari Pulgar,2004-08-22,Barra Barbara,F,17,Junior 15-19,55,56,75,85,-95,,85,-45,45,-50,45,115,125,132.5,132.5,262.5,SBD,Wraps,1
Adamari Pulgar,2004-08-22,Barra Barbara,F,17,Open,55,56,75,85,-95,,85,-45,45,-50,45,115,125,132.5,132.5,262.5,SBD,Wraps,1
Sharlotte Leiva,1996-09-02,Hercules,F,25,Open,59.4,60,60,65,72.5,,72.5,30,-32.5,-32.5,30,77.5,85,95,95,197.5,SBD,Wraps,3
Catalina Pineda Delano,1999-09-07,Berserker,F,22,Junior 20-23,58.3,60,112.5,120,122.5,,122.5,50,52.5,55,55,145,152.5,-160,152.5,330,SBD,Wraps,1
Catalina Pineda Delano,1999-09-07,Berserker,F,22,Open,58.3,60,112.5,120,122.5,,122.5,50,52.5,55,55,145,152.5,-160,152.5,330,SBD,Wraps,2
Marina Castillo #1,1994-06-22,Genesis,F,27,Open,57.8,60,150,160,,,160,60,70,75,75,150,160,170,170,405,SBD,Wraps,1
Patricia San Juan,1995-01-25,Helheim Powerlifting,F,26,Open,64.5,67.5,67.5,-72.5,75,,75,35,-40,-40,35,80,90,102.5,102.5,212.5,SBD,Wraps,3
Camila Muñoz,1997-04-05,Titanes Quirihue,F,24,Open,65.9,67.5,107.5,112.5,-117.5,,112.5,47.5,52.5,55,55,130,137.5,142.5,142.5,310,SBD,Wraps,2
Francis Rodriguez,1997-01-03,,F,24,Open,66.5,67.5,130,140,147.5,,147.5,60,65,-70,65,130,140,150,150,362.5,SBD,Wraps,1
Estefanía Mora,2001-06-20,Titanes Quirihue,F,20,Junior 20-23,74.5,75,-135,135,140,,140,50,55,-57.5,55,135,145,147.5,147.5,342.5,SBD,Wraps,1
Loreto Calderón,1981-10-03,Hercules,F,40,Master 40-44,71.3,75,115,120,125,,125,-62.5,62.5,65,65,132.5,140,150,150,340,SBD,Wraps,1
Estefanía Mora,2001-06-20,Titanes Quirihue,F,20,Open,74.5,75,-135,135,140,,140,50,55,-57.5,55,135,145,147.5,147.5,342.5,SBD,Wraps,1
Loreto Calderón,1981-10-03,Hercules,F,40,Open,71.3,75,115,120,125,,125,-62.5,62.5,65,65,132.5,140,150,150,340,SBD,Wraps,2
Diamela Estay,1995-11-18,Team Panda,F,26,Open,79.2,82.5,110,120,127.5,,127.5,75,80,82.5,82.5,135,150,160,160,370,SBD,Wraps,1
Constanza Espinoza,1991-04-09,Helheim Powerlifting,F,30,Open,106.7,90+,90,95,102.5,,102.5,50,57.5,-65,57.5,75,85,95,95,255,SBD,Wraps,1
Edward Verdejo,1999-08-01,Hercules,M,22,Junior 20-23,55.2,56,140,145,150,,150,77.5,-82.5,-82.5,77.5,162.5,170,-177.5,170,397.5,SBD,Wraps,1
Erick Muñoz,2006-04-16,,M,15,Junior 15-19,56.1,60,75,87.5,95,,95,47.5,52.5,-57.5,52.5,110,120,-130,120,267.5,SBD,Wraps,2
Hernan Diaz,2007-05-24,Titanes Quirihue,M,14,Youth,58.2,60,100,115,125,,125,52.5,57.5,62.5,62.5,110,120,130,130,317.5,SBD,Wraps,1
Bastian Ibañez,2002-10-16,Hienas,M,19,Junior 15-19,66.9,67.5,120,-130,135,,135,75,-85,-85,75,120,135,145,145,355,SBD,Wraps,1
Matias Quiñinao,1999-09-10,Powerturtle,M,22,Junior 20-23,66.5,67.5,140,150,-160,,150,-85,90,-92.5,90,175,190,200,200,440,SBD,Wraps,1
Edward Verdejo,1999-08-01,Hercules,M,22,Open,55.2,56,140,145,150,,150,77.5,-82.5,-82.5,77.5,162.5,170,-177.5,170,397.5,SBD,Wraps,1
Erick Muñoz,2006-04-16,,M,15,Open,56.1,60,75,87.5,95,,95,47.5,52.5,-57.5,52.5,110,120,-130,120,267.5,SBD,Wraps,2
Hernan Diaz,2007-05-24,Titanes Quirihue,M,14,Open,58.2,60,100,115,125,,125,52.5,57.5,62.5,62.5,110,120,130,130,317.5,SBD,Wraps,1
Bastian Ibañez,2002-10-16,Hienas,M,19,Open,66.9,67.5,120,-130,135,,135,75,-85,-85,75,120,135,145,145,355,SBD,Wraps,3
Matias Quiñinao,1999-09-10,Powerturtle,M,22,Open,66.5,67.5,140,150,-160,,150,-85,90,-92.5,90,175,190,200,200,440,SBD,Wraps,1
Jaime Cabezas,1995-11-13,Barra Barbara,M,26,Open,63.5,67.5,115,130,-140,,130,85,-90,90,90,180,200,-220,200,420,SBD,Wraps,2
Marcelo Squella,1989-04-03,Hercules,M,32,Open,73.6,75,140,145,155,,155,80,85,87.5,87.5,160,170,180,180,422.5,SBD,Wraps,3
Pedro Soto,2002-10-14,,M,19,Junior 15-19,69.5,75,160,165,170,175,170,100,105,110,110,200,205,220,220,500,SBD,Wraps,1
Pedro Soto,2002-10-14,,M,19,Open,69.5,75,160,165,170,175,170,100,105,110,110,200,205,220,220,500,SBD,Wraps,2
Arnaldo Salinas Sepúlveda,1983-04-01,Ludus Power Fitness,M,38,Open,74.6,75,267.5,292.5,300,,300,145,155,-157.5,155,262.5,287.5,-297.5,287.5,742.5,SBD,Wraps,1
Enzo Fernandez,1999-02-22,,M,22,Junior 20-23,77.2,82.5,115,120,-125,,120,-62.5,62.5,-67.5,62.5,130,140,145,145,327.5,SBD,Wraps,2
Enzo Fernandez,1999-02-22,,M,22,Open,77.2,82.5,115,120,-125,,120,-62.5,62.5,-67.5,62.5,130,140,145,145,327.5,SBD,Wraps,7
Luis Guillen,1991-11-07,Helheim Powerlifting,M,30,Open,81.6,82.5,115,-125,130,,130,-112.5,115,-117.5,115,170,-175,-180,170,415,SBD,Wraps,6
Gabriel Salamanca,1996-10-24,Copiapo,M,25,Open,81.5,82.5,140,150,160,,160,80,90,95,95,160,175,185,185,440,SBD,Wraps,5
Andres Teneb,1995-06-16,Helheim Powerlifting,M,26,Open,80.4,82.5,145,155,167.5,,167.5,-85,85,100,100,180,190,200,200,467.5,SBD,Wraps,3
Patricio Avendaño,1993-04-29,Helheim Powerlifting,M,28,Open,81.2,82.5,165,175,190,,190,102.5,110,-112.5,110,185,200,210,210,510,SBD,Wraps,2
Nicolas Muñoz,1994-10-02,Bulldogzer,M,27,Open,80.8,82.5,145,-155,-160,,145,95,-102.5,102.5,102.5,195,205,215,215,462.5,SBD,Wraps,4
David Troncoso,1998-02-28,Agogelifting,M,23,Junior 20-23,78.2,82.5,180,195,200,,200,140,145,,145,200,210,,210,555,SBD,Wraps,1
David Troncoso,1998-02-28,Agogelifting,M,23,Open,78.2,82.5,180,195,200,,200,140,145,,145,200,210,,210,555,SBD,Wraps,1
David Jofre,1994-04-28,Barra Barbara,M,27,Open,87.6,90,115,125,135,,135,70,-75,75,75,160,170,180,180,390,SBD,Wraps,7
Leandro Campos,2000-11-05,,M,21,Open,88.6,90,-145,155,162.5,,162.5,110,115,-120,115,175,190,205,205,482.5,SBD,Wraps,5
Rodrigo Rozas,1996-09-23,Bulldogzer,M,25,Open,87.6,90,-160,165,-172.5,,165,125,132.5,-135,132.5,185,195,-205,195,492.5,SBD,Wraps,3
Max Quezada,1996-01-26,Barra Barbara,M,25,Open,85.8,90,140,155,-165,,155,75,82.5,87.5,87.5,180,200,-210,200,442.5,SBD,Wraps,6
Rodrigo Bernal,1991-02-14,Hercules,M,30,Open,86.3,90,195,205,-215,,205,110,115,-117.5,115,200,210,-220,210,530,SBD,Wraps,2
Diego Acuña,1997-06-23,Agogelifting,M,24,Open,83,90,-165,165,170,,170,110,115,,115,235,245,260,260,545,SBD,Wraps,1
Danilo Vásquez,1990-07-16,,M,31,Open,84.4,90,180,-200,-200,,180,100,105,110,110,200,-215,,200,490,SBD,Wraps,4
Sergio Legue,1986-06-22,Hienas,M,35,Open,98.1,100,180,190,200,,200,100,-110,110,110,190,205,215,215,525,SBD,Wraps,2
Gabriel Piñol,1996-09-07,,M,25,Open,99.2,100,160,170,180,,180,90,95,-97.5,95,190,205,220,220,495,SBD,Wraps,3
Pablo Quintana,1995-08-04,Barra Barbara,M,26,Open,95.9,100,200,215,-225,,215,110,-115,-115,110,200,215,225,225,550,SBD,Wraps,1
Juan Fernandez,1996-12-22,Hienas,M,24,Open,107.5,110,230,-240,-245,,230,160,170,-180,170,230,-240,245,245,645,SBD,Wraps,2
Francisco Haquin,1997-04-11,Berserker,M,24,Open,107.1,110,235,-245,255,,255,130,137.5,-142.5,137.5,255,270,285,285,677.5,SBD,Wraps,1
