Division,WeightClassKg,Place,Name,Team,BodyweightKg,Best3SquatKg,Best3BenchKg,Best3DeadliftKg,TotalKg,Equipment,Event,Sex,BirthDate
Girls,44.23,1,Julie Jones,Grandview,42.82,74.84,38.56,86.18,199.58,Unlimited,SBD,F,
Girls,44.23,2,Peyton Powers,Troy,44,74.84,45.36,79.38,199.58,Unlimited,SBD,F,
Girls,44.23,3,Alyssa Ruiz,McGregor,43.82,65.77,29.48,77.11,172.37,Unlimited,SBD,F,
Girls,44.23,4,Natalye Oleaurre,Waco Connally,39.01,34.02,22.68,61.23,117.93,Unlimited,SBD,F,
Girls,47.85,1,Izzy Smith,China Spring,47.72,97.52,52.16,97.52,247.21,Unlimited,SBD,F,
Girls,47.85,2,Bayelyn Roberts,Gatesville,46.72,74.84,49.9,97.52,222.26,Unlimited,SBD,F,
Girls,47.85,3,Haleigh Lanmon,McGregor,46.81,81.65,47.63,83.91,213.19,Unlimited,SBD,F,
Girls,47.85,4,Hailey Roman,Waco Connally,47.81,70.31,40.82,90.72,201.85,Unlimited,SBD,F,
Girls,47.85,5,Yozzelin Sarabia,Waco La Vega,45.81,70.31,36.29,92.99,199.58,Unlimited,SBD,F,
Girls,47.85,6,Katie Baker,Killeen Harker Heights,45.45,31.75,20.41,45.36,97.52,Unlimited,SBD,F,
Girls,51.94,1,Mia Gonzalez,China Spring,51.62,127.01,61.23,129.27,317.51,Unlimited,SBD,F,
Girls,51.94,2,Karsen Fuessel,West,51.62,108.86,61.23,117.93,288.03,Unlimited,SBD,F,
Girls,51.94,3,Kasey Fitzer,Gatesville,50.71,90.72,68.04,102.06,260.82,Unlimited,SBD,F,
Girls,51.94,4,Paisley Wells,Gatesville,51.62,88.45,61.23,102.06,251.74,Unlimited,SBD,F,
Girls,51.94,5,Kenzi Jarrett,Killeen Harker Heights,50.44,77.11,61.23,90.72,229.06,Unlimited,SBD,F,
Girls,51.94,6,Britny Willis,Waco Connally,49.53,86.18,45.36,92.99,224.53,Unlimited,SBD,F,
Girls,51.94,7,Haven Berry,Lorena,50.89,77.11,49.9,90.72,217.72,Unlimited,SBD,F,
Girls,51.94,8,Emmely Sarabia,Waco La Vega,50.98,83.91,29.48,92.99,206.38,Unlimited,SBD,F,
Girls,51.94,9,Melany Nunez,Waco Connally,49.71,61.23,38.56,81.65,181.44,Unlimited,SBD,F,
Girls,51.94,10,Sierra Campbell,Moody,48.81,61.23,43.09,74.84,179.17,Unlimited,SBD,F,
Girls,51.94,11,Katie Van Dellen,Moody,50.17,52.16,29.48,58.97,140.61,Unlimited,SBD,F,
Girls,51.94,DQ,Hannah Halford,Troy,51.62,106.59,,,,Unlimited,SBD,F,
Girls,51.94,DQ,Madalynne Moore,Robinson,51.44,,,,,Unlimited,SBD,F,
Girls,56.02,1,Shamya Barrett,McGregor,55.97,113.4,65.77,127.01,306.17,Unlimited,SBD,F,
Girls,56.02,2,Peyton Ward,China Spring,53.16,92.99,58.97,113.4,265.35,Unlimited,SBD,F,
Girls,56.02,3,Bella Yerger,China Spring,55.79,95.25,52.16,106.59,254.01,Unlimited,SBD,F,
Girls,56.02,4,Kensley Eary,Gatesville,55.43,90.72,54.43,106.59,251.74,Unlimited,SBD,F,
Girls,56.02,5,Taytum Mertz,Troy,55.79,99.79,47.63,104.33,251.74,Unlimited,SBD,F,
Girls,56.02,6,Avery Roberts,China Spring,53.43,83.91,52.16,97.52,233.6,Unlimited,SBD,F,
Girls,56.02,7,Marin Seagraves,Gatesville,52.71,83.91,56.7,90.72,231.33,Unlimited,SBD,F,
Girls,56.02,8,Payton Lee,McGregor,54.7,86.18,54.43,90.72,231.33,Unlimited,SBD,F,
Girls,56.02,9,Brindley Dorris,Waco La Vega,53.34,79.38,52.16,79.38,210.92,Unlimited,SBD,F,
Girls,56.02,10,Gwen Cradduck,Grandview,52.8,70.31,29.48,97.52,197.31,Unlimited,SBD,F,
Girls,56.02,DQ,Ava Taylor,Killeen Harker Heights,54.34,72.57,,,,Unlimited,SBD,F,
Girls,60.1,1,Bailey Maedgen,Troy,56.88,138.35,77.11,147.42,362.87,Unlimited,SBD,F,
Girls,60.1,2,Addison Macik,West,59.33,136.08,65.77,136.08,337.93,Unlimited,SBD,F,
Girls,60.1,3,Mya Goldick,West,56.25,102.06,65.77,111.13,278.96,Unlimited,SBD,F,
Girls,60.1,4,Sarah Hand,China Spring,59.15,90.72,56.7,111.13,258.55,Unlimited,SBD,F,
Girls,60.1,5,Eleanor Otis,Lorena,56.7,102.06,52.16,99.79,254.01,Unlimited,SBD,F,
Girls,60.1,6,Liberty Braswell,Lorena,56.52,90.72,56.7,104.33,251.74,Unlimited,SBD,F,
Girls,60.1,7,Claire Penney,China Spring,59.24,92.99,63.5,92.99,249.48,Unlimited,SBD,F,
Girls,60.1,8,Gracie Schuetz,West,57.7,92.99,49.9,99.79,242.67,Unlimited,SBD,F,
Girls,60.1,9,Renessa Gonzalez,Waco La Vega,56.52,92.99,52.16,92.99,238.14,Unlimited,SBD,F,
Girls,60.1,10,Averie Gomez,McGregor,58.51,81.65,47.63,79.38,208.65,Unlimited,SBD,F,
Girls,60.1,11,Mayra Ibarra,Waco La Vega,58.69,97.52,38.56,70.31,206.38,Unlimited,SBD,F,
Girls,60.1,12,Megan Obstoj,Moody,59.24,65.77,40.82,83.91,190.51,Unlimited,SBD,F,
Girls,60.1,DQ,Azela Segura,Grandview,57.79,56.7,,,,Unlimited,SBD,F,
Girls,60.1,DQ,Gabriella Turnbo,Moody,58.24,63.5,,,,Unlimited,SBD,F,
Girls,60.1,DQ,Rylee Bethune,Killeen Harker Heights,59.06,68.04,,,,Unlimited,SBD,F,
Girls,67.36,1,Leslie Lara,West,62.51,140.61,74.84,151.95,367.41,Unlimited,SBD,F,
Girls,67.36,2,Roisin Healy,West,62.69,124.74,58.97,133.81,317.51,Unlimited,SBD,F,
Girls,67.36,3,Lilly Hackbart,Grandview,66.86,120.2,52.16,108.86,281.23,Unlimited,SBD,F,
Girls,67.36,4,Isabela Mondragon,Gatesville,61.23,111.13,58.97,106.59,276.69,Unlimited,SBD,F,
Girls,67.36,5,Aubrey Wynn,Lorena,63.14,102.06,56.7,113.4,272.16,Unlimited,SBD,F,
Girls,67.36,6,Hannah Dycus,Troy,66.13,83.91,52.16,97.52,233.6,Unlimited,SBD,F,
Girls,67.36,7,Reigen Davidson,Gatesville,63.5,88.45,47.63,90.72,226.8,Unlimited,SBD,F,
Girls,67.36,8,Deza McKenzie,Moody,66.32,81.65,49.9,95.25,226.8,Unlimited,SBD,F,
Girls,67.36,9,Kamden Waneck,Lorena,60.87,74.84,47.63,102.06,224.53,Unlimited,SBD,F,
Girls,67.36,10,Audrey Marek,West,62.69,86.18,40.82,88.45,215.46,Unlimited,SBD,F,
Girls,67.36,11,Hailey Christman,Moody,67.31,74.84,47.63,70.31,192.78,Unlimited,SBD,F,
Girls,67.36,12,Lilly Silva,Grandview,63.23,74.84,34.02,70.31,179.17,Unlimited,SBD,F,
Girls,67.36,13,Anahi Garcia,Moody,64.5,34.02,34.02,54.43,122.47,Unlimited,SBD,F,
Girls,67.36,DQ,Shaylie Teague,Gatesville,64.23,147.42,,,,Unlimited,SBD,F,
Girls,67.36,DQ,Ariel Dear,Troy,64.86,106.59,61.23,,,Unlimited,SBD,F,
Girls,67.36,DQ,Amy Keeland,Lorena,66.77,102.06,,,,Unlimited,SBD,F,
Girls,67.36,DQ,Abby Scherer,Lorena,65.05,70.31,,,,Unlimited,SBD,F,
Girls,67.36,DQ,Charmeshia Henry,Waco Connally,65.32,,,,,Unlimited,SBD,F,
Girls,75.07,1,JaeJae Phillips,Troy,72.21,165.56,115.67,165.56,446.79,Unlimited,SBD,F,
Girls,75.07,2,Haeley Willich,McGregor,74.66,124.74,68.04,136.08,328.85,Unlimited,SBD,F,
Girls,75.07,3,Lilyanne Arnold,Robinson,73.21,124.74,77.11,124.74,326.59,Unlimited,SBD,F,
Girls,75.07,4,Abigail Vasser,Lorena,70.22,136.08,61.23,124.74,322.05,Unlimited,SBD,F,
Girls,75.07,5,Gabby Gomez,Lorena,73.48,117.93,74.84,129.27,322.05,Unlimited,SBD,F,
Girls,75.07,6,Kyara Fite,Waco La Vega,69.22,111.13,65.77,136.08,312.98,Unlimited,SBD,F,
Girls,75.07,7,Misha Brownlee,Killeen Harker Heights,75.02,99.79,56.7,138.35,294.84,Unlimited,SBD,F,
Girls,75.07,8,Timia Bowers,McGregor,71.85,117.93,52.16,115.67,285.76,Unlimited,SBD,F,
Girls,75.07,9,Elly Hanks,Killeen Harker Heights,72.48,97.52,72.57,115.67,285.76,Unlimited,SBD,F,
Girls,75.07,10,Aaliyah Totten,China Spring,72.94,106.59,52.16,124.74,283.5,Unlimited,SBD,F,
Girls,75.07,11,Jasmine Morales #2,Killeen Harker Heights,74.12,79.38,61.23,115.67,256.28,Unlimited,SBD,F,
Girls,75.07,12,Caitlyn Schrank,Lorena,70.13,97.52,43.09,79.38,219.99,Unlimited,SBD,F,
Girls,75.07,DQ,Jayanna Hill,Waco La Vega,67.59,,,,,Unlimited,SBD,F,
Girls,82.33,1,Emma Turner,Robinson,80.74,170.1,83.91,147.42,401.43,Unlimited,SBD,F,
Girls,82.33,2,Aryana Perez,Waco La Vega,77.75,158.76,81.65,129.27,369.68,Unlimited,SBD,F,
Girls,82.33,3,Belle Rivera,China Spring,76.75,102.06,74.84,131.54,308.44,Unlimited,SBD,F,
Girls,82.33,4,Madison Rhodes,West,75.39,106.59,68.04,99.79,274.42,Unlimited,SBD,F,
Girls,82.33,5,Justine Carpenter,Troy,77.11,99.79,56.7,106.59,263.08,Unlimited,SBD,F,
Girls,82.33,6,Emilie Solomon,McGregor,75.75,92.99,43.09,95.25,231.33,Unlimited,SBD,F,
Girls,82.33,7,Larkin Tyler,Grandview,75.57,79.38,45.36,74.84,199.58,Unlimited,SBD,F,
Girls,82.33,DQ,Mackenzi Williamson,Grandview,80.38,129.27,72.57,,,Unlimited,SBD,F,
Girls,82.33,DQ,Brinley Siems,Valley Mills,80.56,,,,,Unlimited,SBD,F,
Girls,82.33,DQ,Viviana Leauvano,Robinson,81.01,,,,,Unlimited,SBD,F,
Girls,90.04,1,Flor Benitez,McGregor,84.64,138.35,65.77,145.15,349.27,Unlimited,SBD,F,
Girls,90.04,2,Zoey Arnold,Gatesville,87.18,138.35,79.38,131.54,349.27,Unlimited,SBD,F,
Girls,90.04,3,Karissa Treat,Robinson,86.27,129.27,70.31,142.88,342.46,Unlimited,SBD,F,
Girls,90.04,4,Alyssa Sanchez,McGregor,86.64,129.27,70.31,136.08,335.66,Unlimited,SBD,F,
Girls,90.04,5,Gabrielle Simmons,Killeen Harker Heights,88.99,122.47,77.11,131.54,331.12,Unlimited,SBD,F,
Girls,90.04,6,Jaycee Fuller,Waco Connally,89.54,124.74,72.57,113.4,310.71,Unlimited,SBD,F,
Girls,90.04,7,Eyzela King,Robinson,85.18,106.59,58.97,131.54,297.1,Unlimited,SBD,F,
Girls,90.04,8,Kayla Tarrence-Lucky,Troy,88.81,120.2,56.7,113.4,290.3,Unlimited,SBD,F,
Girls,90.04,9,Mercedes Anderson,Killeen Harker Heights,85.28,97.52,68.04,113.4,278.96,Unlimited,SBD,F,
Girls,90.04,10,Maya Olguin,Grandview,88.45,95.25,56.7,106.59,258.55,Unlimited,SBD,F,
Girls,90.04,DQ,Keyana Webb,Gatesville,83.82,,,,,Unlimited,SBD,F,
Girls,100.02,1,Emma Davidson,Gatesville,99.7,149.69,124.74,129.27,403.7,Unlimited,SBD,F,
Girls,100.02,2,Ariya Green,Waco La Vega,97.34,151.95,83.91,136.08,371.95,Unlimited,SBD,F,
Girls,100.02,3,Emma Massar,Troy,96.34,151.95,90.72,127.01,369.68,Unlimited,SBD,F,
Girls,100.02,4,Tynijah Sanders,Waco La Vega,94.8,142.88,88.45,127.01,358.34,Unlimited,SBD,F,
Girls,100.02,5,Emily Heath,West,96.34,145.15,70.31,131.54,347,Unlimited,SBD,F,
Girls,100.02,6,Daisy Jaimes,McGregor,98.88,124.74,68.04,140.61,333.39,Unlimited,SBD,F,
Girls,100.02,7,Chernesia Henry,Waco Connally,91.81,113.4,79.38,124.74,317.51,Unlimited,SBD,F,
Girls,100.02,8,Emily Ackermann,Lorena,93.8,113.4,77.11,127.01,317.51,Unlimited,SBD,F,
Girls,100.02,9,Rhyanne Ward,Moody,96.8,133.81,70.31,111.13,315.25,Unlimited,SBD,F,
Girls,100.02,10,Kyli Higginbotham,Lorena,92.44,124.74,68.04,113.4,306.17,Unlimited,SBD,F,
Girls,100.02,11,Alaina Martinez,Waco Connally,99.06,108.86,65.77,113.4,288.03,Unlimited,SBD,F,
Girls,100.02,12,Avery Alexander,Robinson,90.99,111.13,61.23,108.86,281.23,Unlimited,SBD,F,
Girls,100.02,13,Laila Bedoy,Robinson,96.89,106.59,61.23,108.86,276.69,Unlimited,SBD,F,
Girls,110,1,Janessa Gallegos,West,104.14,188.24,108.86,176.9,474,Unlimited,SBD,F,
Girls,110,2,Hailey Obstoj,Moody,106.32,161.03,83.91,161.03,405.97,Unlimited,SBD,F,
Girls,110,3,Madi Terry,West,109.59,149.69,90.72,142.88,383.29,Unlimited,SBD,F,
Girls,110,4,Janiah Smith,Waco Connally,108.24,90.72,61.23,102.06,254.01,Unlimited,SBD,F,
Girls,110,DQ,Amariya Watson,Waco La Vega,101.51,165.56,,,,Unlimited,SBD,F,
Girls,110,DQ,Isabella Perez,Moody,101.6,136.08,,,,Unlimited,SBD,F,
Girls,110,DQ,Hayden Stevens,Troy,107.95,142.88,,,,Unlimited,SBD,F,
Girls,110+,1,Avery Davis,West,123.2,208.65,138.35,165.56,512.56,Unlimited,SBD,F,
Girls,110+,2,Lacy Massar,Troy,120.75,188.24,117.93,151.95,458.13,Unlimited,SBD,F,
Girls,110+,3,Hailey Wells,China Spring,144.51,136.08,99.79,136.08,371.95,Unlimited,SBD,F,
Girls,110+,4,Jaclyn Taft,Killeen Harker Heights,120.75,131.54,79.38,151.95,362.87,Unlimited,SBD,F,
Girls,110+,5,Alyssa Saxon,Gatesville,111.13,154.22,74.84,131.54,360.61,Unlimited,SBD,F,
Girls,110+,6,Perla Escalante,Waco La Vega,146.96,142.88,92.99,106.59,342.46,Unlimited,SBD,F,
Girls,110+,7,Baylee Childress,Grandview,113.58,97.52,56.7,102.06,256.28,Unlimited,SBD,F,
