\relax 
\providecommand\hyper@newdestlabel[2]{}
\bibstyle{woc}
\providecommand\HyperFirstAtBeginDocument{\AtBeginDocument}
\HyperFirstAtBeginDocument{\ifx\hyper@anchor\@undefined
\global\let\oldcontentsline\contentsline
\gdef\contentsline#1#2#3#4{\oldcontentsline{#1}{#2}{#3}}
\global\let\oldnewlabel\newlabel
\gdef\newlabel#1#2{\newlabelxx{#1}#2}
\gdef\newlabelxx#1#2#3#4#5#6{\oldnewlabel{#1}{{#2}{#3}}}
\AtEndDocument{\ifx\hyper@anchor\@undefined
\let\contentsline\oldcontentsline
\let\newlabel\oldnewlabel
\fi}
\fi}
\global\let\hyper@last\relax 
\gdef\HyperFirstAtBeginDocument#1{#1}
\providecommand\HyField@AuxAddToFields[1]{}
\providecommand\HyField@AuxAddToCoFields[2]{}
\citation{Olive:2016xmw}
\citation{Graner:2016ses}
\citation{Alexandrou:2015spa,Guo:2015tla}
\select@language{english}
\@writefile{toc}{\select@language{english}}
\@writefile{lof}{\select@language{english}}
\@writefile{lot}{\select@language{english}}
\select@language{english}
\@writefile{toc}{\select@language{english}}
\@writefile{lof}{\select@language{english}}
\@writefile{lot}{\select@language{english}}
\@writefile{toc}{\contentsline {section}{\numberline {1}Introduction}{1}{section.1}}
\newlabel{intro}{{1}{1}{Introduction}{section.1}{}}
\citation{Weinberg:1989dx}
\citation{Aoki:2010wm}
\citation{BECKETT20111208}
\citation{Gusken:1989qx}
\citation{Aoki:2010wm}
\citation{Luscher:2011bx,Bruno:2014ova,Chowdhury:2013mea}
\citation{Luscher:2010iy,Borsanyi:2012zs}
\@writefile{toc}{\contentsline {section}{\numberline {2}Theory}{2}{section.2}}
\newlabel{theory}{{2}{2}{Theory}{section.2}{}}
\@writefile{toc}{\contentsline {section}{\numberline {3}Lattice Parameters}{2}{section.3}}
\newlabel{LatParams}{{3}{2}{Lattice Parameters}{section.3}{}}
\@writefile{toc}{\contentsline {section}{\numberline {4}Topological and Weinberg Susceptibilities }{2}{section.4}}
\newlabel{Susceptibility}{{4}{2}{Topological and Weinberg Susceptibilities}{section.4}{}}
\citation{Wolff:2003sm}
\citation{Wolff:2003sm}
\@writefile{lof}{\contentsline {figure}{\numberline {1}{\ignorespaces  Topological (left) and Weinberg (right) susceptibilities in GeV, plotted against the flow-time radius $\sqrt  {8t_f}$. Blue and red points are the \(m_{\pi } = 411, 701\) MeV results respectively. Errors were estimated using the autocorrelation analysis technique described in \cite  {Wolff:2003sm}.}}{3}{figure.1}}
\newlabel{ChitRes}{{1}{3}{Topological (left) and Weinberg (right) susceptibilities in GeV, plotted against the flow-time radius $\sqrt {8t_f}$. Blue and red points are the \(m_{\pi } = 411, 701\) MeV results respectively. Errors were estimated using the autocorrelation analysis technique described in \cite {Wolff:2003sm}}{figure.1}{}}
\@writefile{lof}{\contentsline {figure}{\numberline {2}{\ignorespaces  Cross correlation \(\mathinner {\delimiter "426830A {Q\mathcal  {O}_{W}}\delimiter "526930B }\) in GeV\(^{6}\) against the flow-time radius $\sqrt  {8t_f}$. Blue and red points are the \(m_{\pi } = 411, 701\) MeV results respectively. Errors were estimated using an autocorrelation analysis technique described in \cite  {Wolff:2003sm}.}}{3}{figure.2}}
\newlabel{ChitQWRes}{{2}{3}{Cross correlation \(\braket {Q\mathcal {O}_{W}}\) in GeV\(^{6}\) against the flow-time radius $\sqrt {8t_f}$. Blue and red points are the \(m_{\pi } = 411, 701\) MeV results respectively. Errors were estimated using an autocorrelation analysis technique described in \cite {Wolff:2003sm}}{figure.2}{}}
\@writefile{toc}{\contentsline {subsection}{\numberline {4.1}Susceptibility results}{3}{subsection.4.1}}
\newlabel{SuscRes}{{4.1}{3}{Susceptibility results}{subsection.4.1}{}}
\citation{Bhattacharya:2015rsa}
\citation{Shindler:2015aqa}
\citation{Shintani:2005xg,Shindler:2015aqa}
\citation{Shintani:2005xg,Shindler:2015aqa}
\@writefile{toc}{\contentsline {section}{\numberline {5}Nucleon Observables in CP-breaking theory}{4}{section.5}}
\newlabel{NuclObsCP}{{5}{4}{Nucleon Observables in CP-breaking theory}{section.5}{}}
\@writefile{toc}{\contentsline {subsection}{\numberline {5.1}Nucleon Mixing Angle}{4}{subsection.5.1}}
\newlabel{NucMixAng}{{5.1}{4}{Nucleon Mixing Angle}{subsection.5.1}{}}
\newlabel{AlphaRat}{{6}{4}{Nucleon Mixing Angle}{equation.5.6}{}}
\citation{Ottnad:2009jw,deVries:2010ah,Mereghetti:2010kp}
\citation{Ottnad:2009jw,deVries:2010ah,Mereghetti:2010kp}
\citation{deVries:2010ah}
\citation{Abramczyk:2017oxr}
\citation{Abramczyk:2017oxr}
\citation{Abramczyk:2017oxr}
\citation{Abramczyk:2017oxr}
\@writefile{lof}{\contentsline {figure}{\numberline {3}{\ignorespaces  CP-odd vector form factor \(F_{3}/2m_N\) in units of \(\theta \) for the neutron (left) and proton (right), induced via the \(\theta \)-term CP-violating vacuum, plotted against transfer momentum \(Q^{2}\). Blue and red points are the \(m_{\pi } = 411, 701\) MeV results respectively. The linear fit to \(Q^{2}\rightarrow 0\) is used to extract the value for the neutron and proton EDM \(d_{n/p}\).}}{5}{figure.3}}
\newlabel{TopF3}{{3}{5}{CP-odd vector form factor \(F_{3}/2m_N\) in units of \(\theta \) for the neutron (left) and proton (right), induced via the \(\theta \)-term CP-violating vacuum, plotted against transfer momentum \(Q^{2}\). Blue and red points are the \(m_{\pi } = 411, 701\) MeV results respectively. The linear fit to \(Q^{2}\rightarrow 0\) is used to extract the value for the neutron and proton EDM \(d_{n/p}\)}{figure.3}{}}
\@writefile{toc}{\contentsline {subsection}{\numberline {5.2}CP-odd Form Factor \(F_{3}\) and the Electric Dipole Moment}{5}{subsection.5.2}}
\newlabel{EDMRes}{{5.2}{5}{CP-odd Form Factor \(F_{3}\) and the Electric Dipole Moment}{subsection.5.2}{}}
\@writefile{lof}{\contentsline {figure}{\numberline {4}{\ignorespaces  CP-odd vector form factor \(F_{3}/2m_N\) in units of \(\alpha _{W}/\Lambda ^{2}\) for the neutron (left) and proton (right), induced via the \textit  {Weinberg operator} CP-violating vacuum, plotted against transfer momentum \(Q^{2}\). Blue and red points are the \(m_{\pi } = 411, 701\) MeV results respectively. The linear fit to \(Q^{2}\rightarrow 0\) is used to extract the value for the neutron and proton EDM \(d_{n/p}\).}}{6}{figure.4}}
\newlabel{WeinF3}{{4}{6}{CP-odd vector form factor \(F_{3}/2m_N\) in units of \(\alpha _{W}/\Lambda ^{2}\) for the neutron (left) and proton (right), induced via the \textit {Weinberg operator} CP-violating vacuum, plotted against transfer momentum \(Q^{2}\). Blue and red points are the \(m_{\pi } = 411, 701\) MeV results respectively. The linear fit to \(Q^{2}\rightarrow 0\) is used to extract the value for the neutron and proton EDM \(d_{n/p}\)}{figure.4}{}}
\@writefile{lof}{\contentsline {figure}{\numberline {5}{\ignorespaces  Flow time dependence from \(t_{f}/a^2 = 4.01\) (blue) to \(t_{f}/a^2 = 8.01\) (red) of the CP-odd vector form factor \(F_{3}/2m_N\) in units of \(\alpha _{W}/\Lambda ^{2}\), induced via the \textit  {Weinberg} CP-violating vacuum, plotted against transfer momentum \(Q^{2}\). Left and right plots show the \(m_{\pi } = 411, 701\) MeV results respectively. The linear fit to \(Q^{2}\rightarrow 0\) is used to extract the value for the neutron and proton EDM \(d_{n/p}\).}}{6}{figure.5}}
\newlabel{WeinF3FlowDep}{{5}{6}{Flow time dependence from \(t_{f}/a^2 = 4.01\) (blue) to \(t_{f}/a^2 = 8.01\) (red) of the CP-odd vector form factor \(F_{3}/2m_N\) in units of \(\alpha _{W}/\Lambda ^{2}\), induced via the \textit {Weinberg} CP-violating vacuum, plotted against transfer momentum \(Q^{2}\). Left and right plots show the \(m_{\pi } = 411, 701\) MeV results respectively. The linear fit to \(Q^{2}\rightarrow 0\) is used to extract the value for the neutron and proton EDM \(d_{n/p}\)}{figure.5}{}}
\citation{Abramczyk:2017oxr}
\@writefile{lof}{\contentsline {figure}{\numberline {6}{\ignorespaces  Corrections suggested by \cite  {Abramczyk:2017oxr} for the CP-odd vector form factor \(F_{3}/2m_N\) in units of \(\theta \) for the neutron (left) and proton (right), induced via the \textit  {\(\theta \)-term} CP-violating vacuum, plotted against transfer momentum \(Q^{2}\). Blue and red points are the \(m_{\pi } = 411, 701\) MeV results respectively. The linear fit to \(Q^{2}\rightarrow 0\) is used to extract the value for the neutron and proton EDM \(d_{n/p}\).}}{7}{figure.6}}
\newlabel{TopF3BNL}{{6}{7}{Corrections suggested by \cite {Abramczyk:2017oxr} for the CP-odd vector form factor \(F_{3}/2m_N\) in units of \(\theta \) for the neutron (left) and proton (right), induced via the \textit {\(\theta \)-term} CP-violating vacuum, plotted against transfer momentum \(Q^{2}\). Blue and red points are the \(m_{\pi } = 411, 701\) MeV results respectively. The linear fit to \(Q^{2}\rightarrow 0\) is used to extract the value for the neutron and proton EDM \(d_{n/p}\)}{figure.6}{}}
\@writefile{lof}{\contentsline {figure}{\numberline {7}{\ignorespaces  Corrections suggested by \cite  {Abramczyk:2017oxr} CP-odd vector form factor \(F_{3}/2m_N\) in units of \(\alpha _{W}/\Lambda ^{2}\) for the neutron (left) and proton (right), induced via the \textit  {Weinberg operator} CP-violating vacuum, plotted against transfer momentum \(Q^{2}\). Blue and red points are the \(m_{\pi } = 411, 701\) MeV results respectively. The linear fit to \(Q^{2}\rightarrow 0\) is used to extract the value for the neutron and proton EDM \(d_{n/p}\).}}{7}{figure.7}}
\newlabel{WeinF3BNL}{{7}{7}{Corrections suggested by \cite {Abramczyk:2017oxr} CP-odd vector form factor \(F_{3}/2m_N\) in units of \(\alpha _{W}/\Lambda ^{2}\) for the neutron (left) and proton (right), induced via the \textit {Weinberg operator} CP-violating vacuum, plotted against transfer momentum \(Q^{2}\). Blue and red points are the \(m_{\pi } = 411, 701\) MeV results respectively. The linear fit to \(Q^{2}\rightarrow 0\) is used to extract the value for the neutron and proton EDM \(d_{n/p}\)}{figure.7}{}}
\@writefile{toc}{\contentsline {subsection}{\numberline {5.3}Conclusion}{7}{subsection.5.3}}
\newlabel{Con}{{5.3}{7}{Conclusion}{subsection.5.3}{}}
\bibdata{lattice2017}
\bibcite{Olive:2016xmw}{{1}{}{{}}{{}}}
\bibcite{Graner:2016ses}{{2}{}{{}}{{}}}
\bibcite{Alexandrou:2015spa}{{3}{}{{}}{{}}}
\bibcite{Guo:2015tla}{{4}{}{{}}{{}}}
\bibcite{Weinberg:1989dx}{{5}{}{{}}{{}}}
\bibcite{Aoki:2010wm}{{6}{}{{}}{{}}}
\bibcite{BECKETT20111208}{{7}{}{{}}{{}}}
\bibcite{Gusken:1989qx}{{8}{}{{}}{{}}}
\bibcite{Luscher:2011bx}{{9}{}{{}}{{}}}
\bibcite{Bruno:2014ova}{{10}{}{{}}{{}}}
\bibcite{Chowdhury:2013mea}{{11}{}{{}}{{}}}
\bibcite{Luscher:2010iy}{{12}{}{{}}{{}}}
\bibcite{Borsanyi:2012zs}{{13}{}{{}}{{}}}
\bibcite{Wolff:2003sm}{{14}{}{{}}{{}}}
\bibcite{Bhattacharya:2015rsa}{{15}{}{{}}{{}}}
\bibcite{Shindler:2015aqa}{{16}{}{{}}{{}}}
\bibcite{Shintani:2005xg}{{17}{}{{}}{{}}}
\bibcite{Ottnad:2009jw}{{18}{}{{}}{{}}}
\bibcite{deVries:2010ah}{{19}{}{{}}{{}}}
\bibcite{Mereghetti:2010kp}{{20}{}{{}}{{}}}
\bibcite{Abramczyk:2017oxr}{{21}{}{{}}{{}}}
\providecommand\NAT@force@numbers{}\NAT@force@numbers
