This is pdfTeX, Version 3.14159265-2.6-1.40.16 (TeX Live 2015/Debian) (preloaded format=pdflatex 2016.7.26)  6 APR 2017 22:28
entering extended mode
 restricted \write18 enabled.
 %&-line parsing enabled.
**\nonstopmode\input JackCommands.sty
(./JackCommands.sty

LaTeX Warning: You have requested package `',
               but the package provides `JackCommands'.

Package: JackCommands 

! LaTeX Error: \usepackage before \documentclass.

See the LaTeX manual or LaTeX Companion for explanation.
Type  H <return>  for immediate help.
 ...                                              
                                                  
l.2 \usepackage{
                braket}
\usepackage may only appear in the document preamble, i.e.,
between \documentclass and \begin{document}.

)
! Emergency stop.
<*> \nonstopmode\input JackCommands.sty
                                       
*** (job aborted, no legal \end found)

 
Here is how much of TeX's memory you used:
 618 strings out of 494953
 5511 string characters out of 6180977
 57210 words of memory out of 5000000
 4002 multiletter control sequences out of 15000+600000
 3640 words of font info for 14 fonts, out of 8000000 for 9000
 14 hyphenation exceptions out of 8191
 7i,0n,6p,396b,14s stack positions out of 5000i,500n,10000p,200000b,80000s
!  ==> Fatal error occurred, no output PDF file produced!
