# Fdb version 3
["bibtex Lattice2017_249_JackDragos_Draft_Jordy"] 1508352364 "Lattice2017_249_JackDragos_Draft_Jordy.aux" "Lattice2017_249_JackDragos_Draft_Jordy.bbl" "Lattice2017_249_JackDragos_Draft_Jordy" 1508352364
  "./woc.bst" 1497558468 44064 bc8ecc033b40506cad1b25383f07eabd ""
  "Lattice2017_249_JackDragos_Draft_Jordy.aux" 1508352364 10913 c07c1b39ad05eae36813fffc7389d5df ""
  "Lattice2017_249_JackDragos_Draft_Jordy.bcf" 0 -1 0 ""
  "lattice2017.bib" 1508351964 24552 4c07a6c6b5dc27c8c9fd53c166c942c0 ""
  (generated)
  "Lattice2017_249_JackDragos_Draft_Jordy.bbl"
  "Lattice2017_249_JackDragos_Draft_Jordy.blg"
["pdflatex"] 1508352364 "Lattice2017_249_JackDragos_Draft_Jordy.tex" "/home/jackdra/PHD/INPC/MSU/Lat2017/PoS/Lat2017proc/Lattice2017_249_JackDragos_Draft_Jordy.pdf" "Lattice2017_249_JackDragos_Draft_Jordy" 1508352364
  "./graphs/F3/Top/MassComp/NeutronBNLF3.pdf" 1501618601 43400 e29023b4f536b9edb10e47c3c7d8b1c0 ""
  "./graphs/F3/Top/MassComp/NeutronF3.pdf" 1501618601 41671 44550929862ef585e1909e8c7e175447 ""
  "./graphs/F3/Top/MassComp/ProtonBNLF3.pdf" 1501618601 44030 ecdbb993faf3c7b19c4580bdd3ce8a96 ""
  "./graphs/F3/Top/MassComp/ProtonF3.pdf" 1501618601 40500 8f4b82f31b1e00135b1dfaca984b564d ""
  "./graphs/F3/Wein/FlowComp/Neutronmpi411F3.pdf" 1501618601 44367 11f487e63d3f58dd338c985e5b1835fc ""
  "./graphs/F3/Wein/FlowComp/Neutronmpi701F3.pdf" 1501618601 42248 9ce12f171d7025d63757a63064c80a12 ""
  "./graphs/F3/Wein/MassComp/NeutronBNLF3.pdf" 1501618601 45666 e83326603eb0996c4676c5d650bd95aa ""
  "./graphs/F3/Wein/MassComp/NeutronF3.pdf" 1501618601 42778 bb27963b5175223600a211e646972677 ""
  "./graphs/F3/Wein/MassComp/ProtonBNLF3.pdf" 1501618601 44041 fa3aea0553888a62a3f5a6cc37645387 ""
  "./graphs/F3/Wein/MassComp/ProtonF3.pdf" 1501618601 42029 ed1e637219923125be3c97986e71a23e ""
  "./graphs/FlowOps/ChitQ2.pdf" 1501618601 41241 dff1b38d2e9a62d20b6d7f19a17b44f2 ""
  "./graphs/FlowOps/ChitQW.pdf" 1501618601 41397 1f50e70f11e4180315809ff636668f13 ""
  "./graphs/FlowOps/ChitW2.pdf" 1501618601 40383 6b42be8f75eca26d6e00159ad47aef6b ""
  "/etc/texmf/web2c/texmf.cnf" 1494731185 475 c0e671620eb5563b2130f56340a5fde8 ""
  "/home/jackdra/PHD/INPC/MSU/Lat2017/PoS/Lat2017proc/Lattice2017_249_JackDragos_Draft_Jordy.aux" 1508352364 10913 c07c1b39ad05eae36813fffc7389d5df ""
  "/home/jackdra/texmf/tex/latex/simplewick/simplewick.sty" 1196065039 5472 ed992cfa51789e0e696e455d3da4694a ""
  "/usr/share/texlive/texmf-dist/fonts/enc/dvips/base/8r.enc" 1165713224 4850 80dc9bab7f31fb78a000ccfed0e27cab ""
  "/usr/share/texlive/texmf-dist/fonts/map/fontname/texfonts.map" 1272929888 3287 e6b82fe08f5336d4d5ebc73fb1152e87 ""
  "/usr/share/texlive/texmf-dist/fonts/tfm/jknappen/ec/ecrm1000.tfm" 1136768653 3584 adb004a0c8e7c46ee66cad73671f37b4 ""
  "/usr/share/texlive/texmf-dist/fonts/tfm/public/txfonts/rtxb.tfm" 1136768653 1020 c53143d3e3747b5c1149bd9a5ecd7b55 ""
  "/usr/share/texlive/texmf-dist/fonts/tfm/public/txfonts/rtxbss.tfm" 1136768653 952 8af6d4411025237a8a19c5fe76c48519 ""
  "/usr/share/texlive/texmf-dist/fonts/tfm/public/txfonts/rtxi.tfm" 1136768653 1048 a97cff5f6b833b712079817ce7a40d4c ""
  "/usr/share/texlive/texmf-dist/fonts/tfm/public/txfonts/rtxmi.tfm" 1136768653 1056 e2202af076e43d03fc17f87e104021b0 ""
  "/usr/share/texlive/texmf-dist/fonts/tfm/public/txfonts/rtxphvb.tfm" 1136768653 4548 1ffa7e4f8cec4f54428bd6e887feff07 ""
  "/usr/share/texlive/texmf-dist/fonts/tfm/public/txfonts/rtxphvr.tfm" 1136768653 4748 767b775b8de19d97ba9256ce2b48e057 ""
  "/usr/share/texlive/texmf-dist/fonts/tfm/public/txfonts/rtxphvro.tfm" 1136768653 4964 9484ade2f7ca166fd2b0a8266351209c ""
  "/usr/share/texlive/texmf-dist/fonts/tfm/public/txfonts/rtxptmb.tfm" 1136768653 4572 2c370d27bbb031f7592de9d41dc8cfca ""
  "/usr/share/texlive/texmf-dist/fonts/tfm/public/txfonts/rtxptmr.tfm" 1136768653 4452 0fd0a792eaab7113e4d4f1b941ff0367 ""
  "/usr/share/texlive/texmf-dist/fonts/tfm/public/txfonts/rtxptmri.tfm" 1136768653 4640 ce59980bcbe9e6236fab46d0b5212c7e ""
  "/usr/share/texlive/texmf-dist/fonts/tfm/public/txfonts/rtxr.tfm" 1136768653 1004 c0e991f864f31f017ea4ff9e451b76d4 ""
  "/usr/share/texlive/texmf-dist/fonts/tfm/public/txfonts/rtxss.tfm" 1136768653 952 9553fec7f8724dea5f23bcd5d8725907 ""
  "/usr/share/texlive/texmf-dist/fonts/tfm/public/txfonts/rtxsssl.tfm" 1136768653 1012 8cc6548f651cb7d6018c40ec4a405a18 ""
  "/usr/share/texlive/texmf-dist/fonts/tfm/public/txfonts/t1xb.tfm" 1136768653 6892 772bf8e6c154137db8568fa8a47a6ceb ""
  "/usr/share/texlive/texmf-dist/fonts/tfm/public/txfonts/t1xbss.tfm" 1136768653 6700 9f7ab5807b4ea0f94f86ef51654456a0 ""
  "/usr/share/texlive/texmf-dist/fonts/tfm/public/txfonts/t1xi.tfm" 1136768653 6956 cab20301c4a0fe2075f774c8a2433c5d ""
  "/usr/share/texlive/texmf-dist/fonts/tfm/public/txfonts/t1xr.tfm" 1136768653 6716 6d25a377562601272906e3bfe6b2817a ""
  "/usr/share/texlive/texmf-dist/fonts/tfm/public/txfonts/t1xss.tfm" 1136768653 7096 d4068737d849c31bd955cec162cc9c1f ""
  "/usr/share/texlive/texmf-dist/fonts/tfm/public/txfonts/t1xsssl.tfm" 1136768653 7320 442528840b39263f05b2bb9418cb055c ""
  "/usr/share/texlive/texmf-dist/fonts/tfm/public/txfonts/t1xtt.tfm" 1136768653 1384 8943063000d26272532f74ca134dfecd ""
  "/usr/share/texlive/texmf-dist/fonts/tfm/public/txfonts/txex.tfm" 1136768653 1080 b674b4ba143004461509a754a0984b67 ""
  "/usr/share/texlive/texmf-dist/fonts/tfm/public/txfonts/txexa.tfm" 1136768653 688 f56006d6e56f46e63d9f63252958b828 ""
  "/usr/share/texlive/texmf-dist/fonts/tfm/public/txfonts/txi.tfm" 1136768653 2584 cf4a6a7c2a518d47468fe29ef0913ba0 ""
  "/usr/share/texlive/texmf-dist/fonts/tfm/public/txfonts/txmi1.tfm" 1232065820 1956 a6f9b5b37e8c2d671aa7d92b7f88de9e ""
  "/usr/share/texlive/texmf-dist/fonts/tfm/public/txfonts/txmia.tfm" 1136768653 1180 72784d0ee5a983fba99a0986b31b0493 ""
  "/usr/share/texlive/texmf-dist/fonts/tfm/public/txfonts/txr.tfm" 1136768653 2408 aec793a3c45e495f7ad15b227c91f508 ""
  "/usr/share/texlive/texmf-dist/fonts/tfm/public/txfonts/txss.tfm" 1136768653 2812 58673a2de05c4f3a942b32b7ff5d1117 ""
  "/usr/share/texlive/texmf-dist/fonts/tfm/public/txfonts/txsy.tfm" 1136768653 1268 1d124f224979493f8fd017a7597ea1cd ""
  "/usr/share/texlive/texmf-dist/fonts/tfm/public/txfonts/txsya.tfm" 1136768653 972 2c9ffac4bbd20f91c01aaef9bf3f8710 ""
  "/usr/share/texlive/texmf-dist/fonts/tfm/public/txfonts/txsyb.tfm" 1136768653 988 098ca7e8cc5647b9ac21b82dbdce1f01 ""
  "/usr/share/texlive/texmf-dist/fonts/tfm/public/txfonts/txsyc.tfm" 1136768653 1084 75e807e9e71f7a312e4e1187dce5e93b ""
  "/usr/share/texlive/texmf-dist/fonts/type1/public/amsfonts/latxfont/line10.pfb" 1248133631 11493 4f5ed183a47d3197cf8cd322325db6de ""
  "/usr/share/texlive/texmf-dist/fonts/type1/public/txfonts/rtxmi.pfb" 1232065820 13806 49b888f4605a088e66b9eb4fee320a6e ""
  "/usr/share/texlive/texmf-dist/fonts/type1/public/txfonts/rtxr.pfb" 1136849748 6339 e2b78706efdc360ee6aec9b6e20211a7 ""
  "/usr/share/texlive/texmf-dist/fonts/type1/public/txfonts/t1xtt.pfb" 1136849748 26301 f08b3c26ea42c3177a262c2ac37d6a91 ""
  "/usr/share/texlive/texmf-dist/fonts/type1/public/txfonts/txex.pfb" 1136849748 17531 c91f2d6943f51d7c46d6b7b9cedd50ba ""
  "/usr/share/texlive/texmf-dist/fonts/type1/public/txfonts/txsy.pfb" 1136849748 20336 69267d8a81bca8b24c9b42694a4a28f9 ""
  "/usr/share/texlive/texmf-dist/fonts/type1/urw/helvetic/uhvb8a.pfb" 1136849748 35941 f27169cc74234d5bd5e4cca5abafaabb ""
  "/usr/share/texlive/texmf-dist/fonts/type1/urw/helvetic/uhvr8a.pfb" 1136849748 44648 23115b2a545ebfe2c526c3ca99db8b95 ""
  "/usr/share/texlive/texmf-dist/fonts/type1/urw/times/utmb8a.pfb" 1136849748 44729 811d6c62865936705a31c797a1d5dada ""
  "/usr/share/texlive/texmf-dist/fonts/type1/urw/times/utmr8a.pfb" 1136849748 46026 6dab18b61c907687b520c72847215a68 ""
  "/usr/share/texlive/texmf-dist/fonts/type1/urw/times/utmri8a.pfb" 1136849748 45458 a3faba884469519614ca56ba5f6b1de1 ""
  "/usr/share/texlive/texmf-dist/fonts/vf/public/txfonts/t1xb.vf" 1136768653 2144 bab2875eda5b2344ea7b1db74ccc03a4 ""
  "/usr/share/texlive/texmf-dist/fonts/vf/public/txfonts/t1xbss.vf" 1136768653 2140 53a6b204134ca23b688a5eb135473f18 ""
  "/usr/share/texlive/texmf-dist/fonts/vf/public/txfonts/t1xi.vf" 1136768653 2120 35084608d79b6b13dd746dfcffe98243 ""
  "/usr/share/texlive/texmf-dist/fonts/vf/public/txfonts/t1xr.vf" 1136768653 2140 99e5b3a34695df6221a167ffa8b498d6 ""
  "/usr/share/texlive/texmf-dist/fonts/vf/public/txfonts/t1xss.vf" 1136768653 2140 1f9dbe1be7b322ce3d2dc5796a8e88ed ""
  "/usr/share/texlive/texmf-dist/fonts/vf/public/txfonts/t1xsssl.vf" 1136768653 2148 3b03d03d82cf6e8c21b92d2903f15dc8 ""
  "/usr/share/texlive/texmf-dist/fonts/vf/public/txfonts/txmi1.vf" 1232065820 956 f983b640c0b4611f4a1e736d2e7477d1 ""
  "/usr/share/texlive/texmf-dist/fonts/vf/public/txfonts/txr.vf" 1136768653 904 e582cae2d8ae3f48a0a520440ebcdb51 ""
  "/usr/share/texlive/texmf-dist/fonts/vf/public/txfonts/txss.vf" 1136768653 900 d505cb2e7d86314b1a2248e147d1eddf ""
  "/usr/share/texlive/texmf-dist/tex/context/base/mkii/supp-pdf.mkii" 1461363279 71627 94eb9990bed73c364d7f53f960cc8c5b ""
  "/usr/share/texlive/texmf-dist/tex/generic/babel-english/english.ldf" 1367878877 6963 2e0cb3d93aa64508bdb0db58ae900d97 ""
  "/usr/share/texlive/texmf-dist/tex/generic/babel/babel.def" 1461448269 50112 8190990703f12b57db0dfe9b839e1e24 ""
  "/usr/share/texlive/texmf-dist/tex/generic/babel/babel.sty" 1461448269 13499 2379954ebbdf3db89eccb32499d2da36 ""
  "/usr/share/texlive/texmf-dist/tex/generic/ifxetex/ifxetex.sty" 1284331290 1458 43ab4710dc82f3edeabecd0d099626b2 ""
  "/usr/share/texlive/texmf-dist/tex/generic/oberdiek/gettitlestring.sty" 1463608860 8237 3b62ef1f7e2c23a328c814b3893bc11f ""
  "/usr/share/texlive/texmf-dist/tex/generic/oberdiek/hobsub-generic.sty" 1465595255 185033 59b2c30c35b665d3e466ed723aa88d38 ""
  "/usr/share/texlive/texmf-dist/tex/generic/oberdiek/hobsub-hyperref.sty" 1465595255 70864 bcd5b216757bd619ae692a151d90085d ""
  "/usr/share/texlive/texmf-dist/tex/generic/oberdiek/ifpdf.sty" 1463348357 1226 01a89dfef361f60ae7df13cd2946bc16 ""
  "/usr/share/texlive/texmf-dist/tex/generic/oberdiek/ifvtex.sty" 1463608860 6797 90b7f83b0ad46826bc16058b1e3d48df ""
  "/usr/share/texlive/texmf-dist/tex/generic/oberdiek/infwarerr.sty" 1463608860 8253 473e0e41f9adadb1977e8631b8f72ea6 ""
  "/usr/share/texlive/texmf-dist/tex/generic/oberdiek/ltxcmds.sty" 1463608860 18425 5b3c0c59d76fac78978b5558e83c1f36 ""
  "/usr/share/texlive/texmf-dist/tex/generic/pgf/basiclayer/pgfcore.code.tex" 1288312291 1006 b103be0bfc8c1682ff1fa9760697a329 ""
  "/usr/share/texlive/texmf-dist/tex/generic/pgf/basiclayer/pgfcorearrows.code.tex" 1439074469 43226 167a99346bfe2676e3efcdde2d81fe45 ""
  "/usr/share/texlive/texmf-dist/tex/generic/pgf/basiclayer/pgfcoreexternal.code.tex" 1439074469 19302 4f089dc590e71f7331e6d5b5ea85273b ""
  "/usr/share/texlive/texmf-dist/tex/generic/pgf/basiclayer/pgfcoregraphicstate.code.tex" 1439074469 6068 edae1e768a7d8d8f0f00e953d2b0153e ""
  "/usr/share/texlive/texmf-dist/tex/generic/pgf/basiclayer/pgfcoreimage.code.tex" 1393459310 7041 a891ad72049e17c4e366c40ca37b0ccb ""
  "/usr/share/texlive/texmf-dist/tex/generic/pgf/basiclayer/pgfcorelayers.code.tex" 1393459310 4625 40c07e9f6f2f7c674704b3f2055560ce ""
  "/usr/share/texlive/texmf-dist/tex/generic/pgf/basiclayer/pgfcoreobjects.code.tex" 1203877327 2631 7eefa6cdbefd8d4e2bad7262cf1094cd ""
  "/usr/share/texlive/texmf-dist/tex/generic/pgf/basiclayer/pgfcorepathconstruct.code.tex" 1393459310 43477 81143b33d9ebafdeead07ede13372427 ""
  "/usr/share/texlive/texmf-dist/tex/generic/pgf/basiclayer/pgfcorepathprocessing.code.tex" 1393459310 17436 8d99d4113be311daf23deff86991ee7d ""
  "/usr/share/texlive/texmf-dist/tex/generic/pgf/basiclayer/pgfcorepathusage.code.tex" 1439074469 20772 c57e34db4aa7b1da013169d04b743eac ""
  "/usr/share/texlive/texmf-dist/tex/generic/pgf/basiclayer/pgfcorepatterns.code.tex" 1393459310 9641 711f0edc22c180a5caf168b6e8970057 ""
  "/usr/share/texlive/texmf-dist/tex/generic/pgf/basiclayer/pgfcorepoints.code.tex" 1393459310 34516 658a71478d21df554bce9d9cd436203a ""
  "/usr/share/texlive/texmf-dist/tex/generic/pgf/basiclayer/pgfcorequick.code.tex" 1288312291 3052 e5672c657232fd63b0a9853b0746297c ""
  "/usr/share/texlive/texmf-dist/tex/generic/pgf/basiclayer/pgfcorescopes.code.tex" 1439074469 16669 4ec6e40088fc6de6334b443fe2dc59f0 ""
  "/usr/share/texlive/texmf-dist/tex/generic/pgf/basiclayer/pgfcoreshade.code.tex" 1393459310 21541 4cd19f8ff7dd74d5aa7d803a6397af84 ""
  "/usr/share/texlive/texmf-dist/tex/generic/pgf/basiclayer/pgfcoretransformations.code.tex" 1439074469 19998 d77fef95c7369827753d17fd11be19c4 ""
  "/usr/share/texlive/texmf-dist/tex/generic/pgf/basiclayer/pgfcoretransparency.code.tex" 1393459310 8943 2e2495b057f8f0035b5568394d489963 ""
  "/usr/share/texlive/texmf-dist/tex/generic/pgf/frontendlayer/tikz/libraries/tikzlibrarytopaths.code.tex" 1288312291 11599 d694704a88e2f9007c996d3a6a4d629c ""
  "/usr/share/texlive/texmf-dist/tex/generic/pgf/frontendlayer/tikz/tikz.code.tex" 1439074469 176652 1c2926908e2b356d454795c35385d580 ""
  "/usr/share/texlive/texmf-dist/tex/generic/pgf/libraries/pgflibraryplothandlers.code.tex" 1393459310 32969 dbcfd5a7de6a0f7255c333ef60287d59 ""
  "/usr/share/texlive/texmf-dist/tex/generic/pgf/math/pgfmath.code.tex" 1393459310 454 9e9e7c99f4da4f41698be21eaef4938e ""
  "/usr/share/texlive/texmf-dist/tex/generic/pgf/math/pgfmathcalc.code.tex" 1393459310 13416 940ea6971d7a65dc440d3479939c66ae ""
  "/usr/share/texlive/texmf-dist/tex/generic/pgf/math/pgfmathfloat.code.tex" 1439074469 94097 62ac62cda46eb715560dc27f9ed6e8b1 ""
  "/usr/share/texlive/texmf-dist/tex/generic/pgf/math/pgfmathfunctions.base.code.tex" 1393459310 9375 5adc70f722abd29fc250d59e0694b548 ""
  "/usr/share/texlive/texmf-dist/tex/generic/pgf/math/pgfmathfunctions.basic.code.tex" 1439074469 22069 7c21c42b15718ce922f36235be360490 ""
  "/usr/share/texlive/texmf-dist/tex/generic/pgf/math/pgfmathfunctions.code.tex" 1439074469 8210 a7be5b52ef3d2c087b7dc3d52898b67e ""
  "/usr/share/texlive/texmf-dist/tex/generic/pgf/math/pgfmathfunctions.comparison.code.tex" 1288312291 3534 c7f28fbac13616513e513efe93b8569b ""
  "/usr/share/texlive/texmf-dist/tex/generic/pgf/math/pgfmathfunctions.integerarithmetics.code.tex" 1393459310 3167 7c9394e79aac27db96a92f9b2792b858 ""
  "/usr/share/texlive/texmf-dist/tex/generic/pgf/math/pgfmathfunctions.misc.code.tex" 1439074469 9289 261407875b9dbb0194691c3eb893610f ""
  "/usr/share/texlive/texmf-dist/tex/generic/pgf/math/pgfmathfunctions.random.code.tex" 1439074469 7078 946ddf4a7e57219b6afdbad98eb6731b ""
  "/usr/share/texlive/texmf-dist/tex/generic/pgf/math/pgfmathfunctions.round.code.tex" 1288312291 2688 139c6abc86761a6190c2f4bef5d752be ""
  "/usr/share/texlive/texmf-dist/tex/generic/pgf/math/pgfmathfunctions.trigonometric.code.tex" 1439074469 92284 dcf023dbaa84e6c50e11c2f79fe8cfa6 ""
  "/usr/share/texlive/texmf-dist/tex/generic/pgf/math/pgfmathparser.code.tex" 1439074469 35430 046e15fbb65e74d8f0e7945f99741fdb ""
  "/usr/share/texlive/texmf-dist/tex/generic/pgf/math/pgfmathutil.code.tex" 1393459310 7099 f44d505bae6c7c2b933cdd63441db4b9 ""
  "/usr/share/texlive/texmf-dist/tex/generic/pgf/modules/pgfmodulematrix.code.tex" 1393459310 20934 2328bd2e04520e1ab077ac4ee13b8935 ""
  "/usr/share/texlive/texmf-dist/tex/generic/pgf/modules/pgfmoduleplot.code.tex" 1439074469 16203 83cbe1220e389eeee283a6168f9a567b ""
  "/usr/share/texlive/texmf-dist/tex/generic/pgf/modules/pgfmoduleshapes.code.tex" 1439074469 42906 d54376d96df1a2ae2d33fb722236d8e9 ""
  "/usr/share/texlive/texmf-dist/tex/generic/pgf/systemlayer/pgf.cfg" 1288312291 978 15af626ebd3d4d790aac19170dac04f2 ""
  "/usr/share/texlive/texmf-dist/tex/generic/pgf/systemlayer/pgfsys-common-pdf.def" 1393459310 5437 d91f93ed61ecdc57e119849b2d784a0b ""
  "/usr/share/texlive/texmf-dist/tex/generic/pgf/systemlayer/pgfsys-pdftex.def" 1439074469 13507 809d848d9262638e1b1705a68a73c566 ""
  "/usr/share/texlive/texmf-dist/tex/generic/pgf/systemlayer/pgfsys.code.tex" 1439074469 35113 2ccc50c1c9573e4bac9230d030f9c67c ""
  "/usr/share/texlive/texmf-dist/tex/generic/pgf/systemlayer/pgfsysprotocol.code.tex" 1203877327 1983 b5994ebbcee17f1ba3d29bb1bd696fcf ""
  "/usr/share/texlive/texmf-dist/tex/generic/pgf/systemlayer/pgfsyssoftpath.code.tex" 1393459310 7881 d459d6057e13d10ce7a227ae44b7295e ""
  "/usr/share/texlive/texmf-dist/tex/generic/pgf/utilities/pgffor.code.tex" 1393459310 22211 d696ef78c12269178882d218b2cf191d ""
  "/usr/share/texlive/texmf-dist/tex/generic/pgf/utilities/pgfkeys.code.tex" 1393459310 36194 e194ef4e0b396b531a3891feb4b1cc22 ""
  "/usr/share/texlive/texmf-dist/tex/generic/pgf/utilities/pgfkeysfiltered.code.tex" 1393459310 33377 af391d6ad1bfcbe2278e191f48e43ba8 ""
  "/usr/share/texlive/texmf-dist/tex/generic/pgf/utilities/pgfrcs.code.tex" 1440888734 2536 a3b0529d815a2759ba157b56610a6377 ""
  "/usr/share/texlive/texmf-dist/tex/generic/pgf/utilities/pgfutil-common-lists.tex" 1393459310 6833 114eda2cf1d348e0e7e477a1a4dc1941 ""
  "/usr/share/texlive/texmf-dist/tex/generic/pgf/utilities/pgfutil-common.tex" 1439074469 16501 ab0135765e27b6b8dae047831fe84818 ""
  "/usr/share/texlive/texmf-dist/tex/generic/pgf/utilities/pgfutil-latex.def" 1439074469 5544 294baac9629ba59f675b1f2027ad7136 ""
  "/usr/share/texlive/texmf-dist/tex/latex/amsfonts/amsfonts.sty" 1359763108 5949 3f3fd50a8cc94c3d4cbf4fc66cd3df1c ""
  "/usr/share/texlive/texmf-dist/tex/latex/amsfonts/amssymb.sty" 1359763108 13829 94730e64147574077f8ecfea9bb69af4 ""
  "/usr/share/texlive/texmf-dist/tex/latex/amsmath/amsbsy.sty" 1480098820 2210 5c54ab129b848a5071554186d0168766 ""
  "/usr/share/texlive/texmf-dist/tex/latex/amsmath/amsgen.sty" 1480098820 4160 c115536cf8d4ff25aa8c1c9bc4ecb79a ""
  "/usr/share/texlive/texmf-dist/tex/latex/amsmath/amsmath.sty" 1485129665 84329 81aa65c5042562f79cb421feff9b8bdc ""
  "/usr/share/texlive/texmf-dist/tex/latex/amsmath/amsopn.sty" 1480098820 4115 318a66090112f3aa3f415aeb6fe8540f ""
  "/usr/share/texlive/texmf-dist/tex/latex/amsmath/amstext.sty" 1480098820 2431 fe3078ec12fc30287f568596f8e0b948 ""
  "/usr/share/texlive/texmf-dist/tex/latex/base/article.cls" 1480098821 19821 310da678527a7dfe2a02c88af38079b7 ""
  "/usr/share/texlive/texmf-dist/tex/latex/base/fleqn.clo" 1485129665 4752 897317ebb241cb8f27870a53abc8ed59 ""
  "/usr/share/texlive/texmf-dist/tex/latex/base/fontenc.sty" 1488610416 4571 9038da8f43b184392cf48183aeb91e1a ""
  "/usr/share/texlive/texmf-dist/tex/latex/base/ifthen.sty" 1480098821 5159 a08c9bbd48fc492f15b22e458bef961f ""
  "/usr/share/texlive/texmf-dist/tex/latex/base/inputenc.sty" 1480098821 4732 d63eda807ac82cca2ca8488efd31a966 ""
  "/usr/share/texlive/texmf-dist/tex/latex/base/omsenc.dfu" 1488610416 2004 ac51aeac484f08c01026120d62677eca ""
  "/usr/share/texlive/texmf-dist/tex/latex/base/ot1enc.dfu" 1488610416 3181 1cb3e9ad01f4a01127b2ffd821bfeec7 ""
  "/usr/share/texlive/texmf-dist/tex/latex/base/size10.clo" 1480098821 8292 e897c12e1e886ce77fe26afc5d470886 ""
  "/usr/share/texlive/texmf-dist/tex/latex/base/t1enc.def" 1488610416 10006 b272d9b1ef7a3c9834a3018dad08d43d ""
  "/usr/share/texlive/texmf-dist/tex/latex/base/t1enc.dfu" 1488610416 11255 9d97362866549d3d3c994b5f28d1b9b5 ""
  "/usr/share/texlive/texmf-dist/tex/latex/base/utf8.def" 1488610416 7784 325a2a09984cb5c4ff230f9867145ad3 ""
  "/usr/share/texlive/texmf-dist/tex/latex/booktabs/booktabs.sty" 1462233275 5869 94335281ffcab47f341cf07ea8220e30 ""
  "/usr/share/texlive/texmf-dist/tex/latex/braket/braket.sty" 1266794558 3601 193635d942bc4777a5acaaeeffdce692 ""
  "/usr/share/texlive/texmf-dist/tex/latex/cancel/cancel.sty" 1388445839 7592 dd751af313a16a0308545d5bfd7aaaa2 ""
  "/usr/share/texlive/texmf-dist/tex/latex/carlisle/slashed.sty" 1137109962 5327 8b3c95b5f71136add36a4a0bb1507594 ""
  "/usr/share/texlive/texmf-dist/tex/latex/commath/commath.sty" 1159951381 9537 ecb0f152230e8d1c561906edc314dcbc ""
  "/usr/share/texlive/texmf-dist/tex/latex/eurosym/eurosym.sty" 1137110118 3028 8faeef64adee9b964b5e7f5e45921024 ""
  "/usr/share/texlive/texmf-dist/tex/latex/fancyhdr/fancyhdr.sty" 1473197494 22494 ab2f238426db63334832f85a72ef1f3b ""
  "/usr/share/texlive/texmf-dist/tex/latex/geometry/geometry.sty" 1284422013 40502 e003406220954b0716679d7928aedd8a ""
  "/usr/share/texlive/texmf-dist/tex/latex/graphics-cfg/color.cfg" 1459978653 1213 620bba36b25224fa9b7e1ccb4ecb76fd ""
  "/usr/share/texlive/texmf-dist/tex/latex/graphics-cfg/graphics.cfg" 1465944070 1224 978390e9c2234eab29404bc21b268d1e ""
  "/usr/share/texlive/texmf-dist/tex/latex/graphics-def/pdftex.def" 1485129666 58250 3792a9d2d1d664ee8c742498e295b051 ""
  "/usr/share/texlive/texmf-dist/tex/latex/graphics/graphics.sty" 1485129665 14574 2878810b0466da67e0d0ab10fdd2f6ff ""
  "/usr/share/texlive/texmf-dist/tex/latex/graphics/graphicx.sty" 1480098830 8125 557ab9f1bfa80d369fb45a914aa8a3b4 ""
  "/usr/share/texlive/texmf-dist/tex/latex/graphics/keyval.sty" 1480098830 2594 d18d5e19aa8239cf867fa670c556d2e9 ""
  "/usr/share/texlive/texmf-dist/tex/latex/graphics/trig.sty" 1480098830 3980 0a268fbfda01e381fa95821ab13b6aee ""
  "/usr/share/texlive/texmf-dist/tex/latex/hyperref/hpdftex.def" 1466892657 51978 f1d34923659498bd6d816d7fe15b356e ""
  "/usr/share/texlive/texmf-dist/tex/latex/hyperref/hyperref.sty" 1466892657 233481 0da6f5dacc5df65592ac4c73f69829e5 ""
  "/usr/share/texlive/texmf-dist/tex/latex/hyperref/nameref.sty" 1465687530 12949 81e4e808884a8f0e276b69410e234656 ""
  "/usr/share/texlive/texmf-dist/tex/latex/hyperref/pd1enc.def" 1466892657 14093 b414ff8970a428e35fbcf21703e80980 ""
  "/usr/share/texlive/texmf-dist/tex/latex/latexconfig/epstopdf-sys.cfg" 1279039959 678 4792914a8f45be57bb98413425e4c7af ""
  "/usr/share/texlive/texmf-dist/tex/latex/latexconfig/hyperref.cfg" 1254097189 235 6031e5765137be07eed51a510b2b8fb7 ""
  "/usr/share/texlive/texmf-dist/tex/latex/ms/everysel.sty" 1320274502 4623 936bfb87af7b91b6496a2317f80db16b ""
  "/usr/share/texlive/texmf-dist/tex/latex/ms/everyshi.sty" 1177890616 3878 6aa7c08ff2621006e0603349e40a30a8 ""
  "/usr/share/texlive/texmf-dist/tex/latex/ms/ragged2e.sty" 1244852698 9938 95cd4dc3edfd2c1a9e8f3f4cc43db1ce ""
  "/usr/share/texlive/texmf-dist/tex/latex/natbib/natbib.sty" 1488610416 45458 f1c6cb3edd91174e966cbbaf88993bcf ""
  "/usr/share/texlive/texmf-dist/tex/latex/oberdiek/auxhook.sty" 1463608860 3834 4363110eb0ef1eb2b71c8fcbcdb6c357 ""
  "/usr/share/texlive/texmf-dist/tex/latex/oberdiek/epstopdf-base.sty" 1463608860 12095 5337833c991d80788a43d3ce26bd1c46 ""
  "/usr/share/texlive/texmf-dist/tex/latex/oberdiek/grfext.sty" 1463608860 7075 2fe3d848bba95f139de11ded085e74aa ""
  "/usr/share/texlive/texmf-dist/tex/latex/oberdiek/kvoptions.sty" 1463608860 22417 1d9df1eb66848aa31b18a593099cf45c ""
  "/usr/share/texlive/texmf-dist/tex/latex/oberdiek/rerunfilecheck.sty" 1463608860 9581 023642318cef9f4677efe364de1e2a27 ""
  "/usr/share/texlive/texmf-dist/tex/latex/pgf/basiclayer/pgf.sty" 1439074469 1197 8a80cdde14696a9198f1793a55dcf332 ""
  "/usr/share/texlive/texmf-dist/tex/latex/pgf/basiclayer/pgfcore.sty" 1288312291 410 5bf12ea7330e5f12c445332a4fe9a263 ""
  "/usr/share/texlive/texmf-dist/tex/latex/pgf/compatibility/pgfcomp-version-0-65.sty" 1203877327 21115 facf03b7dbe5ea2f5f1dce1ac84b5d05 ""
  "/usr/share/texlive/texmf-dist/tex/latex/pgf/compatibility/pgfcomp-version-1-18.sty" 1203727794 1091 d9163d29def82ee90370c8a63667742c ""
  "/usr/share/texlive/texmf-dist/tex/latex/pgf/frontendlayer/tikz.sty" 1203877327 339 592cf35cba3d400082b8a9a5d0199d70 ""
  "/usr/share/texlive/texmf-dist/tex/latex/pgf/math/pgfmath.sty" 1393459310 306 0796eafca5e159e6ec2167a6d22d81b1 ""
  "/usr/share/texlive/texmf-dist/tex/latex/pgf/systemlayer/pgfsys.sty" 1393459310 443 0b2e781830192df35c0fd357cf13e26e ""
  "/usr/share/texlive/texmf-dist/tex/latex/pgf/utilities/pgffor.sty" 1393459310 348 8927fde343487e003b01a4c2ca34073b ""
  "/usr/share/texlive/texmf-dist/tex/latex/pgf/utilities/pgfkeys.sty" 1203727794 274 4cad6e665cc93ac2ac979039a94fa1e1 ""
  "/usr/share/texlive/texmf-dist/tex/latex/pgf/utilities/pgfrcs.sty" 1203877327 325 2bcd023400636339210573e2b3ee298b ""
  "/usr/share/texlive/texmf-dist/tex/latex/sttools/cuted.sty" 1350599623 17058 21763634ae8a2f38e062576e588fbf25 ""
  "/usr/share/texlive/texmf-dist/tex/latex/tools/array.sty" 1485129666 12396 d41f82b039f900e95f351e54ae740f31 ""
  "/usr/share/texlive/texmf-dist/tex/latex/tools/calc.sty" 1480098841 10214 d03d065f799d54f6b7e9b175f8d84279 ""
  "/usr/share/texlive/texmf-dist/tex/latex/tools/enumerate.sty" 1480098841 3467 d39e40f25d5fd2b3b49a58d155063dd6 ""
  "/usr/share/texlive/texmf-dist/tex/latex/tools/tabularx.sty" 1480098841 7141 64e8a94c3d083215654cd9a5b9dcc136 ""
  "/usr/share/texlive/texmf-dist/tex/latex/tools/xspace.sty" 1480098841 4544 8b8f59969458e1c25e0559e8e0ced1a4 ""
  "/usr/share/texlive/texmf-dist/tex/latex/txfonts/omltxmi.fd" 1137111002 492 e7f8afe4428797548d4301de03a1b15f ""
  "/usr/share/texlive/texmf-dist/tex/latex/txfonts/omstxsy.fd" 1137111002 329 6ac7e19535b9f1d64e4d8e3f77dc30a3 ""
  "/usr/share/texlive/texmf-dist/tex/latex/txfonts/omxtxex.fd" 1137111002 312 11fe1916b0a13a81a05234a6fc7f8738 ""
  "/usr/share/texlive/texmf-dist/tex/latex/txfonts/ot1txr.fd" 1137111002 1271 4e3afbd8e832f2f9c7f064894e6e68e4 ""
  "/usr/share/texlive/texmf-dist/tex/latex/txfonts/ot1txss.fd" 1137111002 1375 b9d8628471eb35e3cf16d9665f977016 ""
  "/usr/share/texlive/texmf-dist/tex/latex/txfonts/t1txr.fd" 1137111002 1242 cbf8a0d4f750f9833a0bfb05fb39f1cb ""
  "/usr/share/texlive/texmf-dist/tex/latex/txfonts/t1txss.fd" 1137111002 1362 13e59690199f58f0836298f1c5f460eb ""
  "/usr/share/texlive/texmf-dist/tex/latex/txfonts/t1txtt.fd" 1137111002 1324 7b6c95370a64cd8c7620cbefefb53dba ""
  "/usr/share/texlive/texmf-dist/tex/latex/txfonts/txfonts.sty" 1206746551 50381 d367461010070c7a491b1f6979ab2062 ""
  "/usr/share/texlive/texmf-dist/tex/latex/txfonts/utxexa.fd" 1137111002 310 1b00b0b05685b816e4c6caccce437e0d ""
  "/usr/share/texlive/texmf-dist/tex/latex/txfonts/utxmia.fd" 1137111002 334 87436a82076ca2e35cd305f852507afc ""
  "/usr/share/texlive/texmf-dist/tex/latex/txfonts/utxsya.fd" 1137111002 310 cee07e4964749ccbc77d84fc49726a79 ""
  "/usr/share/texlive/texmf-dist/tex/latex/txfonts/utxsyb.fd" 1137111002 310 8c5467c8932c259af51b0f116c9734bd ""
  "/usr/share/texlive/texmf-dist/tex/latex/txfonts/utxsyc.fd" 1137111002 310 4b5d6fe830337242ef847b3bff48ba21 ""
  "/usr/share/texlive/texmf-dist/tex/latex/url/url.sty" 1388531844 12796 8edb7d69a20b857904dd0ea757c14ec9 ""
  "/usr/share/texlive/texmf-dist/tex/latex/xcolor/xcolor.sty" 1463002160 55589 34128738f682d033422ca125f82e5d62 ""
  "/usr/share/texlive/texmf-dist/web2c/texmf.cnf" 1488610416 31340 0f53f8665296bf8fe6c697f9505e31d8 ""
  "/usr/share/texmf/web2c/texmf.cnf" 1488610416 31340 0f53f8665296bf8fe6c697f9505e31d8 ""
  "/var/lib/texmf/fonts/map/pdftex/updmap/pdftex.map" 1494732675 128086 9cf6be30df08bb32d79772b2e2dba303 ""
  "/var/lib/texmf/web2c/pdftex/pdflatex.fmt" 1494732671 719476 9ed8657cbcf3dabce85f3e6fe4beb52e ""
  "JackCommands.sty" 1508351285 39417 5617dc2be6febc50193b12df925ec723 ""
  "Lattice2017_249_JackDragos_Draft_Jordy.aux" 1508352364 10913 c07c1b39ad05eae36813fffc7389d5df ""
  "Lattice2017_249_JackDragos_Draft_Jordy.bbl" 1508352364 2876 c539079dea34a71ab7a42cfacbecad19 "bibtex Lattice2017_249_JackDragos_Draft_Jordy"
  "Lattice2017_249_JackDragos_Draft_Jordy.out" 1508352364 594 5563a58b1271e6cf06ca9c245700a783 ""
  "Lattice2017_249_JackDragos_Draft_Jordy.tex" 1508352360 43185 c77065ff67b3b674b2cde00a870b17ff ""
  "graphs/F3/Top/MassComp/NeutronBNLF3.pdf" 1501618601 43400 e29023b4f536b9edb10e47c3c7d8b1c0 ""
  "graphs/F3/Top/MassComp/NeutronF3.pdf" 1501618601 41671 44550929862ef585e1909e8c7e175447 ""
  "graphs/F3/Top/MassComp/ProtonBNLF3.pdf" 1501618601 44030 ecdbb993faf3c7b19c4580bdd3ce8a96 ""
  "graphs/F3/Top/MassComp/ProtonF3.pdf" 1501618601 40500 8f4b82f31b1e00135b1dfaca984b564d ""
  "graphs/F3/Wein/FlowComp/Neutronmpi411F3.pdf" 1501618601 44367 11f487e63d3f58dd338c985e5b1835fc ""
  "graphs/F3/Wein/FlowComp/Neutronmpi701F3.pdf" 1501618601 42248 9ce12f171d7025d63757a63064c80a12 ""
  "graphs/F3/Wein/MassComp/NeutronBNLF3.pdf" 1501618601 45666 e83326603eb0996c4676c5d650bd95aa ""
  "graphs/F3/Wein/MassComp/NeutronF3.pdf" 1501618601 42778 bb27963b5175223600a211e646972677 ""
  "graphs/F3/Wein/MassComp/ProtonBNLF3.pdf" 1501618601 44041 fa3aea0553888a62a3f5a6cc37645387 ""
  "graphs/F3/Wein/MassComp/ProtonF3.pdf" 1501618601 42029 ed1e637219923125be3c97986e71a23e ""
  "graphs/FlowOps/ChitQ2.pdf" 1501618601 41241 dff1b38d2e9a62d20b6d7f19a17b44f2 ""
  "graphs/FlowOps/ChitQW.pdf" 1501618601 41397 1f50e70f11e4180315809ff636668f13 ""
  "graphs/FlowOps/ChitW2.pdf" 1501618601 40383 6b42be8f75eca26d6e00159ad47aef6b ""
  "webofc.cls" 1498231448 23666 25d037d8effa52f77c95cabeb475053e ""
  (generated)
  "/home/jackdra/PHD/INPC/MSU/Lat2017/PoS/Lat2017proc/Lattice2017_249_JackDragos_Draft_Jordy.log"
  "Lattice2017_249_JackDragos_Draft_Jordy.out"
  "/home/jackdra/PHD/INPC/MSU/Lat2017/PoS/Lat2017proc/Lattice2017_249_JackDragos_Draft_Jordy.pdf"
  "Lattice2017_249_JackDragos_Draft_Jordy.log"
  "Lattice2017_249_JackDragos_Draft_Jordy.aux"
  "Lattice2017_249_JackDragos_Draft_Jordy.pdf"
