\relax 
\providecommand\hyper@newdestlabel[2]{}
\bibstyle{woc}
\providecommand\HyperFirstAtBeginDocument{\AtBeginDocument}
\HyperFirstAtBeginDocument{\ifx\hyper@anchor\@undefined
\global\let\oldcontentsline\contentsline
\gdef\contentsline#1#2#3#4{\oldcontentsline{#1}{#2}{#3}}
\global\let\oldnewlabel\newlabel
\gdef\newlabel#1#2{\newlabelxx{#1}#2}
\gdef\newlabelxx#1#2#3#4#5#6{\oldnewlabel{#1}{{#2}{#3}}}
\AtEndDocument{\ifx\hyper@anchor\@undefined
\let\contentsline\oldcontentsline
\let\newlabel\oldnewlabel
\fi}
\fi}
\global\let\hyper@last\relax 
\gdef\HyperFirstAtBeginDocument#1{#1}
\providecommand\HyField@AuxAddToFields[1]{}
\providecommand\HyField@AuxAddToCoFields[2]{}
\citation{Olive:2016xmw}
\citation{Griffith:2009zz}
\select@language{english}
\@writefile{toc}{\select@language{english}}
\@writefile{lof}{\select@language{english}}
\@writefile{lot}{\select@language{english}}
\select@language{english}
\@writefile{toc}{\select@language{english}}
\@writefile{lof}{\select@language{english}}
\@writefile{lot}{\select@language{english}}
\@writefile{toc}{\contentsline {section}{\numberline {1}Introduction}{1}{section.1}}
\newlabel{intro}{{1}{1}{Introduction}{section.1}{}}
\citation{Aoki:2010wm}
\citation{BECKETT20111208}
\citation{Aoki:2010wm}
\@writefile{toc}{\contentsline {section}{\numberline {2}Theory}{2}{section.2}}
\newlabel{theory}{{2}{2}{Theory}{section.2}{}}
\@writefile{toc}{\contentsline {section}{\numberline {3}Lattice Parameters}{2}{section.3}}
\newlabel{LatParams}{{3}{2}{Lattice Parameters}{section.3}{}}
\@writefile{toc}{\contentsline {section}{\numberline {4}Topological and Weinberg Susceptibilities }{2}{section.4}}
\newlabel{Succeptability}{{4}{2}{Topological and Weinberg Susceptibilities}{section.4}{}}
\citation{Luscher:2011bx}
\citation{Wolff:2003sm}
\citation{Wolff:2003sm}
\@writefile{toc}{\contentsline {subsection}{\numberline {4.1}Gradient Flow Formalism for Gauge Fields}{3}{subsection.4.1}}
\newlabel{GradFlow}{{4.1}{3}{Gradient Flow Formalism for Gauge Fields}{subsection.4.1}{}}
\newlabel{GradFlowEq}{{5}{3}{Gradient Flow Formalism for Gauge Fields}{equation.4.5}{}}
\@writefile{toc}{\contentsline {subsection}{\numberline {4.2}Susceptibility results}{3}{subsection.4.2}}
\newlabel{SuscRes}{{4.2}{3}{Susceptibility results}{subsection.4.2}{}}
\@writefile{lof}{\contentsline {figure}{\numberline {1}{\ignorespaces  Topological (left) and Weinberg (right) susceptibilities in \(GeV\), plotted against gradient flow time converted to root-mean-square (rms) smearing radius. Blue and red points are the \(m_{\pi } = 411, 701\ MeV\) results respectively. Errors were estimated using an Autocorrelation analysis technique described in \cite  {Wolff:2003sm}.}}{4}{figure.1}}
\newlabel{ChitRes}{{1}{4}{Topological (left) and Weinberg (right) susceptibilities in \(GeV\), plotted against gradient flow time converted to root-mean-square (rms) smearing radius. Blue and red points are the \(m_{\pi } = 411, 701\ MeV\) results respectively. Errors were estimated using an Autocorrelation analysis technique described in \cite {Wolff:2003sm}}{figure.1}{}}
\@writefile{lof}{\contentsline {figure}{\numberline {2}{\ignorespaces  Demonstration of the cross correlation \(\mathinner {\delimiter "426830A {QW}\delimiter "526930B }\) in \(GeV^{6}\) against rms smearing radius. Blue and red points are the \(m_{\pi } = 411, 701\ MeV\) results respectively. Errors were estimated using an Autocorrelation analysis technique described in \cite  {Wolff:2003sm}.}}{4}{figure.2}}
\newlabel{ChitQWRes}{{2}{4}{Demonstration of the cross correlation \(\braket {QW}\) in \(GeV^{6}\) against rms smearing radius. Blue and red points are the \(m_{\pi } = 411, 701\ MeV\) results respectively. Errors were estimated using an Autocorrelation analysis technique described in \cite {Wolff:2003sm}}{figure.2}{}}
\citation{Shindler:2015aqa}
\citation{Ottnad:2009jw}
\citation{Evans:2008zzb}
\@writefile{toc}{\contentsline {section}{\numberline {5}Nucleon Observables in CP-breaking theory}{5}{section.5}}
\newlabel{NuclObsCP}{{5}{5}{Nucleon Observables in CP-breaking theory}{section.5}{}}
\@writefile{toc}{\contentsline {subsection}{\numberline {5.1}The Small Coefficient Expansion}{5}{subsection.5.1}}
\newlabel{CPExp}{{5.1}{5}{The Small Coefficient Expansion}{subsection.5.1}{}}
\newlabel{SmallExpEq}{{10}{5}{The Small Coefficient Expansion}{equation.5.10}{}}
\@writefile{toc}{\contentsline {subsection}{\numberline {5.2}Nucleon Mixing Angle}{5}{subsection.5.2}}
\newlabel{NucMixAng}{{5.2}{5}{Nucleon Mixing Angle}{subsection.5.2}{}}
\newlabel{G2ptcorr}{{14}{6}{Nucleon Mixing Angle}{equation.5.14}{}}
\newlabel{AlphaExp}{{17}{6}{Nucleon Mixing Angle}{equation.5.17}{}}
\newlabel{AlphaRat}{{18}{6}{Nucleon Mixing Angle}{equation.5.18}{}}
\@writefile{toc}{\contentsline {subsection}{\numberline {5.3}CP-odd Form Factor \(F_{3}\) and the Electric Dipole Moment}{7}{subsection.5.3}}
\newlabel{EDMRes}{{5.3}{7}{CP-odd Form Factor \(F_{3}\) and the Electric Dipole Moment}{subsection.5.3}{}}
\newlabel{F3TOEDM}{{19}{7}{CP-odd Form Factor \(F_{3}\) and the Electric Dipole Moment}{equation.5.19}{}}
\newlabel{Rfun}{{21}{7}{CP-odd Form Factor \(F_{3}\) and the Electric Dipole Moment}{equation.5.21}{}}
\newlabel{FFSPExp}{{24}{7}{CP-odd Form Factor \(F_{3}\) and the Electric Dipole Moment}{equation.5.24}{}}
\citation{Olive:2016xmw}
\citation{Ottnad:2009jw}
\@writefile{lof}{\contentsline {figure}{\numberline {3}{\ignorespaces  CP-odd vector form factor \(F_{3}/2m\) for the neutron (left) and proton (right), induced via the \(\theta \)-term CP-violating vacuum, plotted against transfer momentum \(Q^{2}\). Blue and red points are the \(m_{\pi } = 411, 701\ MeV\) results respectively. The linear fit to \(Q^{2}\rightarrow 0\) is used to extract the value for the neutron and proton EDM \(d_{N/P}\)}}{8}{figure.3}}
\newlabel{TopF3}{{3}{8}{CP-odd vector form factor \(F_{3}/2m\) for the neutron (left) and proton (right), induced via the \(\theta \)-term CP-violating vacuum, plotted against transfer momentum \(Q^{2}\). Blue and red points are the \(m_{\pi } = 411, 701\ MeV\) results respectively. The linear fit to \(Q^{2}\rightarrow 0\) is used to extract the value for the neutron and proton EDM \(d_{N/P}\)}{figure.3}{}}
\@writefile{toc}{\contentsline {subsection}{\numberline {5.4}Results}{8}{subsection.5.4}}
\newlabel{results}{{5.4}{8}{Results}{subsection.5.4}{}}
\citation{Abramczyk:2017oxr}
\citation{Abramczyk:2017oxr}
\citation{Abramczyk:2017oxr}
\@writefile{lof}{\contentsline {figure}{\numberline {4}{\ignorespaces  CP-odd vector form factor \(F_{3}/2m\) for the neutron (left) and proton (right), induced via the \textit  {Weinberg operator} CP-violating vacuum, plotted against transfer momentum \(Q^{2}\). Blue and red points are the \(m_{\pi } = 411, 701\ MeV\) results respectively. The linear fit to \(Q^{2}\rightarrow 0\) is used to extract the value for the neutron and proton EDM \(d_{N/P}\).}}{9}{figure.4}}
\newlabel{WeinF3}{{4}{9}{CP-odd vector form factor \(F_{3}/2m\) for the neutron (left) and proton (right), induced via the \textit {Weinberg operator} CP-violating vacuum, plotted against transfer momentum \(Q^{2}\). Blue and red points are the \(m_{\pi } = 411, 701\ MeV\) results respectively. The linear fit to \(Q^{2}\rightarrow 0\) is used to extract the value for the neutron and proton EDM \(d_{N/P}\)}{figure.4}{}}
\citation{Abramczyk:2017oxr}
\@writefile{lof}{\contentsline {figure}{\numberline {5}{\ignorespaces  Flow time dependence from \(t_{f} = 4.01\) (blue) to \(t_{f} = 8.01\) (red) of the CP-odd vector form factor \(F_{3}/2m\), induced via the \textit  {Weinberg} CP-violating vacuum, plotted against transfer momentum \(Q^{2}\). Left and right plots show the \(m_{\pi } = 411, 701\ MeV\) results respectively. The linear fit to \(Q^{2}\rightarrow 0\) is used to extract the value for the neutron and proton EDM \(d_{N/P}\).}}{10}{figure.5}}
\newlabel{WeinF3FlowDep}{{5}{10}{Flow time dependence from \(t_{f} = 4.01\) (blue) to \(t_{f} = 8.01\) (red) of the CP-odd vector form factor \(F_{3}/2m\), induced via the \textit {Weinberg} CP-violating vacuum, plotted against transfer momentum \(Q^{2}\). Left and right plots show the \(m_{\pi } = 411, 701\ MeV\) results respectively. The linear fit to \(Q^{2}\rightarrow 0\) is used to extract the value for the neutron and proton EDM \(d_{N/P}\)}{figure.5}{}}
\@writefile{lof}{\contentsline {figure}{\numberline {6}{\ignorespaces  Corrections suggested by \cite  {Abramczyk:2017oxr} for the CP-odd vector form factor \(F_{3}/2m\) for the neutron (left) and proton (right), induced via the \textit  {\(\theta \)-term} CP-violating vacuum, plotted against transfer momentum \(Q^{2}\). Blue and red points are the \(m_{\pi } = 411, 701\ MeV\) results respectively. The linear fit to \(Q^{2}\rightarrow 0\) is used to extract the value for the neutron and proton EDM \(d_{N/P}\).}}{10}{figure.6}}
\newlabel{TopF3BNL}{{6}{10}{Corrections suggested by \cite {Abramczyk:2017oxr} for the CP-odd vector form factor \(F_{3}/2m\) for the neutron (left) and proton (right), induced via the \textit {\(\theta \)-term} CP-violating vacuum, plotted against transfer momentum \(Q^{2}\). Blue and red points are the \(m_{\pi } = 411, 701\ MeV\) results respectively. The linear fit to \(Q^{2}\rightarrow 0\) is used to extract the value for the neutron and proton EDM \(d_{N/P}\)}{figure.6}{}}
\bibdata{lattice2017}
\bibcite{Olive:2016xmw}{{1}{}{{}}{{}}}
\bibcite{Griffith:2009zz}{{2}{}{{}}{{}}}
\bibcite{Aoki:2010wm}{{3}{}{{}}{{}}}
\bibcite{BECKETT20111208}{{4}{}{{}}{{}}}
\bibcite{Luscher:2011bx}{{5}{}{{}}{{}}}
\bibcite{Wolff:2003sm}{{6}{}{{}}{{}}}
\bibcite{Shindler:2015aqa}{{7}{}{{}}{{}}}
\bibcite{Ottnad:2009jw}{{8}{}{{}}{{}}}
\bibcite{Evans:2008zzb}{{9}{}{{}}{{}}}
\bibcite{Abramczyk:2017oxr}{{10}{}{{}}{{}}}
\providecommand\NAT@force@numbers{}\NAT@force@numbers
\@writefile{lof}{\contentsline {figure}{\numberline {7}{\ignorespaces  Corrections suggested by \cite  {Abramczyk:2017oxr} CP-odd vector form factor \(F_{3}/2m\) for the neutron (left) and proton (right), induced via the \textit  {Weinberg operator} CP-violating vacuum, plotted against transfer momentum \(Q^{2}\). Blue and red points are the \(m_{\pi } = 411, 701\ MeV\) results respectively. The linear fit to \(Q^{2}\rightarrow 0\) is used to extract the value for the neutron and proton EDM \(d_{N/P}\).}}{11}{figure.7}}
\newlabel{WeinF3BNL}{{7}{11}{Corrections suggested by \cite {Abramczyk:2017oxr} CP-odd vector form factor \(F_{3}/2m\) for the neutron (left) and proton (right), induced via the \textit {Weinberg operator} CP-violating vacuum, plotted against transfer momentum \(Q^{2}\). Blue and red points are the \(m_{\pi } = 411, 701\ MeV\) results respectively. The linear fit to \(Q^{2}\rightarrow 0\) is used to extract the value for the neutron and proton EDM \(d_{N/P}\)}{figure.7}{}}
\@writefile{toc}{\contentsline {subsection}{\numberline {5.5}Conclusion}{11}{subsection.5.5}}
\newlabel{Con}{{5.5}{11}{Conclusion}{subsection.5.5}{}}
