\boolfalse {citerequest}\boolfalse {citetracker}\boolfalse {pagetracker}\boolfalse {backtracker}\relax 
\defcounter {refsection}{0}\relax 
\beamer@sectionintoc {1}{Motivation}{25}{0}{1}
\defcounter {refsection}{0}\relax 
\beamer@sectionintoc {2}{Lattice QCD Formalism}{30}{0}{2}
