
<svg xmlns="http://www.w3.org/2000/svg" version="1.1" xmlns:xlink="http://www.w3.org/1999/xlink" preserveAspectRatio="none" x="0px" y="0px" width="128px" height="128px" viewBox="0 0 128 128">
<defs>
<g id="Layer0_0_FILL">
<path fill="#0066CB" stroke="none" d="
M 37.6 31.85
Q 25.25 23.95 10.7 25.7 3.2 27 -4.25 31 -16.6 38.05 -30.7 38.05 -45.25 37.6 -57.6 30.55 -44.35 60.05 -21.45 83.85 -9.55 96.2 6.75 107.65
L 16 112.95
Q 33.2 103.25 48.6 88.25
L 49.5 86.95 51.7 83
Q 58.3 68.9 53.9 53.9 49.95 40.25 37.6 31.85
M 37.15 -62
Q 25.7 -62.85 19.55 -62.85 -10.45 -63.75 -35.55 -55.4 -54.5 -50.1 -72.1 -39.95
L -71.25 -19.25 -67.7 -1.2 -66.85 1.45
Q -59.8 16.45 -44.35 22.6 -28.95 28.35 -13.95 21.3 2.8 12.9 7.65 -4.25
L 9.4 -16.15
Q 9.85 -30.25 17.3 -42.6 24.8 -54.95 37.15 -62
M 74.15 -53.2
Q 63.15 -56.7 52.55 -54.05 37.15 -50.1 28.8 -36.85 19.95 -23.65 23.05 -7.8 26.15 9.4 41.1 18.65
L 43.3 19.95
Q 55.65 27.45 62.25 40.25 68.9 51.7 68.9 65.35
L 75.5 56.1
Q 99.3 19.1 103.25 -25.4
L 104.15 -39.95 91.8 -46.15
Q 81.65 -50.95 74.15 -53.2 Z"/>
</g>
</defs>

<g transform="matrix( 0.5117645263671875, 0, 0, 0.5116424560546875, 55.8,51.2) ">
<use xlink:href="#Layer0_0_FILL"/>
</g>
</svg>
