
<svg xmlns="http://www.w3.org/2000/svg" version="1.1" xmlns:xlink="http://www.w3.org/1999/xlink" preserveAspectRatio="none" x="0px" y="0px" width="128px" height="128px" viewBox="0 0 128 128">
<defs>
<g id="Layer0_0_FILL">
<path fill="#0066CB" stroke="none" d="
M 64.05 82.9
L 37.8 68.1 64 108.95 64 109 64.05 108.95 90.2 68.1 64.05 82.9
M 64 78.25
L 64.05 78.25 89.3 64 64.05 49.75 64 49.75 38.75 64 64 78.2 64 78.25
M 64.05 19.05
L 64 19 64 19.05 37.8 59.7 64.05 45.1 90.2 59.7 64.05 19.05 Z"/>
</g>
</defs>

<g transform="matrix( 1, 0, 0, 1, 0,0) ">
<use xlink:href="#Layer0_0_FILL"/>
</g>
</svg>
