
<svg xmlns="http://www.w3.org/2000/svg" version="1.1" xmlns:xlink="http://www.w3.org/1999/xlink" preserveAspectRatio="none" x="0px" y="0px" width="128px" height="128px" viewBox="0 0 128 128">
<defs>
<g id="Layer0_0_MEMBER_0_FILL">
<path fill="#0066CB" stroke="none" d="
M 102.55 87.4
L 83.65 87.4 83.65 63.45 64.3 83 44.6 63.45 44.6 87.4 25.7 87.4
Q 31.7 97.15 41.9 103 52.25 109 64.1 109 76.15 109 86.55 103 96.55 97.15 102.55 87.4
M 93.45 78.25
L 106.7 78.25
Q 109 72 109 64.1 109 45.4 95.9 32.3 82.85 19 64.1 19 45.4 19 32.35 32.1 19.25 45.4 19.05 63.9
L 19.05 64.1
Q 19.05 70.75 21.5 78.25
L 34.85 78.25 34.85 40.4 64.1 69.75 93.45 40.4 93.45 78.25 Z"/>
</g>
</defs>

<g transform="matrix( 1, 0, 0, 1, 0,0) ">
<use xlink:href="#Layer0_0_MEMBER_0_FILL"/>
</g>
</svg>
