<?xml version="1.0" encoding="utf-8"?>
<!-- Generator: Adobe Illustrator 16.0.0, SVG Export Plug-In . SVG Version: 6.00 Build 0)  -->
<!DOCTYPE svg PUBLIC "-//W3C//DTD SVG 1.1//EN" "http://www.w3.org/Graphics/SVG/1.1/DTD/svg11.dtd">
<svg version="1.1" id="Layer_1" xmlns="http://www.w3.org/2000/svg" xmlns:xlink="http://www.w3.org/1999/xlink" x="0px" y="0px"
	 width="128px" height="128px" viewBox="0 0 128 128" enable-background="new 0 0 128 128" xml:space="preserve">
<path fill="#0066CB" d="M36.893,65.695c-14.028,0-25.399,11.405-25.399,25.473c0,14.068,11.373,25.474,25.4,25.474
	s25.4-11.405,25.4-25.474C62.294,77.101,50.922,65.695,36.893,65.695L36.893,65.695z M36.893,108.938
	c-9.775,0-17.708-7.951-17.708-17.76s7.929-17.76,17.708-17.76c9.778,0,17.708,7.951,17.708,17.76
	C54.584,100.977,46.666,108.924,36.893,108.938L36.893,108.938z M91.138,11.359c-14.027,0-25.4,11.404-25.4,25.473
	s11.373,25.473,25.4,25.473c14.028,0,25.4-11.404,25.4-25.473S105.167,11.358,91.138,11.359L91.138,11.359z M91.138,54.6
	c-9.776,0-17.707-7.95-17.707-17.759s7.925-17.759,17.708-17.759c9.784,0,17.709,7.95,17.709,17.759
	C108.831,46.645,100.906,54.582,91.138,54.6L91.138,54.6z M36.893,11.358C24.8,11.351,14.375,19.892,11.972,31.777
	S15.85,55.601,26.984,60.32c12.968,5.446,27.896-0.649,33.343-13.618c3.961-9.43,1.896-20.315-5.243-27.639h7.202v-7.705H36.893z
	 M54.602,36.831c0,9.808-7.928,17.759-17.708,17.759s-17.707-7.951-17.707-17.759s7.927-17.756,17.706-17.756
	c9.778,0,17.7,7.953,17.718,17.759h-0.009V36.831z"/>
</svg>
