<?xml version="1.0" encoding="utf-8"?>
<!-- Generator: Adobe Illustrator 16.0.0, SVG Export Plug-In . SVG Version: 6.00 Build 0)  -->
<!DOCTYPE svg PUBLIC "-//W3C//DTD SVG 1.1//EN" "http://www.w3.org/Graphics/SVG/1.1/DTD/svg11.dtd">
<svg version="1.1" id="Layer_1" xmlns="http://www.w3.org/2000/svg" xmlns:xlink="http://www.w3.org/1999/xlink" x="0px" y="0px"
	 width="128px" height="128px" viewBox="0 0 128 128" enable-background="new 0 0 128 128" xml:space="preserve">
<g>
	<g>
		<path fill="#0066CB" d="M64.018,20.085c-24.276,0-43.915,19.674-43.915,43.915c0,24.242,19.639,43.915,43.915,43.915
			c24.273,0,43.88-19.673,43.88-43.915C107.897,39.759,88.258,20.085,64.018,20.085z M64.018,97.812
			c-18.674,0-33.813-15.139-33.813-33.812s15.139-33.812,33.813-33.812c18.672,0,33.777,15.139,33.777,33.812
			S82.655,97.812,64.018,97.812z"/>
		<g>
			<g>
				<path id="XMLID_145_" fill="#0066CB" d="M49.379,79.005l1.7-3.367h20.274c2.8,0,5.067-2.268,5.067-5.069l0,0
					c0-2.8-2.268-5.067-5.067-5.067H54.446v-3.369h16.873c4.668,0,8.437,3.77,8.437,8.437l0,0c0,4.668-3.769,8.437-8.437,8.437
					H49.379z"/>
				<path fill="#0066CB" d="M71.319,79.938H47.845l2.635-5.268h20.84c2.267,0,4.135-1.867,4.135-4.135S73.586,66.4,71.319,66.4
					H53.513v-5.268h17.807c5.168,0,9.37,4.201,9.37,9.37C80.689,75.67,76.487,79.938,71.319,79.938z M50.88,78.072h20.439
					c4.135,0,7.503-3.367,7.503-7.504c0-4.134-3.368-7.502-7.503-7.502H55.381v1.5h15.938c3.301,0,6.002,2.701,6.002,6.002
					c0,3.302-2.701,6.003-6.002,6.003H51.646L50.88,78.072z"/>
			</g>
			<g>
				<path id="XMLID_144_" fill="#0066CB" d="M49.379,48.429l1.7,3.367h18.007c2.799,0,5.067,2.268,5.067,5.068l0,0
					c0,2.801-2.269,5.068-5.067,5.068H56.114v3.368h12.938c4.668,0,8.437-3.769,8.437-8.437l0,0c0-4.669-3.769-8.436-8.437-8.436
					H49.379z"/>
				<path fill="#0066CB" d="M69.052,66.268H55.181v-5.269h13.871c2.268,0,4.135-1.867,4.135-4.135s-1.867-4.136-4.135-4.136H50.445
					l-2.634-5.268h21.207c5.168,0,9.37,4.201,9.37,9.37C78.389,61.999,74.254,66.268,69.052,66.268z M57.048,64.366h12.004
					c4.135,0,7.502-3.367,7.502-7.502c0-4.136-3.367-7.503-7.502-7.503H50.88l0.767,1.501h17.439c3.299,0,6.001,2.7,6.001,6.002
					c0,3.301-2.702,6.002-6.001,6.002H57.081v1.5H57.048z"/>
			</g>
			<g>
				<rect id="XMLID_143_" x="54.446" y="48.628" fill="#0066CB" width="3.368" height="30.377"/>
				<path fill="#0066CB" d="M58.749,79.938H53.48V47.661h5.269V79.938z M55.381,78.072h1.5V49.562h-1.5V78.072z"/>
			</g>
			<g>
				<rect id="XMLID_142_" x="58.548" y="43.36" fill="#0066CB" width="3.368" height="6.769"/>
				<path fill="#0066CB" d="M62.416,50.596h-4.301v-7.703h4.301V50.596z M59.015,49.662h2.435v-5.803h-2.435V49.662z"/>
			</g>
			<g>
				<rect id="XMLID_141_" x="65.884" y="43.36" fill="#0066CB" width="3.368" height="6.769"/>
				<path fill="#0066CB" d="M69.718,50.596h-4.301v-7.703h4.301V50.596z M66.351,49.662h2.435v-5.803h-2.435V49.662z"/>
			</g>
			<g>
				<rect id="XMLID_140_" x="58.548" y="77.139" fill="#0066CB" width="3.368" height="6.769"/>
				<path fill="#0066CB" d="M62.416,84.342h-4.301v-7.671h4.301V84.342z M59.015,83.406h2.435v-5.801h-2.435V83.406z"/>
			</g>
			<g>
				<rect id="XMLID_139_" x="65.884" y="77.139" fill="#0066CB" width="3.368" height="6.769"/>
				<path fill="#0066CB" d="M69.718,84.342h-4.301v-7.671h4.301V84.342z M66.351,83.406h2.435v-5.801h-2.435V83.406z"/>
			</g>
		</g>
		<path fill="#0066CB" d="M64.018,93.91c-16.506,0-29.911-13.404-29.911-29.91s13.405-29.91,29.911-29.91
			c16.504,0,29.909,13.404,29.909,29.91S80.489,93.91,64.018,93.91z M64.018,37.091c-14.839,0-26.91,12.071-26.91,26.909
			c0,14.839,12.071,26.909,26.91,26.909c14.838,0,26.908-12.07,26.908-26.909C90.926,49.162,78.855,37.091,64.018,37.091z"/>
	</g>
</g>
</svg>
