<?xml version="1.0" encoding="utf-8"?>
<!-- Generator: Adobe Illustrator 16.0.0, SVG Export Plug-In . SVG Version: 6.00 Build 0)  -->
<!DOCTYPE svg PUBLIC "-//W3C//DTD SVG 1.1//EN" "http://www.w3.org/Graphics/SVG/1.1/DTD/svg11.dtd">
<svg version="1.1" id="Layer_1" xmlns="http://www.w3.org/2000/svg" xmlns:xlink="http://www.w3.org/1999/xlink" x="0px" y="0px"
	 width="128px" height="128px" viewBox="0 0 128 128" enable-background="new 0 0 128 128" xml:space="preserve">
<path fill="#0066CB" d="M64,14.126l-9.151,5.262L29.912,33.801l-9.151,5.262v49.874l9.151,5.262l25.166,14.413l9.151,5.263
	l9.15-5.263l24.709-14.413l9.152-5.262V39.063l-9.152-5.262L73.152,19.388L64,14.126z M39.063,78.413V49.586L64,35.174
	l24.936,14.413v28.827L64,92.826L39.063,78.413z"/>
</svg>
