<?xml version="1.0" encoding="utf-8"?>
<!-- Generator: Adobe Illustrator 16.0.0, SVG Export Plug-In . SVG Version: 6.00 Build 0)  -->
<!DOCTYPE svg PUBLIC "-//W3C//DTD SVG 1.1//EN" "http://www.w3.org/Graphics/SVG/1.1/DTD/svg11.dtd">
<svg version="1.1" id="Layer_1" xmlns="http://www.w3.org/2000/svg" xmlns:xlink="http://www.w3.org/1999/xlink" x="0px" y="0px"
	 width="128px" height="128px" viewBox="0 0 128 128" enable-background="new 0 0 128 128" xml:space="preserve">
<path fill="#0066CB" d="M17.816,49.633l46.768,29.47c0.03,0.023,0.071,0.023,0.102,0l47.711-30.137
	c0.042-0.026,0.058-0.081,0.03-0.123c-0.001-0.002-0.002-0.004-0.004-0.006c-0.005-0.012-0.014-0.022-0.026-0.027L65.126,18.682
	c-0.032-0.021-0.072-0.021-0.104,0L17.816,49.472c-0.043,0.03-0.052,0.092-0.02,0.135c0.001,0.001,0.002,0.003,0.003,0.004
	C17.804,49.619,17.809,49.626,17.816,49.633z M64.586,113.657c-0.623,0-1.231-0.179-1.752-0.517L12.748,80.886
	c-0.032-0.037-0.032-0.092,0-0.129l2.133-3.317c0.037-0.033,0.092-0.033,0.128,0l49.552,31.916c0.031,0.02,0.072,0.02,0.104,0
	l46.961-30.179c1.078-0.685,1.727-1.874,1.726-3.15v-7.431c-0.007-0.052-0.052-0.093-0.104-0.091c-0.015,0-0.029,0.004-0.043,0.012
	L65.772,98.724c-1.059,0.674-2.412,0.674-3.473,0L14.369,68.229c-2.373-1.486-3.814-4.088-3.813-6.888V50.947
	c-0.002-0.839,0.324-1.648,0.909-2.251l0.16-0.129l0.92-0.63L63.391,14.8l0.054-0.032c1.041-0.594,2.327-0.563,3.34,0.081
	l49.153,31.312c1.513,0.959,1.961,2.962,1.002,4.476c-0.257,0.404-0.6,0.745-1.002,1.001l-49.572,31.3
	c-1.057,0.657-2.394,0.657-3.448,0l-48.09-30.275c-0.045-0.026-0.102-0.011-0.129,0.032c-0.009,0.015-0.013,0.032-0.011,0.048v8.593
	c-0.005,1.381,0.698,2.666,1.863,3.406l47.442,30.153c0.031,0.022,0.072,0.022,0.103,0l48.389-30.871
	c1.224-0.784,2.821-0.652,3.902,0.321c0.688,0.657,1.068,1.575,1.039,2.526v9.119c0.008,2.688-1.356,5.195-3.621,6.646
	L66.31,113.152c-0.519,0.324-1.115,0.497-1.724,0.502l0,0V113.657z"/>
</svg>
