<?xml version="1.0" encoding="utf-8"?>
<!-- Generator: Adobe Illustrator 16.0.0, SVG Export Plug-In . SVG Version: 6.00 Build 0)  -->
<svg version="1.2" baseProfile="tiny" id="Layer_1" xmlns="http://www.w3.org/2000/svg" xmlns:xlink="http://www.w3.org/1999/xlink"
	 x="0px" y="0px" width="210px" height="225px" viewBox="0 0 210 225" xml:space="preserve">
<title>ic_Trusty</title>
<g>
	<path fill="#0EDA7C" d="M68.855,15L15,68.855"/>
	<path fill="none" stroke="#F5F5F5" stroke-width="30" stroke-linecap="round" stroke-linejoin="round" stroke-opacity="0.7" d="
		M68.855,15L15,68.855"/>
	<path fill="#0EDA7C" d="M126.688,29.458l-97.59,97.59"/>
	<path fill="none" stroke="#F5F5F5" stroke-width="30" stroke-linecap="round" stroke-linejoin="round" stroke-opacity="0.7" d="
		M126.688,29.458l-97.59,97.59"/>
	<path fill="#0EDA7C" d="M185.241,43.193l-102.65,102.65"/>
	<path fill="none" stroke="#F5F5F5" stroke-width="30" stroke-linecap="round" stroke-linejoin="round" stroke-opacity="0.7" d="
		M185.241,43.193l-102.65,102.65"/>
	<path fill="#0EDA7C" d="M194.639,106.084L91.265,209.458"/>
	<path fill="none" stroke="#F5F5F5" stroke-width="30" stroke-linecap="round" stroke-linejoin="round" stroke-opacity="0.7" d="
		M194.639,106.084L91.265,209.458"/>
	<path fill="none" stroke="#616161" stroke-width="2" stroke-linecap="round" stroke-linejoin="round" d="M103.066,88.613V77.785
		h45.636v49.502h-9.282"/>
	<path fill="none" stroke="#616161" stroke-width="2" stroke-linecap="round" stroke-linejoin="round" d="M56.102,141.982H45.83
		c-2.136,0.001-3.868-1.729-3.868-3.865v-0.001V47.619c0-2.136,1.73-3.868,3.866-3.868c0,0,0.001,0,0.002,0h113.699
		c2.137,0,3.867,1.732,3.867,3.868v90.497c0,2.136-1.73,3.866-3.867,3.866H139.42 M123.95,25.961
		c0.001,3.844-3.114,6.961-6.958,6.962c-0.001,0-0.002,0-0.004,0c-3.844,0.001-6.96-3.115-6.961-6.959c0-0.001,0-0.002,0-0.003
		c0-3.844,3.115-6.96,6.959-6.961c0.002,0,0.002,0,0.002,0c3.845,0,6.961,3.115,6.962,6.959
		C123.95,25.959,123.95,25.96,123.95,25.961z M144.061,22.867c0.03,1.708-1.33,3.118-3.038,3.149s-3.118-1.329-3.149-3.038
		c0-0.037,0-0.074,0-0.111c0-1.709,1.385-3.094,3.094-3.094S144.061,21.158,144.061,22.867L144.061,22.867z M175,172.923
		c0,2.136-1.731,3.868-3.867,3.868c-2.137,0-3.867-1.732-3.867-3.868s1.73-3.867,3.867-3.867
		C173.269,169.056,175,170.787,175,172.923z M150.061,161.121l6.563-6.563 M156.624,161.121l-6.562-6.563 M163.398,65.409H55.884
		 M154.116,55.354H84.503"/>
	<path fill="none" d="M58.204,56.9c0,1.709-1.384,3.095-3.093,3.095c-1.709,0.001-3.095-1.384-3.095-3.093c0-0.001,0-0.001,0-0.002
		c0-1.708,1.386-3.093,3.095-3.093C56.819,53.808,58.203,55.192,58.204,56.9 M68.26,56.9c0.001,1.709-1.384,3.095-3.093,3.095
		c-1.708,0.001-3.094-1.384-3.095-3.093c0-0.001,0-0.001,0-0.002c0.001-1.708,1.387-3.093,3.095-3.093
		C66.875,53.808,68.259,55.192,68.26,56.9 M78.315,56.9c0,1.709-1.385,3.094-3.094,3.094c-1.709,0-3.094-1.385-3.094-3.094
		c0-1.708,1.385-3.094,3.094-3.094C76.93,53.806,78.315,55.191,78.315,56.9"/>
	<path fill="none" stroke="#616161" stroke-width="2" stroke-linecap="round" stroke-linejoin="round" d="M56.657,55.354
		c0,1.708-1.384,3.095-3.093,3.095c-1.709,0-3.095-1.384-3.095-3.093c0-0.001,0-0.001,0-0.002c0-1.709,1.386-3.093,3.095-3.093
		C55.272,52.262,56.656,53.646,56.657,55.354z M66.713,55.354c0.001,1.708-1.384,3.095-3.093,3.095
		c-1.708,0-3.094-1.384-3.095-3.093c0-0.001,0-0.001,0-0.002c0.001-1.709,1.387-3.093,3.095-3.093
		C65.328,52.262,66.712,53.646,66.713,55.354z M76.768,55.354c0,1.708-1.385,3.094-3.094,3.094c-1.708,0-3.094-1.386-3.094-3.094
		c0-1.709,1.385-3.094,3.094-3.094C75.383,52.26,76.768,53.645,76.768,55.354z"/>
	<path fill="#66818D" d="M139.42,113.032V159c0,0-1.052,9.8-13.15,20.884c-9.281,8.509-23.204,12.376-23.204,12.376
		s-13.056-3.628-22.315-11.587l-0.007-0.008c-7.843-9.05-8.617-16.25-8.617-16.25V112.59c0,0,22.431,3.868,36.354-10.828
		C118.141,111.964,131.9,113.217,139.42,113.032"/>
	<path fill="none" stroke="#616161" stroke-width="2" stroke-linecap="round" stroke-linejoin="round" d="M70.385,168.405
		c1.957,3.346,4.94,7.323,9.477,11.479c0.294,0.263,0.588,0.526,0.882,0.781l0.007,0.008c9.259,7.959,22.315,11.586,22.315,11.586
		s13.923-3.866,23.206-12.375C138.368,168.8,139.42,159,139.42,159v-45.968 M139.42,113.032v-5.855c0,0-22.432,3.867-36.354-10.83
		c-13.922,14.697-36.353,10.83-36.353,10.83V159 M79.088,77.785H53.564 M93.785,88.613H53.564 M66.713,124.193h-13.15
		 M66.713,114.912h-13.15 M66.713,159H35 M69.807,168.282h-17.79 M78.315,178.337H67.486"/>
	<path fill="none" stroke="#B8CCD3" stroke-width="2" stroke-linecap="round" stroke-linejoin="round" d="M86.436,166.348h32.487
		v-24.75H86.436V166.348z M91.464,133.861c0-6.193,5.022-11.215,11.216-11.215c6.194,0,11.214,5.021,11.214,11.215 M113.895,134.249
		v6.96"/>
	<path fill="none" stroke="#B8CCD3" stroke-width="2" stroke-linecap="round" stroke-linejoin="round" d="M106.934,156.68
		c0,2.137-1.731,3.867-3.867,3.867c-2.136,0-3.867-1.73-3.867-3.867l0,0c0-2.136,1.731-3.867,3.867-3.867
		C105.203,152.813,106.934,154.544,106.934,156.68z M103.066,146.624v6.188"/>
</g>
</svg>
