
<svg xmlns="http://www.w3.org/2000/svg" version="1.1" xmlns:xlink="http://www.w3.org/1999/xlink" preserveAspectRatio="none" x="0px" y="0px" width="128px" height="128px" viewBox="0 0 128 128">
<defs>
<g id="Layer0_0_MEMBER_0_FILL">
<path fill="#0066CB" stroke="none" d="
M -65.25 19.75
L -67.75 31.1 -5.35 31.1
Q 5.1 31.1 9.7 25.2 12.25 21.85 14.35 14.35
L 16.85 3 -45.55 3
Q -61.9 3 -65.25 19.75
M 30.65 -22.5
Q 49.9 -22.5 58.3 -15.4 65.85 -9.1 65.4 3.85 65.4 15.6 59.95 30.65 55.8 42.4 48.25 48.25 36.95 57.05 15.15 56.6
L -38 56.6 -43.05 85.1 17.7 85.1
Q 42.8 85.1 57.9 78 88.45 64.15 97.25 19.35 103.5 -14.15 92.2 -30.9 79.25 -50.6 41.55 -50.6
L -19.15 -50.6 -24.2 -22.5 30.65 -22.5 Z"/>
</g>
</defs>

<g transform="matrix( 0.663360595703125, 0, 0, 0.6632232666015625, 53.5,52.55) ">
<use xlink:href="#Layer0_0_MEMBER_0_FILL"/>
</g>
</svg>
