298933 880435
481 815581
408095 198
344 553
21 16
751169 592801
52 372255
625460 438
874 576
59 58
797753 354810
222 907233
546577 354
77 467
16 43
208539 287299
311 381308
322323 726
587 72
20 57
719317 571158
318 909227
915028 53
153 712
36 94
588476 54592
338 807788
978882 960
515 886
59 99
836203 425449
95 731503
462389 639
422 397
48 61
729305 760049
646 890832
895401 340
44 899
19 90
836134 376582
948 702948
378802 803
352 215
99 3
537991 267707
624 72155
84040 910
751 977
50 26
597524 481845
195 567939
520893 112
351 782
12 3
380059 899737
735 312222
666801 74
811 654
100 79
479777 364107
659 67840
28192 726
486 335
25 41
826451 264968
249 540657
363492 141
725 106
78 20
346728 101761
569 209750
543957 64
290 227
49 15
865962 372984
42 153311
74922 859
199 169
2 65
379014 253409
711 93409
623836 807
702 568
59 6
134386 151676
615 461483
454030 462
856 342
77 24
493943 676699
175 523993
971252 741
850 697
74 13
885765 741610
958 288361
506372 500
367 641
69 94
475890 127627
667 651449
669627 225
657 469
63 23
155682 816392
15 291714
361469 427
789 516
77 79
124794 554490
614 606259
730407 775
543 104
9 18
889003 325198
561 945800
240366 959
421 343
2 69
67235 815203
621 848741
223246 215
425 669
88 44
226996 267050
200 124874
52299 636
429 833
63 97
847667 94098
730 350066
562812 442
683 901
30 12
149326 378408
300 682693
640379 197
881 174
34 89
908767 493149
172 161907
217265 597
926 106
90 19
98546 146571
620 921588
953086 936
246 24
66 55
765698 778801
479 898517
71507 557
427 618
76 30
952156 789611
556 363971
711530 257
419 94
18 94
298453 22553
451 827612
665929 443
553 338
19 17
591619 36075
807 793775
708524 101
770 138
3 57
241521 177556
336 734963
844001 734
449 598
34 51
739837 259727
399 676713
994377 438
421 812
46 59
671044 503711
315 682243
274814 94
318 559
4 39
417173 63105
334 674830
386358 149
916 590
99 16
589455 723948
959 974531
218128 731
926 207
73 28
550266 930597
936 967972
964401 272
283 509
21 11
159341 446129
824 653031
12069 739
268 835
23 22
873716 997847
509 965908
976474 315
605 92
6 65
895764 146007
654 245154
523184 892
294 425
99 48
906949 282156
375 237318
895402 424
639 726
80 16
953576 841849
357 467459
972976 641
1000 743
17 31
573002 589474
616 331092
573155 906
472 85
47 61
7434 943586
242 349046
527524 325
40 16
46 40
636840 594445
203 245155
876323 122
25 58
61 76
384813 665743
843 107183
672014 731
730 754
72 90
51992 255303
487 489185
582957 816
677 153
32 15
