298933 880435 525
481 815581 509
408095 198 443
344 553 142
21 16 21
751169 592801 509
52 372255 443
625460 438 470
874 576 179
59 58 33
797753 354810 509
222 907233 525
546577 354 470
77 467 144
16 43 112
208539 287299 443
311 381308 443
322323 726 443
587 72 144
20 57 113
719317 571158 509
318 909227 525
915028 53 525
153 712 171
36 94 116
588476 54592 470
338 807788 509
978882 960 525
515 886 179
59 99 119
836203 425449 509
95 731503 509
462389 639 449
422 397 134
48 61 113
729305 760049 424
646 890832 525
895401 340 525
44 899 179
19 90 116
836134 376582 509
948 702948 509
378802 803 443
352 215 144
99 3 119
537991 267707 470
624 72155 340
84040 910 351
751 977 179
50 26 112
597524 481845 470
195 567939 470
520893 112 470
351 782 171
12 3 20
380059 899737 525
735 312222 443
666801 74 509
811 654 171
100 79 119
479777 364107 449
659 67840 340
28192 726 308
486 335 134
25 41 112
826451 264968 509
249 540657 470
363492 141 443
725 106 171
78 20 116
346728 101761 443
569 209750 383
543957 64 470
290 227 128
49 15 112
865962 372984 525
42 153311 375
74922 859 340
199 169 125
2 65 113
379014 253409 441
711 93409 351
623836 807 470
702 568 145
59 6 113
134386 151676 375
615 461483 449
454030 462 449
856 342 171
77 24 116
493943 676699 509
175 523993 470
971252 741 525
850 697 171
74 13 116
885765 741610 525
958 288361 443
506372 500 449
367 641 142
69 94 116
475890 127627 449
667 651449 509
669627 225 509
657 469 145
63 23 113
155682 816392 509
15 291714 443
361469 427 443
789 516 171
77 79 36
124794 554490 470
614 606259 470
730407 775 509
543 104 144
9 18 21
889003 325198 525
561 945800 525
240366 959 443
421 343 134
2 69 113
67235 815203 509
621 848741 525
223246 215 386
425 669 145
88 44 116
226996 267050 443
200 124874 354
52299 636 324
429 833 171
63 97 119
847667 94098 525
730 350066 443
562812 442 470
683 901 179
30 12 112
149326 378408 443
300 682693 509
640379 197 509
881 174 179
34 89 116
908767 493149 525
172 161907 383
217265 597 386
926 106 179
90 19 116
98546 146571 375
620 921588 525
953086 936 525
246 24 128
66 55 113
765698 778801 468
479 898517 525
71507 557 340
427 618 142
76 30 116
952156 789611 525
556 363971 443
711530 257 509
419 94 144
18 94 116
298453 22553 443
451 827612 509
665929 443 509
553 338 142
19 17 21
591619 36075 470
807 793775 509
708524 101 509
770 138 171
3 57 113
241521 177556 443
336 734963 509
844001 734 525
449 598 142
34 51 110
739837 259727 509
399 676713 509
994377 438 525
421 812 171
46 59 113
671044 503711 509
315 682243 509
274814 94 443
318 559 144
4 39 112
417173 63105 449
334 674830 509
386358 149 443
916 590 179
99 16 119
589455 723948 509
959 974531 525
218128 731 386
926 207 179
73 28 116
550266 930597 525
936 967972 525
964401 272 525
283 509 144
21 11 21
159341 446129 449
824 653031 509
12069 739 268
268 835 171
23 22 16
873716 997847 507
509 965908 525
976474 315 525
605 92 144
6 65 113
895764 146007 525
654 245154 443
523184 892 470
294 425 144
99 48 119
906949 282156 525
375 237318 443
895402 424 525
639 726 171
80 16 116
953576 841849 507
357 467459 449
972976 641 525
1000 743 179
17 31 112
573002 589474 434
616 331092 443
573155 906 470
472 85 144
47 61 113
7434 943586 525
242 349046 443
527524 325 470
40 16 112
46 40 110
636840 594445 509
203 245155 443
876323 122 525
25 58 113
61 76 116
384813 665743 509
843 107183 354
672014 731 509
730 754 140
72 90 116
51992 255303 443
487 489185 449
582957 816 470
677 153 145
32 15 112
