1 10
100 200
201 210
900 1000
9 14
1 9
200 100
23 23
751 1501
751 2250
3001 3752
3002 3752
3750 3751
522751 180717
892524 136433
928972 448978
279526 611794
706438 103269
1 999999
999752 999999
274704 585591
618146 560828
432397 130168
578711 692336
723986 95912
340744 34983
659113 903897
699662 606272
873867 491513
302276 280811
19086 301566
879177 944086
1642 806877
973260 572628
77836 949643
574945 472670
787556 374554
381971 710710
362048 980817
166668 470835
600166 53188
401876 420665
304465 332197
574780 977679
890191 653661
340861 74287
537158 810251
101446 767862
66872 974008
145768 551933
389391 322534
561938 613230
8100 843014
945804 544558
882823 107851
195827 869111
431285 34869
353079 912939
950501 65077
357499 376699
392931 489494
330789 158129
162769 654589
376702 657064
984632 973312
752584 836976
988831 393924
879529 203936
599003 240513
778593 398381
105864 441914
248596 344674
292879 971701
772748 919380
468775 526138
471912 583226
436295 988246
482968 700075
297712 433846
2432 739514
541098 949614
420696 890899
575796 653952
86797 556893
259198 623261
683299 121721
284161 126
361705 594622
814124 262222
937217 959997
35086 203544
224012 433520
319111 448162
895781 835587
236642 487193
223409 758368
519494 962627
38128 384757
518984 326937
856381 916860
435862 489260
793922 773593
866063 642407
490285 853046
464576 997152
309499 216535
414570 851089
854721 199770
710825 263310
274704 805574
742458 470965
914763 208110
781661 200214
108012 972864
294587 650342
96892 405941
543772 666695
605525 162219
205607 630027
97544 124188
358013 691809
613508 866729
481954 646984
67040 663865
328166 88532
814963 814181
203726 67579
313269 390647
719535 58432
809963 53796
529499 996837
490091 100276
945340 628797
650550 390265
658730 817341
842455 14072
777477 607416
799689 608620
8185 12500
45269 14743
237921 271469
85692 60100
458227 903882
142618 141095
614085 455709
795784 206004
151122 399855
801976 518411
925212 191942
300407 505159
801292 386903
645822 391191
878749 440019
570591 384078
131054 228702
702454 881959
377325 508108
2048 574880
866430 176362
158283 369834
716529 296099
825623 946739
677209 235828
715785 310796
155580 683211
495813 631603
571290 300710
863481 280095
539442 537030
450444 774633
874763 378704
344421 102857
405778 50537
207498 78742
896033 344145
255766 246558
207934 838897
460327 146311
531007 925060
553640 316369
663095 552339
35889 524240
946846 799858
915059 925950
270509 138312
344009 232857
842434 371423
752163 260191
787155 726866
576302 545013
278804 646587
546333 622604
589966 302169
867656 891247
905538 688050
712018 412995
120781 423489
281786 45456
345988 231942
366970 396970
737654 20569
259614 950972
495906 72095
993446 707112
540890 182197
301137 784791
118992 628576
944653 752067
24147 641640
322327 840760
233370 482309
802408 242498
723228 78273
336820 817987
270847 472718
769480 275914
834610 875426
154696 130651
649345 200371
857542 507101
728570 128673
482867 210913
888244 627987
61147 244872
167880 741966
927090 311524
670721 406118
760249 467324
734527 12466
994052 433695
436169 145925
730354 957613
665736 271157
272314 856881
102319 247653
410694 831675
820906 740705
54730 858491
55791 514120
855096 263545
999175 318694
126997 546911
798932 829141
277516 10083
919226 411952
491762 836291
995104 417346
988869 325398
533297 133608
857437 863854
181026 749431
346125 242593
348062 124900
560802 913476
356273 562463
732831 705759
470576 459195
575737 897763
460392 129072
953 46467
774859 680762
50555 88620
594355 412835
462871 365815
104373 804411
217972 339865
751914 550074
562785 158775
777052 622884
50902 417304
