289668 176302 443
289165 109539 443
32420 96724 351
713059 645068 504
665620 168178 509
712234 797298 468
42157 882075 525
153399 915374 525
463217 497634 426
567189 278034 470
122057 115837 336
23171 422819 449
475545 369037 449
819725 834613 450
444236 492886 444
554489 611031 434
872050 993673 507
857115 613828 525
552622 49632 470
959278 448109 525
115056 843126 525
647119 45224 509
584715 654623 509
781862 847808 525
852637 642101 525
249380 235549 368
601530 273612 470
6695 277935 443
812264 889325 525
823588 565485 509
561226 91951 470
575335 202933 470
265911 601382 470
518107 41192 470
394624 255384 441
137321 227439 386
60741 110625 354
645217 813813 504
980011 511244 525
453862 185314 449
59286 771663 509
386596 315908 441
154693 508842 449
306924 678205 509
846969 98216 525
140899 674880 509
487746 132125 449
75046 268357 443
630686 719007 504
855646 243905 525
946077 988539 458
596641 770853 509
463056 700575 509
317261 861708 525
879902 590830 525
147601 24382 375
251414 359658 441
114524 237087 443
914629 375740 525
341778 883844 525
581749 105716 470
995474 884039 507
42872 304534 443
546583 255301 470
18208 306128 443
744732 4240 509
494269 481384 426
665501 662599 442
425766 6221 449
203126 833375 509
461799 556743 470
914883 206049 525
116138 740775 509
483709 755817 509
341457 266815 407
361201 647065 509
69768 239719 443
269489 966643 525
745600 536037 509
801815 990940 525
42215 452926 449
309033 301209 371
811739 258410 509
673358 317748 509
286463 46930 443
658363 961971 525
548895 47871 470
830193 495065 509
998629 26275 525
388636 941581 525
347846 743684 509
225309 823054 509
257935 599089 470
887563 837255 525
91215 288225 443
80919 286072 443
221501 65274 386
55196 698294 509
53403 549705 470
257092 225344 443
637906 22582 509
569576 6878 470
982406 978792 427
928313 820736 525
181229 858768 525
936492 875588 476
940515 940359 277
435055 114646 449
729509 454232 509
118525 440431 449
453359 666944 509
662757 982444 525
262801 270638 407
785707 896612 525
945031 656693 525
927529 805097 525
111182 59879 354
280354 408493 441
56210 615776 470
455273 582095 470
281415 866255 525
479574 123357 449
830689 771050 468
463145 840712 525
495841 128506 449
396908 492322 449
329053 549925 470
998213 42888 525
391087 527663 470
393189 493088 449
341678 435515 449
407725 517733 470
366436 633354 509
988426 639010 525
202812 716665 509
800124 688392 504
737910 721640 424
351342 389390 436
887126 245821 525
539072 910185 525
812185 843746 525
573304 792706 509
233883 631060 509
136914 771256 509
735209 888706 525
899911 699092 525
30979 376506 443
295259 919141 525
747914 165923 509
244004 243446 337
55443 607126 470
468557 982275 525
34498 318008 443
222492 797035 509
872618 103984 525
675459 869150 525
755376 738367 424
671967 110726 509
890773 839582 445
401863 785940 509
393352 782245 509
409363 582911 470
579881 26852 470
881622 92088 525
425362 467349 444
631568 792538 504
431138 56738 449
690162 623964 509
529243 952697 525
484668 197300 449
423261 165156 449
639971 853092 525
547056 536055 452
176573 850286 525
90230 667897 509
646166 546601 509
948390 26176 525
263380 487203 449
681398 873083 525
292379 391677 441
329697 814206 509
180249 763586 509
756820 660099 504
138853 251592 443
942980 177757 525
510543 770062 509
657957 357432 509
395401 977303 525
798851 256672 509
657154 326860 509
495005 846853 525
393969 65769 443
779731 441802 509
202680 737959 509
906211 954663 507
482672 109770 449
947274 770434 525
302564 286492 389
212766 466646 449
787939 317652 509
423640 594082 470
399108 642568 509
431373 272023 449
261708 980528 525
505056 695152 509
798424 587236 509
951895 632453 525
922940 26915 525
324696 401464 441
643019 939064 525
933570 345246 525
221310 171093 386
734345 705060 411
868808 157422 525
472535 160016 449
325442 281648 389
681789 356881 509
455506 946828 525
776736 851820 525
469560 32072 449
559335 743590 509
326225 348039 441
191115 130053 383
25193 91998 351
845874 213986 525
902620 57277 525
486330 769508 509
380688 656359 509
289661 148256 443
891914 419072 525
15196 563556 470
632404 220954 509
365344 210705 443
899136 190768 525
97254 847830 525
820894 223097 509
500438 950217 525
221397 595402 470
