1 10 20
100 200 125
201 210 89
900 1000 174
1 1 1
1 2 2
1 3 8
3 4 8
1 999999 525
2 1 2
1 100 119
1000 1 179
999999 999999 259
300000 500000 449
400 10 144
15298 219213 386
128437 31468 354
14124 124345 354
524288 524288 20
999999 999999 259
888888 888888 119
800000 200000 509
545454 787878 509
1 456789 449
837799 837799 525
783365 482378 509
232635 26372 443
844783 61348 525
945071 270789 525
174253 584783 470
963258 82777 525
275873 998490 525
775569 932556 525
607070 697547 509
101093 879514 525
885421 29623 525
39248 457646 449
251469 626667 509
2156 251314 443
9935 263276 443
686167 609844 509
800518 305019 509
900756 917855 476
987387 101324 525
609738 470883 470
206843 3115 383
790344 150426 509
846747 459195 525
412198 446935 418
597129 32239 470
390533 10618 443
75897 483775 449
817754 271831 509
721087 719548 411
988314 470998 525
940680 833068 525
75943 300383 443
82058 450288 449
292096 723865 509
714106 183346 509
731882 911964 525
381459 548917 470
582354 102241 470
481278 945806 525
337670 81948 443
580211 620418 447
785038 262954 509
20670 458611 449
429453 995093 525
580114 999341 525
53981 875355 525
321279 834774 509
954925 176466 525
847888 746076 525
985499 252942 525
121084 750683 509
218373 460386 449
304552 336001 384
63252 720202 509
439303 990835 525
22205 764452 509
57578 327020 443
948693 177180 525
959994 417621 525
183909 820117 509
638486 432707 509
736426 72703 509
775970 56729 509
25803 58562 340
658721 88835 509
158139 549792 470
956421 29902 525
255478 331913 407
656803 651929 429
852034 732104 525
733864 170904 509
766407 359008 509
105057 462516 449
946248 605684 525
629937 487476 509
488302 386452 449
555162 61595 470
936888 882209 476
107476 501016 449
569181 79469 470
836735 28269 509
215227 545854 470
5470 265656 443
166952 501826 449
245222 509036 449
873302 766002 525
209480 391452 443
459596 972856 525
109797 269626 443
660576 846232 525
59913 912125 525
212464 241702 443
196933 970928 525
43371 650986 509
337935 251843 407
390843 738477 509
647144 131224 509
597022 283698 470
597381 382934 470
403651 859383 525
673693 253579 509
413651 740646 509
892883 840796 445
584028 263864 470
187486 779389 509
854455 635259 525
691783 485957 509
89891 229491 386
609305 778315 509
371721 554225 470
416432 341942 449
346350 265844 441
987370 174909 525
808167 399097 509
600543 551340 434
569510 12639 470
964970 847051 507
178404 96616 383
868401 344033 525
31581 487617 449
451046 470743 444
245650 415514 449
605658 454562 470
190919 193285 347
395083 985038 525
457248 710690 509
230885 673236 509
282908 556570 470
654904 778977 504
958583 755151 525
696138 372678 509
582991 649815 509
773925 999428 525
324453 477312 449
747936 471201 509
987507 264914 525
468212 862339 525
771170 407727 509
748048 807821 468
474819 327332 449
165736 591450 470
486178 989955 525
556175 691293 509
963517 265815 525
376678 472115 449
608927 308087 470
722677 540412 509
726507 414146 509
96952 495104 449
819695 10353 509
240031 741145 509
395106 411300 449
231795 715713 509
709017 408766 509
70512 209979 383
156305 276873 443
392938 18999 443
121722 524412 470
605551 820066 509
431727 761350 509
286278 368676 441
477833 681099 509
663290 544247 509
413633 187021 449
836985 238896 509
867211 356104 525
975434 999857 440
685070 819013 504
82293 349656 443
490963 123509 449
457612 43770 449
542932 467253 470
788652 788403 300
996075 509069 525
761400 846582 525
653468 615662 509
103959 751830 509
721138 54114 509
132411 839236 525
311494 216730 443
904223 740540 525
227686 440048 449
743023 724111 424
369666 6232 443
299069 374227 441
44096 362306 443
690317 925891 525
514152 905042 525
843179 599321 525
892077 380909 525
172471 131540 383
433809 965040 525
134682 686748 509
788059 527615 509
65331 640981 509
240113 819244 509
527765 453117 470
310427 906846 525
93510 303316 443
404375 780906 509
412717 33920 449
320443 392513 441
589622 772905 509
849009 459208 525
562610 536581 452
707940 828667 468
369821 139667 443
426151 493547 444
614354 654042 509
543542 176119 470
626585 634668 385
271796 302411 389
563751 110624 470
703485 950292 525
262772 76629 443
9434 884432 525
58893 427389 449
355027 718319 509
354874 751078 509
955183 242608 525
840425 602465 525
23910 817780 509
858900 500049 525
999123 997538 440
159128 938358 525
738953 213241 509
525437 986291 525
324377 147187 443
675872 856205 525
539334 80398 470
574757 824786 509
365557 818196 509
899993 456758 525
959752 582468 525
759866 776105 468
2947 38020 324
380197 895038 525
626625 807157 504
897036 483684 525
845627 718473 525
780789 335183 509
106356 403128 443
435621 237069 449
59596 148490 375
277545 806164 509
950943 776492 525
163020 436948 449
407842 524828 470
5281 544378 470
854036 724460 525
33648 829487 509
591567 924945 525
258256 977072 525
510196 841806 525
583844 222242 470
254262 48280 443
668114 645175 442
765450 455224 509
702949 31936 509
565292 897093 525
34311 151780 375
964684 303994 525
900826 337707 525
570494 605005 434
227694 171172 386
984984 344654 525
643482 952066 525
214151 898092 525
280596 769178 509
419753 10748 449
898373 847871 445
988024 146155 525
430145 319464 449
972314 660185 525
