379645 795600 509
213914 418377 449
561555 433279 470
846923 67379 525
909370 607812 525
892462 30015 525
996500 608836 525
363931 419346 449
172247 803213 509
152208 87346 375
664863 887288 525
783920 937704 525
796059 300158 509
953064 788751 525
752722 500551 509
528315 398993 470
362183 967189 525
676172 44366 509
850699 363426 525
194816 844648 525
786270 412672 509
476585 242119 449
401916 733612 509
628203 120908 509
397149 716677 509
751703 696347 504
115329 47152 354
648430 677444 442
190239 572220 470
790935 219164 509
267999 198275 443
423239 220755 449
716103 276492 509
105136 246069 443
821609 351759 509
804047 312227 509
714133 232677 509
496561 958315 525
1198 517641 470
503501 978879 525
91912 700827 509
283101 282477 314
174601 915318 525
644041 403431 509
844564 739993 525
105554 495901 449
525103 351607 470
89910 432384 449
145383 186636 383
115141 764913 509
404475 67607 443
439401 733439 509
89679 588570 470
719017 480557 509
960643 882284 507
848586 10819 525
753588 783829 468
745885 547300 509
426835 428756 374
633868 295467 509
998175 682308 525
935783 912071 476
273046 217298 443
415127 623619 470
824712 542657 509
25012 36327 324
414773 773203 509
380221 111523 443
964268 946806 414
74669 913249 525
800933 343254 509
445489 826126 509
649171 967672 525
237334 953880 525
584177 401303 470
308019 331006 384
914157 583949 525
232895 650397 509
366443 142727 443
713067 367357 509
311020 349647 441
549315 51005 470
131798 566548 470
197124 983657 525
745034 914178 525
158379 61968 383
188330 772326 509
315171 351754 441
659525 480067 509
456256 127270 449
755830 505941 509
847576 762909 525
313614 334213 384
700961 19909 509
773394 763734 468
244110 589417 470
75299 483290 449
223778 221889 337
219420 513027 470
591932 417311 470
531686 27565 470
813933 278410 509
51139 771795 509
551198 626123 447
691455 233160 509
436355 259865 449
618101 856057 525
291219 367228 441
303654 320584 384
659222 73434 509
689666 69043 509
906890 79989 525
890314 682004 525
4284 707420 509
499541 88935 449
763567 92049 509
483401 346144 449
534327 44909 470
101113 325204 443
536424 111898 470
813800 867271 525
262311 305973 407
973101 330637 525
717171 178582 509
669655 271900 509
766254 951086 525
823338 757522 468
725656 350601 509
280198 909338 525
7862 556307 470
102044 986131 525
642589 931159 525
64977 35343 340
256785 153354 443
301454 935477 525
381434 651088 509
965661 766184 525
727185 946185 525
478648 962389 525
858038 160280 525
464884 26755 449
127519 834012 509
725535 443897 509
332253 933752 525
80979 406162 443
691622 606214 509
413150 721132 509
435331 621889 470
947819 471508 525
958492 375336 525
665978 818019 504
239711 477348 449
308100 540203 470
929179 565098 525
121600 496522 449
839121 491565 525
843357 177729 525
887530 220505 525
775737 898153 525
926361 220609 525
509238 195917 449
379814 651956 509
331774 485230 449
850595 87895 525
432046 703488 509
847524 651105 525
781785 42618 509
519608 147508 470
836558 119103 509
199171 539645 470
831221 380717 509
345986 153064 443
899159 826996 525
226156 318740 443
270986 977473 525
149186 603188 470
819732 853382 525
215734 246444 443
652409 228494 509
796741 282329 509
913846 785324 525
610713 380010 470
754675 663823 504
426677 820443 509
57906 220201 386
150008 406645 443
68131 779342 509
609674 91687 470
625510 390250 470
28361 459629 449
311819 639537 509
23059 835830 509
988533 725314 525
247008 88294 443
156865 251632 443
987032 70461 525
775496 976445 525
270637 392371 441
710536 923558 525
538703 164680 470
162924 107655 383
999693 68558 525
470462 342254 449
386643 178832 443
62440 860525 525
844789 707571 525
941504 332660 525
475624 406120 449
680842 348864 509
609413 34337 470
37387 247906 443
686228 451318 509
491407 866892 525
898338 983338 507
875389 115045 525
611140 656620 509
533613 328980 470
768481 34 509
582867 373830 470
654295 801819 504
953452 919711 507
126779 264593 443
988614 520297 525
780464 169237 509
996360 633127 525
485780 394741 449
719090 28362 509
738651 86851 509
965333 972466 458
69103 123828 354
4203 312567 443
92607 550682 470
135471 333378 443
247432 360588 441
581989 834001 509
72560 271824 443
401912 340827 441
84931 564323 470
491766 19151 449
822568 675040 504
698469 814098 504
857674 676826 525
622472 232712 470
232048 574377 470
182998 434830 449
942677 599442 525
480524 672514 509
512676 210450 470
80996 356661 443
602234 407028 470
476446 835628 509
808990 329433 509
356072 726056 509
857440 882820 432
741539 664445 504
241363 745153 509
357560 853687 525
679753 239458 509
266599 394079 441
125106 539942 470
422933 538349 470
659671 298673 509
246731 972492 525
851736 564665 525
212793 866072 525
695003 913603 525
858817 926253 476
700249 24276 509
41740 76391 340
455262 358520 449
116111 178069 383
19582 893542 525
285505 953182 525
983902 376635 525
166884 657774 509
269015 983921 525
236198 632096 509
694174 393209 509
531319 974471 525
173363 276814 443
