5456 9224 262
5954 80698 351
1717 311 182
299 70015 340
3174 2516 217
3368 98396 351
6654 92084 351
7596 37471 324
6365 20742 279
9294 81051 351
476 1550 182
4908 92128 351
7732 45970 324
1851 30733 308
496 53916 340
8168 83062 351
6906 14022 276
8373 11993 268
8323 22350 279
8151 97747 351
7339 10720 260
4866 11336 268
2337 76695 340
2171 24250 282
8546 74861 340
6134 73566 340
1354 15793 276
7535 31183 308
8618 22293 279
4200 17443 276
8387 96133 351
4458 45622 324
6504 31688 308
5840 93507 351
9866 54047 340
5504 56690 340
142 53160 340
8459 71736 340
6883 29090 308
3931 21759 279
9113 16145 276
5680 48640 324
5848 89246 351
2927 95478 351
8524 11973 268
6860 11084 268
5130 73942 340
2615 31920 308
8875 63772 340
7653 97572 351
7833 83739 351
6331 61937 340
6165 93580 351
1445 85887 351
3769 24180 282
181 33040 308
8764 36686 324
3380 76987 340
9100 4242 262
7182 75701 340
9674 77317 351
3286 76815 340
2718 39035 324
4848 54631 340
4220 74393 340
2258 28797 308
726 36838 324
7736 20733 279
6239 97806 351
3451 25535 282
1571 66227 340
5851 24914 282
2460 54689 340
1541 81056 351
1768 46217 324
4797 6979 262
5163 20860 279
37 51150 324
2736 52151 324
3343 78271 351
1401 179 182
8107 10512 260
9508 18193 279
6484 19226 279
7734 67151 340
8395 42322 324
7975 70659 340
3052 89649 351
3953 18715 279
8100 36316 324
9141 48648 324
8620 12376 268
477 88812 351
2540 27088 308
1169 89137 351
849 88492 351
6246 70697 340
1060 89285 351
46 37084 324
5553 64710 340
2756 27396 308
7912 17255 276
8674 67406 340
9525 90816 351
6637 69969 340
8792 58148 340
5398 34729 311
4284 32696 308
418 29011 308
3415 93677 351
9290 51247 324
5996 54772 340
3544 64618 340
6328 92005 351
8407 39396 324
2485 6779 262
3067 30808 308
5758 86041 351
7893 27482 308
3132 61838 340
7699 30301 308
5919 70981 340
3543 30543 308
8407 68036 340
6177 44317 324
5051 68580 340
7080 89101 351
6371 54317 340
6181 23516 279
8473 18654 279
5931 80155 351
5040 11886 268
4806 15484 276
6333 46697 324
9248 82009 351
7155 38342 324
6307 37887 324
7787 37959 324
9740 65126 340
7824 7441 221
656 91899 351
6816 84099 351
1099 10316 262
822 36140 324
1624 87661 351
8291 76767 340
5119 56990 340
6407 12059 268
9512 19449 279
376 61792 340
1333 3605 217
2681 4194 238
6991 90676 351
4899 76134 340
3594 21038 279
7598 77119 351
7024 36364 324
6610 17740 279
2847 33132 308
9633 84930 351
5421 53368 340
8098 52914 340
6026 99789 351
5445 81529 351
7303 90188 351
4226 8531 262
1303 36659 324
1918 65393 340
6926 99279 351
4509 79687 351
5578 50816 324
2334 90298 351
9315 38666 324
5310 91778 351
894 11627 268
4353 17443 276
6529 16154 276
5802 27162 308
5386 9673 262
6395 42789 324
6904 62683 340
3940 85840 351
3569 18899 279
6473 41214 324
638 94853 351
4131 50159 324
7960 16542 276
7722 71406 340
5249 96948 351
6066 35691 324
7003 11951 268
430 78211 351
9435 78764 351
5511 60303 340
4269 23340 279
2109 65551 340
2057 18858 279
8396 80061 351
6803 73912 340
311 73243 340
7000 97760 351
8828 92938 351
9111 16598 276
6466 65512 340
5062 56820 340
7684 14355 276
6738 73900 340
1402 5898 238
2787 45502 324
322 60704 340
7363 78673 351
2711 710 209
4215 47779 324
2367 59828 340
1778 54649 340
3709 92734 351
5776 79167 351
1407 17953 279
5266 62696 340
6088 45950 324
6620 74404 340
6595 69081 340
3992 82233 351
4776 88190 351
1351 42757 324
3962 18746 279
5840 52191 324
3565 12635 268
2465 24453 282
2505 34793 311
83 46199 324
8976 17189 276
7694 40778 324
216 86002 351
6465 39060 324
7249 38280 324
2776 81358 351
3743 78792 351
7637 82216 351
4659 16069 276
9285 61403 340
6497 15890 276
4700 8487 262
9323 98363 351
9874 12715 268
4158 854 238
2036 18949 279
1711 71397 340
3592 93513 351
6411 37565 324
