971662 983426
397652 489785
543299 215750
941496 961538
168358 174431
55796 978304
96471 614634
106678 622266
858761 20126
682803 192424
197603 779403
247422 335778
546966 990759
493815 274721
383310 694719
622478 901621
227192 426235
520683 419665
849693 571716
867305 435905
398057 983575
822141 626502
512375 886072
81210 524120
893297 484671
891436 244744
904594 568970
870642 243501
452290 851277
414752 488597
642447 736876
365220 842724
203650 143405
705135 826581
541405 583005
317766 285163
95113 796056
554763 881569
729755 208943
727558 237112
629112 781841
383054 610982
772129 32795
751342 699313
28727 808326
669818 10767
481289 944492
576524 772938
325590 101144
581325 526629
850895 92375
538169 608966
909092 50645
530203 227686
422907 61204
835143 261724
267979 650726
80823 459485
811795 7714
20496 15077
204990 162592
591902 544330
316061 49747
412753 27457
341803 387308
320433 101751
161675 60261
444433 521951
35576 93309
863090 707736
246051 6284
677762 635939
577537 896721
633567 204945
417555 657221
444003 706669
89629 739885
685890 635891
644834 816864
115735 966666
561668 256296
162635 95746
158066 2649
229414 481464
38728 514755
173868 665775
150945 569025
352628 818627
37060 541627
900814 572187
844024 261973
850994 359915
535935 125900
681273 987732
921480 932840
220026 148927
955002 569392
115349 86589
820891 144532
999772 854017
797814 142403
602708 743860
768019 245885
893678 954044
343913 397549
964953 512601
163244 727398
597729 715549
741515 119132
973773 594314
263719 848136
967959 241498
980120 942325
763907 933035
758209 659615
466994 945637
570352 285503
798347 870717
465140 447227
152161 157259
395429 813730
952018 578865
921391 552545
662498 507210
22247 427449
289080 972706
627893 572608
552632 822713
351443 103936
287167 501916
628104 214056
671671 668890
685352 438797
783529 3428
185920 591163
345525 234367
8353 157898
196464 987241
133706 954930
863639 891188
779550 615609
516786 691825
604975 313063
368053 367539
270150 514085
727263 845330
675253 53027
782766 228743
764923 360536
44248 212900
800752 63459
384401 633022
453549 114449
888819 499688
166453 250541
50148 286448
659018 936493
926385 930780
57262 734203
276364 931988
802882 334960
128132 675664
881090 704299
930342 956546
743237 580110
356898 40639
241515 819948
996482 407386
201173 168287
652854 679069
410810 307651
102984 162869
38279 45574
28588 550294
581678 871844
565075 209945
317687 146409
50980 232433
432471 211416
256619 372170
107479 776154
201511 216124
520422 189843
72526 24770
177260 269256
262612 552641
729145 701855
134483 895694
155115 547043
725509 194252
410168 540035
887538 549479
823020 525493
763554 483508
657166 789068
42445 449848
356844 629013
748131 962227
938762 546384
968460 990013
489463 133652
622506 831834
816680 444311
590271 548323
355799 573604
299206 182386
184074 274056
787332 389271
386069 704421
421517 740717
201110 261861
470096 361862
747179 525994
646546 537639
796304 672875
310400 234995
535080 309842
24472 979057
595287 615550
352642 905266
924046 12751
295312 674518
506862 921245
79978 428456
579260 7993
182695 452463
297071 473646
202683 749991
119974 999627
691561 478764
398363 12232
951608 479343
591368 796903
739202 29384
982560 908851
422421 88268
929701 268630
190710 888861
931169 148618
225256 815233
440117 696606
476462 289615
922889 824909
350655 338003
317924 593772
103965 362602
135886 257456
713783 297906
884721 805143
766062 41918
