# Blender MTL File: 'None'
# Material Count: 12

newmtl texture000_texture000.png.001
Ns 96.078443
Ka 1.000000 1.000000 1.000000
Kd 0.640000 0.640000 0.640000
Ks 0.500000 0.500000 0.500000
Ke 0.000000 0.000000 0.000000
Ni 1.000000
d 1.000000
illum 2
map_Kd C:/Users/Zelash/Documents/Ansem_HP/texture000.png

newmtl texture001_texture001.png.001
Ns 96.078443
Ka 1.000000 1.000000 1.000000
Kd 0.640000 0.640000 0.640000
Ks 0.500000 0.500000 0.500000
Ke 0.000000 0.000000 0.000000
Ni 1.000000
d 1.000000
illum 2
map_Kd C:/Users/Zelash/Documents/Ansem_HP/texture001.png

newmtl texture002_texture002.png.001
Ns 96.078443
Ka 1.000000 1.000000 1.000000
Kd 0.640000 0.640000 0.640000
Ks 0.500000 0.500000 0.500000
Ke 0.000000 0.000000 0.000000
Ni 1.000000
d 1.000000
illum 2
map_Kd C:/Users/Zelash/Documents/Ansem_HP/texture002.png

newmtl texture003_texture003.png.001
Ns 96.078443
Ka 1.000000 1.000000 1.000000
Kd 0.640000 0.640000 0.640000
Ks 0.500000 0.500000 0.500000
Ke 0.000000 0.000000 0.000000
Ni 1.000000
d 1.000000
illum 2
map_Kd C:/Users/Zelash/Documents/Ansem_HP/texture003.png

newmtl texture004_texture004.png.001
Ns 96.078443
Ka 1.000000 1.000000 1.000000
Kd 0.640000 0.640000 0.640000
Ks 0.500000 0.500000 0.500000
Ke 0.000000 0.000000 0.000000
Ni 1.000000
d 1.000000
illum 2
map_Kd C:/Users/Zelash/Documents/Ansem_HP/texture004.png

newmtl texture005_texture005.png.001
Ns 96.078443
Ka 1.000000 1.000000 1.000000
Kd 0.640000 0.640000 0.640000
Ks 0.500000 0.500000 0.500000
Ke 0.000000 0.000000 0.000000
Ni 1.000000
d 1.000000
illum 2
map_Kd C:/Users/Zelash/Documents/Ansem_HP/texture005.png

newmtl texture006_texture006.png.001
Ns 96.078443
Ka 1.000000 1.000000 1.000000
Kd 0.640000 0.640000 0.640000
Ks 0.500000 0.500000 0.500000
Ke 0.000000 0.000000 0.000000
Ni 1.000000
d 1.000000
illum 2
map_Kd C:/Users/Zelash/Documents/Ansem_HP/texture006.png

newmtl texture007_texture007.png.001
Ns 96.078443
Ka 1.000000 1.000000 1.000000
Kd 0.640000 0.640000 0.640000
Ks 0.500000 0.500000 0.500000
Ke 0.000000 0.000000 0.000000
Ni 1.000000
d 1.000000
illum 2
map_Kd C:/Users/Zelash/Documents/Ansem_HP/texture007.png

newmtl texture008_texture008.png.001
Ns 96.078443
Ka 1.000000 1.000000 1.000000
Kd 0.640000 0.640000 0.640000
Ks 0.500000 0.500000 0.500000
Ke 0.000000 0.000000 0.000000
Ni 1.000000
d 1.000000
illum 2
map_Kd C:/Users/Zelash/Documents/Ansem_HP/texture008.png

newmtl texture009_texture009.png.001
Ns 96.078443
Ka 1.000000 1.000000 1.000000
Kd 0.640000 0.640000 0.640000
Ks 0.500000 0.500000 0.500000
Ke 0.000000 0.000000 0.000000
Ni 1.000000
d 1.000000
illum 2
map_Kd C:/Users/Zelash/Documents/Ansem_HP/texture009.png

newmtl texture010_texture010.png.001
Ns 96.078443
Ka 1.000000 1.000000 1.000000
Kd 0.640000 0.640000 0.640000
Ks 0.500000 0.500000 0.500000
Ke 0.000000 0.000000 0.000000
Ni 1.000000
d 1.000000
illum 2
map_Kd C:/Users/Zelash/Documents/Ansem_HP/texture010.png

newmtl texture011_texture011.png.001
Ns 96.078443
Ka 1.000000 1.000000 1.000000
Kd 0.640000 0.640000 0.640000
Ks 0.500000 0.500000 0.500000
Ke 0.000000 0.000000 0.000000
Ni 1.000000
d 1.000000
illum 2
map_Kd C:/Users/Zelash/Documents/Ansem_HP/texture011.png
