# Blender MTL File: 'None'
# Material Count: 1

newmtl Material08
Ns 0.000000
Ka 1.000000 1.000000 1.000000
Kd 0.800000 0.800000 0.800000
Ks 0.000000 0.000000 0.000000
Ke 0.501961 0.501961 0.501961
Ni 1.450000
d 1.000000
illum 1
map_Kd C:\\Users\\Zelash\\Documents\\obj\\PlayStation 2 - Kingdom Hearts - Riku Dark\\Dark Riku\\DarkRiku.png
