%!PS-Adobe-3.0
%%Creator: Nlview
%%For: jschoenbohm
%%Title: root
%%BoundingBox: 28 28 568 814
%%CreationDate: 2020-10-07 11:25
%%Pages: (atend)
%%DocumentData: Clean7Bit
%%DocumentNeededResources: font Helvetica
%%EndComments

%%BeginProlog
50 dict begin
/line {
    newpath moveto lineto stroke
} bind def
/circle {
    newpath 2 div 0 360 arc stroke
} bind def
/filledcircle {
    newpath 2 div 0 360 arc fill
} bind def
/text {                                 % stack: x y rot jx jy len (str)
    gsave
    7 -2 roll moveto                    % stack: rot jx jy len (str)
    dup stringwidth pop /wid exch def   % string width --> wid
    5 -1 roll                           % stack: jx jy len (str) rot
    rotate
    4 2 roll                            % stack: len (str) jx jy
    Fdescent exch
    2 div Fdescent Fascent add mul sub  % desc - jy/2 * (asc+desc)
                                        % stack: len (str) jx ymove
    exch
    2 div wid mul neg                   % -jx/2 * wid
                                        % stack: len (str) ymove xmove
    exch rmoveto                        % stack: len (str)
    exch 0 exch                         % stack: (str) 0 len
    getinterval                         % stack: substr(str,0,len)
    show                                % stack:
    grestore
} bind def
/initfontfac {
    currentdict /Ffac known not {
        % Here we compute Ffac. Ffac is used below to resize the font
        % in a way that the font's ascent+descent/2 fits the required
        % text size. We compute Ffac only once, because the font F will
        % never change.
        %
        dup F exch scalefont setfont % stack sz font
        gsave
        newpath 0 0 moveto (XTgq) false charpath
        pathbbox                        % stack: sz l b r t
        grestore
        3 2 roll neg 2 div add          % fheight = ascent + descent/2
        3 1 roll pop pop                % stack: sz fheight
        div
        /Ffac exch def                  % Ffac = sz/fheight
    } if
} bind def
/textsize {
    Ffac mul F exch scalefont setfont
    gsave
    newpath
    0 0 moveto (XTgq) false charpath pathbbox
    /Fascent exch def			% top -> ascent
    pop
    /Fdescent exch neg 2 div def	% -bottom/2 -> descent
    pop
    grestore
} bind def
/linestyle {
				% stack: [dashdef] offs gwid
    dup 3 1 roll		%        [dashdef] gwid offs gwid
    mul [			%        [dashdef] gwid moffs [
    4 -2 roll exch		%        moffs [ gwid [dashdef]
    {exch dup 3 -1 roll mul exch} forall
    				%	 moffs [ a1 a2 a3 .. gwid
    pop ]			%	 moffs [a1 a2 a3..]
    exch			%	 [a1 a2 a3..] moffs
    setdash			% stack:
} bind def

% Define the array ISOLatin1Encoding (which specifies how characters are
% encoded for ISO-8859-1 fonts), if it isn't already present (Postscript
% level 2 is supposed to define it, but level 1 doesn't).
systemdict /ISOLatin1Encoding known not {
    /ISOLatin1Encoding [
	/space /space /space /space /space /space /space /space
	/space /space /space /space /space /space /space /space
	/space /space /space /space /space /space /space /space
	/space /space /space /space /space /space /space /space
	/space /exclam /quotedbl /numbersign /dollar /percent /ampersand
	    /quoteright
	/parenleft /parenright /asterisk /plus /comma /minus /period /slash
	/zero /one /two /three /four /five /six /seven
	/eight /nine /colon /semicolon /less /equal /greater /question
	/at /A /B /C /D /E /F /G
	/H /I /J /K /L /M /N /O
	/P /Q /R /S /T /U /V /W
	/X /Y /Z /bracketleft /backslash /bracketright /asciicircum
	/underscore /quoteleft /a /b /c /d /e /f /g
	/h /i /j /k /l /m /n /o
	/p /q /r /s /t /u /v /w
	/x /y /z /braceleft /bar /braceright /asciitilde /space
	/space /space /space /space /space /space /space /space
	/space /space /space /space /space /space /space /space
	/dotlessi /grave /acute /circumflex /tilde /macron /breve /dotaccent
	/dieresis /space /ring /cedilla /space /hungarumlaut /ogonek /caron
	/space /exclamdown /cent /sterling /currency /yen /brokenbar /section
	/dieresis /copyright /ordfeminine /guillemotleft /logicalnot /hyphen
	    /registered /macron
	/degree /plusminus /twosuperior /threesuperior /acute /mu /paragraph
	    /periodcentered
	/cedillar /onesuperior /ordmasculine /guillemotright /onequarter
	    /onehalf /threequarters /questiondown
	/Agrave /Aacute /Acircumflex /Atilde /Adieresis /Aring /AE /Ccedilla
	/Egrave /Eacute /Ecircumflex /Edieresis /Igrave /Iacute /Icircumflex
	    /Idieresis
	/Eth /Ntilde /Ograve /Oacute /Ocircumflex /Otilde /Odieresis
	    /multiply
	/Oslash /Ugrave /Uacute /Ucircumflex /Udieresis /Yacute /Thorn
	    /germandbls
	/agrave /aacute /acircumflex /atilde /adieresis /aring /ae /ccedilla
	/egrave /eacute /ecircumflex /edieresis /igrave /iacute /icircumflex
	    /idieresis
	/eth /ntilde /ograve /oacute /ocircumflex /otilde /odieresis /divide
	/oslash /ugrave /uacute /ucircumflex /udieresis /yacute /thorn
	    /ydieresis
    ] def
} if

% font ISOEncode font
% This procedure changes the encoding of a font from the default
% Postscript encoding to ISOLatin1. The body of this procedure comes
% from Section 5.6.1 of the Postscript book.
/ISOEncode {
    dup length dict begin
	{1 index /FID ne {def} {pop pop} ifelse} forall
	/Encoding ISOLatin1Encoding def
	currentdict
    end
    /Fname exch definefont
} bind def
%%EndProlog

%%BeginSetup
%%IncludeResource: font Helvetica
<< /PageSize [595 841] /Policies << /PageSize 3 >> >> setpagedevice
%%EndSetup

/DiagonalCross <<      % pattern prototype dictionary: XX
   /PatternType 1      % Tiling pattern
   /PaintType 2        % uncolored tiling pattern
   /TilingType 1
   /BBox [0 0 8 8]
   /XStep 8
   /YStep 8
   /PaintProc
     { pop
       1 setlinewidth
       [] 0 setdash
       newpath -1 3 moveto
       5 9 lineto
       stroke newpath -1 5 moveto
       5 -1 lineto
       stroke newpath 3 -1 moveto
       9 5 lineto
       stroke newpath 3 9 moveto
       9 3 lineto
       stroke
    } bind
>> def
/Cross <<              % pattern prototype dictionary: ++
   /PatternType 1      % Tiling pattern
   /PaintType 2        % uncolored tiling pattern
   /TilingType 1
   /BBox [0 0 8 8]
   /XStep 8
   /YStep 8
   /PaintProc
     { pop
       1 setlinewidth
       [] 0 setdash
       0 4 moveto
       8 4 lineto
       4 0 moveto
       4 8 lineto
       stroke
    } bind
>> def
/BackwardDiagonal <<   % pattern prototype dictionary: //
   /PatternType 1      % Tiling pattern
   /PaintType 2        % uncolored tiling pattern
   /TilingType 1
   /BBox [0 0 8 8]
   /XStep 8
   /YStep 8
   /PaintProc
     { pop
       1 setlinewidth
       [] 0 setdash
       newpath -1 3 moveto
       6 6 rlineto
       stroke newpath 3 -1 moveto
       6 6 rlineto
       stroke
    } bind
>> def
/ForwardDiagonal <<    % pattern prototype dictionary: \\
   /PatternType 1      % Tiling pattern
   /PaintType 2        % uncolored tiling pattern
   /TilingType 1
   /BBox [0 0 8 8]
   /XStep 8
   /YStep 8
   /PaintProc
     { pop
       1 setlinewidth
       [] 0 setdash
       newpath -1 5 moveto
       6 -6 rlineto
       stroke newpath 3 9 moveto
       6 -6 rlineto
       stroke
    } bind
>> def
/Vertical <<           % pattern prototype dictionary: ||
   /PatternType 1      % Tiling pattern
   /PaintType 2        % uncolored tiling pattern
   /TilingType 1
   /BBox [0 0 8 8]
   /XStep 8
   /YStep 8
   /PaintProc
     { pop
       1 setlinewidth
       [] 0 setdash
       4 0 moveto
       4 8 lineto
       stroke
    } bind
>> def
/Horizontal <<         % pattern prototype dictionary: ==
   /PatternType 1      % Tiling pattern
   /PaintType 2        % uncolored tiling pattern
   /TilingType 1
   /BBox [0 0 8 8]
   /XStep 8
   /YStep 8
   /PaintProc
     { pop
       1 setlinewidth
       [] 0 setdash
       0 4 moveto
       8 4 lineto
       stroke
    } bind
>> def
%%Page: 1 1
%%PageOrientation: Landscape
save
90 rotate
0 -841.89 translate
27.8 274.39 786.3 539.7 rectclip
/F /Helvetica findfont ISOEncode def
12 initfontfac
0 setlinecap 		% Butt caps (flat)
0 setlinejoin		% Miter joins
[/Pattern /DeviceRGB] setcolorspace
0.000 0.000 0.000 setrgbcolor
28.9 274.99 784.2 538.1 rectfill
-3596.2 629.59 newpath moveto
3574.7 629.59 lineto
3574.7 629.59 lineto
3575.2 629.59 lineto
3575.6 629.49 lineto
3576 629.49 lineto
3576.4 629.39 lineto
3576.7 629.29 lineto
3577.1 629.19 lineto
3577.4 629.09 lineto
3577.8 628.89 lineto
3578.2 628.69 lineto
3578.5 628.49 lineto
3578.8 628.29 lineto
3579.2 627.99 lineto
3579.4 627.79 lineto
3579.7 627.49 lineto
3579.9 627.29 lineto
3580.2 626.89 lineto
3580.4 626.59 lineto
3580.6 626.29 lineto
3580.8 625.89 lineto
3581 625.49 lineto
3581.1 625.19 lineto
3581.3 624.69 lineto
3581.3 624.49 lineto
3581.4 624.09 lineto
3581.5 623.59 lineto
3581.5 623.29 lineto
3581.5 622.79 lineto
3581.5 622.79 lineto
3581.5 138.19 lineto
3581.5 138.19 lineto
3581.5 137.89 lineto
3581.5 137.49 lineto
3581.4 136.99 lineto
3581.3 136.59 lineto
3581.2 136.19 lineto
3581.1 135.89 lineto
3581 135.59 lineto
3580.8 135.09 lineto
3580.7 134.89 lineto
3580.4 134.49 lineto
3580.2 134.19 lineto
3579.9 133.79 lineto
3579.7 133.59 lineto
3579.4 133.29 lineto
3579.1 132.99 lineto
3578.8 132.79 lineto
3578.4 132.49 lineto
3578.1 132.29 lineto
3577.9 132.19 lineto
3577.5 131.99 lineto
3577 131.79 lineto
3576.6 131.69 lineto
3576.3 131.59 lineto
3576 131.59 lineto
3575.6 131.49 lineto
3575.2 131.49 lineto
3574.7 131.49 lineto
3574.7 131.49 lineto
-3596.2 131.49 lineto
-3596.2 131.49 lineto
-3596.7 131.49 lineto
-3597.1 131.49 lineto
-3597.5 131.59 lineto
-3597.8 131.59 lineto
-3598.1 131.69 lineto
-3598.5 131.79 lineto
-3599 131.99 lineto
-3599.4 132.19 lineto
-3599.6 132.29 lineto
-3599.9 132.49 lineto
-3600.3 132.79 lineto
-3600.6 132.99 lineto
-3600.9 133.29 lineto
-3601.2 133.59 lineto
-3601.4 133.79 lineto
-3601.7 134.19 lineto
-3601.9 134.39 lineto
-3602.2 134.89 lineto
-3602.3 135.09 lineto
-3602.5 135.59 lineto
-3602.6 135.89 lineto
-3602.7 136.19 lineto
-3602.8 136.59 lineto
-3602.9 136.99 lineto
-3603 137.49 lineto
-3603 137.89 lineto
-3603 138.19 lineto
-3603 138.19 lineto
-3603 622.79 lineto
-3603 622.79 lineto
-3603 623.29 lineto
-3603 623.59 lineto
-3602.9 624.09 lineto
-3602.8 624.49 lineto
-3602.8 624.69 lineto
-3602.6 625.19 lineto
-3602.5 625.49 lineto
-3602.3 625.89 lineto
-3602.1 626.29 lineto
-3602 626.49 lineto
-3601.7 626.89 lineto
-3601.4 627.29 lineto
-3601.2 627.49 lineto
-3600.9 627.79 lineto
-3600.7 627.99 lineto
-3600.3 628.29 lineto
-3600 628.49 lineto
-3599.7 628.69 lineto
-3599.3 628.89 lineto
-3598.9 629.09 lineto
-3598.6 629.19 lineto
-3598.3 629.29 lineto
-3597.9 629.39 lineto
-3597.5 629.49 lineto
-3597.1 629.49 lineto
-3596.7 629.59 lineto
closepath
fill
0.5 setlinewidth
0.000 1.000 1.000 setrgbcolor
-3596.2 629.59 3574.7 629.59 line
10.1309 textsize
-10.8 631.29 0 1 0 22 (simulator::deflate_top) text
1.4 setlinewidth
0.5 setlinewidth
1.4 setlinewidth
0.000 0.000 0.000 setrgbcolor
354.8 393.09 newpath moveto
1413.4 393.09 lineto
1413.4 393.09 lineto
1413.9 393.09 lineto
1414.3 393.09 lineto
1414.6 393.09 lineto
1415 392.99 lineto
1415.3 392.89 lineto
1415.7 392.79 lineto
1416.2 392.59 lineto
1416.4 392.49 lineto
1416.8 392.29 lineto
1417.1 392.09 lineto
1417.6 391.79 lineto
1417.8 391.59 lineto
1418.2 391.29 lineto
1418.4 391.09 lineto
1418.7 390.69 lineto
1418.9 390.39 lineto
1419.1 390.19 lineto
1419.3 389.79 lineto
1419.5 389.49 lineto
1419.7 388.99 lineto
1419.8 388.79 lineto
1419.9 388.39 lineto
1420 387.99 lineto
1420.1 387.49 lineto
1420.2 387.09 lineto
1420.2 386.69 lineto
1420.2 386.39 lineto
1420.2 386.39 lineto
1420.2 323.89 lineto
1420.2 323.89 lineto
1420.2 323.59 lineto
1420.2 323.19 lineto
1420.1 322.79 lineto
1420 322.29 lineto
1419.9 321.89 lineto
1419.8 321.49 lineto
1419.7 321.29 lineto
1419.5 320.79 lineto
1419.3 320.49 lineto
1419.1 320.09 lineto
1418.9 319.89 lineto
1418.7 319.59 lineto
1418.4 319.29 lineto
1418.2 318.99 lineto
1417.8 318.69 lineto
1417.6 318.49 lineto
1417.1 318.19 lineto
1416.8 317.99 lineto
1416.4 317.79 lineto
1416.2 317.69 lineto
1415.7 317.49 lineto
1415.3 317.39 lineto
1415 317.29 lineto
1414.6 317.19 lineto
1414.3 317.19 lineto
1413.9 317.19 lineto
1413.4 317.19 lineto
1413.4 317.19 lineto
354.8 317.19 lineto
354.8 317.19 lineto
354.3 317.19 lineto
353.9 317.19 lineto
353.5 317.29 lineto
353.2 317.29 lineto
352.8 317.39 lineto
352.5 317.49 lineto
352 317.69 lineto
351.8 317.79 lineto
351.4 317.99 lineto
351 318.19 lineto
350.6 318.49 lineto
350.4 318.69 lineto
350 318.99 lineto
349.8 319.19 lineto
349.5 319.59 lineto
349.3 319.79 lineto
349.1 320.09 lineto
348.8 320.59 lineto
348.7 320.79 lineto
348.5 321.19 lineto
348.4 321.49 lineto
348.3 321.89 lineto
348.2 322.29 lineto
348.1 322.79 lineto
348 323.19 lineto
348 323.59 lineto
348 323.89 lineto
348 323.89 lineto
348 386.39 lineto
348 386.39 lineto
348 386.69 lineto
348 387.09 lineto
348.1 387.49 lineto
348.1 387.89 lineto
348.3 388.39 lineto
348.4 388.79 lineto
348.5 389.09 lineto
348.7 389.49 lineto
348.9 389.79 lineto
349.1 390.19 lineto
349.3 390.49 lineto
349.5 390.69 lineto
349.8 391.09 lineto
350 391.29 lineto
350.4 391.59 lineto
350.6 391.79 lineto
351 392.09 lineto
351.4 392.29 lineto
351.7 392.49 lineto
352 392.59 lineto
352.5 392.79 lineto
352.8 392.89 lineto
353.2 392.99 lineto
353.6 393.09 lineto
353.9 393.09 lineto
354.3 393.09 lineto
closepath
fill
0.000 1.000 1.000 setrgbcolor
0.5 setlinewidth
354.8 393.09 1413.4 393.09 line
1413.4 317.19 354.8 317.19 line
354.555 323.741 6.55621 272 179 newpath arcn stroke
348 323.89 348 386.39 line
354.639 386.453 6.63903 181 89 newpath arcn stroke
884.1 394.79 0 1 0 31 (barrel_shifter_data_to_write_i0) text
1.000 0.000 0.000 setrgbcolor
339.6 359.39 348 359.39 line
8.44241 textsize
346.3 361.09 0 2 0 5 (clk=x) text
1.4 setlinewidth
339.6 342.49 348 342.49 line
346.3 344.19 0 2 0 71 (barrel_shifter_data_to_write[255:0]=xxxxxxxxxxxxxxxxxxxxxxxxxxxxxxxx...) text
0.5 setlinewidth
0.000 1.000 1.000 setrgbcolor
356.5 359.39 348 359.39 line
349.7 361.09 0 0 0 3 (clk) text
1.4 setlinewidth
356.5 342.49 348 342.49 line
349.7 344.19 0 0 0 8 (d[255:0]) text
0.000 0.000 0.000 setrgbcolor
348 499.59 newpath moveto
432.4 499.59 lineto
432.4 443.79 lineto
348 443.79 lineto
closepath
fill
0.000 1.000 1.000 setrgbcolor
0.5 setlinewidth
348 499.59 newpath moveto
432.4 499.59 lineto
432.4 443.79 lineto
348 443.79 lineto
closepath
stroke
10.1309 textsize
390.2 501.29 0 1 0 19 (pack_out_last_s1_i0) text
390.2 442.19 0 1 2 26 (register_compression_reset) text
1.000 0.000 0.000 setrgbcolor
339.6 485.99 348 485.99 line
8.44241 textsize
346.3 486.89 0 2 0 15 (pack_out_last=x) text
339.6 469.19 348 469.19 line
346.3 469.99 0 2 0 5 (clk=x) text
339.6 452.29 348 452.29 line
346.3 453.09 0 2 0 5 (rst=x) text
440.9 469.19 432.4 469.19 line
434.1 469.99 0 0 0 18 (pack_out_last_s1=x) text
0.000 1.000 1.000 setrgbcolor
356.5 485.99 348 485.99 line
349.7 486.89 0 0 0 6 (d[0:0]) text
356.5 469.19 348 469.19 line
349.7 469.99 0 0 0 3 (clk) text
356.5 452.29 348 452.29 line
349.7 453.09 0 0 0 5 (reset) text
424 469.19 432.4 469.19 line
430.7 469.99 0 2 0 6 (q[0:0]) text
0.000 0.000 0.000 setrgbcolor
601.3 376.29 newpath moveto
685.7 376.29 lineto
685.7 325.69 lineto
601.3 325.69 lineto
closepath
fill
0.000 1.000 1.000 setrgbcolor
0.000 1.000 0.000 setrgbcolor
601.3 376.29 newpath moveto
685.7 376.29 lineto
685.7 325.69 lineto
601.3 325.69 lineto
closepath
stroke
601.3 356.89 newpath moveto
607.2 359.39 lineto
601.3 361.99 lineto
stroke
10.1309 textsize
643.5 377.99 0 1 0 10 (FlipFlop_0) text
592.9 359.39 601.3 359.39 line
8.44241 textsize
608.9 359.39 0 0 1 5 (CLOCK) text
0.251 0.878 0.816 setrgbcolor
599.6 360.29 0 2 0 5 (clk=x) text
1.4 setlinewidth
0.000 1.000 0.000 setrgbcolor
592.9 342.49 601.3 342.49 line
603 342.59 0 0 1 1 (D) text
0.251 0.878 0.816 setrgbcolor
599.6 343.39 0 2 0 44 (d[255:0]=xxxxxxxxxxxxxxxxxxxxxxxxxxxxxxxx...) text
0.000 1.000 0.000 setrgbcolor
694.2 350.99 685.7 350.99 line
684 350.99 0 2 1 1 (Q) text
0.251 0.878 0.816 setrgbcolor
687.4 351.79 0 0 0 48 (q_reg[255:0]=xxxxxxxxxxxxxxxxxxxxxxxxxxxxxxxx...) text
0.400 0.400 0.400 setrgbcolor
0.5 setlinewidth
339.6 156.79 newpath moveto
1.9 156.79 lineto
1.9 519.79 lineto
1800.1 519.79 lineto
1800.1 502.89 lineto
1901.4 502.89 lineto
stroke
1.4 setlinewidth
0.549 0.549 0.549 setrgbcolor
0.000 0.820 0.820 setrgbcolor
0.400 0.400 0.400 setrgbcolor
-31.9 532.49 newpath moveto
-31.9 553.59 lineto
1783.2 553.59 lineto
1783.2 367.79 lineto
1901.4 367.79 lineto
stroke
0.000 0.820 0.820 setrgbcolor
0.549 0.549 0.549 setrgbcolor
0.9 setlinewidth
0.5 setlinewidth
0.000 0.820 0.820 setrgbcolor
0.400 0.400 0.400 setrgbcolor
-31.9 532.49 newpath moveto
-31.9 553.59 lineto
1783.2 553.59 lineto
1783.2 367.79 lineto
1901.4 367.79 lineto
stroke
0.000 0.820 0.820 setrgbcolor
0.9 setlinewidth
0.549 0.549 0.549 setrgbcolor
1.4 setlinewidth
0.000 0.820 0.820 setrgbcolor
0.400 0.400 0.400 setrgbcolor
-15 532.49 newpath moveto
-15 536.69 lineto
1850.8 536.69 lineto
1850.8 473.39 lineto
stroke
0.000 0.820 0.820 setrgbcolor
0.549 0.549 0.549 setrgbcolor
0.9 setlinewidth
0.5 setlinewidth
0.000 0.820 0.820 setrgbcolor
0.400 0.400 0.400 setrgbcolor
-15 532.49 newpath moveto
-15 536.69 lineto
1850.8 536.69 lineto
1850.8 473.39 lineto
stroke
0.000 0.820 0.820 setrgbcolor
0.9 setlinewidth
0.549 0.549 0.549 setrgbcolor
1.4 setlinewidth
0.400 0.400 0.400 setrgbcolor
-48.8 418.49 1901.4 418.49 line
-48.8 342.49 339.6 342.49 line
0.5 setlinewidth
-48.8 418.49 1901.4 418.49 line
-48.8 342.49 339.6 342.49 line
356.5 359.39 592.9 359.39 line
1.4 setlinewidth
356.5 342.49 592.9 342.49 line
0.5 setlinewidth
356.5 342.49 592.9 342.49 line
1.4 setlinewidth
694.2 350.99 1133.2 350.99 line
0.5 setlinewidth
694.2 350.99 1133.2 350.99 line
-82.5 359.39 339.6 359.39 line
-82.5 291.89 newpath moveto
1867.7 291.89 lineto
1867.7 325.59 lineto
2543.1 325.59 lineto
2543.1 334.09 lineto
2627.5 334.09 lineto
stroke
339.6 469.19 newpath moveto
-82.5 469.19 lineto
-82.5 224.29 lineto
339.6 224.29 lineto
stroke
1.4 setlinewidth
0.549 0.549 0.549 setrgbcolor
0.000 0.820 0.820 setrgbcolor
0.400 0.400 0.400 setrgbcolor
0.000 0.820 0.820 setrgbcolor
0.549 0.549 0.549 setrgbcolor
0.400 0.400 0.400 setrgbcolor
0.000 0.820 0.820 setrgbcolor
0.549 0.549 0.549 setrgbcolor
0.400 0.400 0.400 setrgbcolor
0.9 setlinewidth
0.549 0.549 0.549 setrgbcolor
0.5 setlinewidth
0.000 0.820 0.820 setrgbcolor
0.400 0.400 0.400 setrgbcolor
0.000 0.820 0.820 setrgbcolor
0.9 setlinewidth
0.549 0.549 0.549 setrgbcolor
0.5 setlinewidth
0.400 0.400 0.400 setrgbcolor
0.000 0.820 0.820 setrgbcolor
0.9 setlinewidth
0.549 0.549 0.549 setrgbcolor
0.5 setlinewidth
0.400 0.400 0.400 setrgbcolor
1.4 setlinewidth
0.549 0.549 0.549 setrgbcolor
0.000 0.820 0.820 setrgbcolor
0.400 0.400 0.400 setrgbcolor
0.000 0.820 0.820 setrgbcolor
0.549 0.549 0.549 setrgbcolor
0.400 0.400 0.400 setrgbcolor
0.000 0.820 0.820 setrgbcolor
0.549 0.549 0.549 setrgbcolor
0.400 0.400 0.400 setrgbcolor
0.9 setlinewidth
0.549 0.549 0.549 setrgbcolor
0.5 setlinewidth
0.000 0.820 0.820 setrgbcolor
0.400 0.400 0.400 setrgbcolor
0.000 0.820 0.820 setrgbcolor
0.9 setlinewidth
0.549 0.549 0.549 setrgbcolor
0.5 setlinewidth
0.400 0.400 0.400 setrgbcolor
0.000 0.820 0.820 setrgbcolor
0.9 setlinewidth
0.549 0.549 0.549 setrgbcolor
0.5 setlinewidth
0.400 0.400 0.400 setrgbcolor
-1163.2 494.49 newpath moveto
-884.6 494.49 lineto
-884.6 460.69 lineto
-99.4 460.69 lineto
-99.4 485.99 lineto
339.6 485.99 lineto
stroke
440.9 469.19 newpath moveto
1766.4 469.19 lineto
1766.4 485.99 lineto
1901.4 485.99 lineto
stroke
-65.6 274.99 newpath moveto
1884.6 274.99 lineto
1884.6 308.69 lineto
2559.9 308.69 lineto
2559.9 317.19 lineto
2627.5 317.19 lineto
stroke
339.6 452.29 newpath moveto
-65.6 452.29 lineto
-65.6 190.59 lineto
339.6 190.59 lineto
stroke
1.4 setlinewidth
-420.2 561.99 newpath moveto
-48.8 561.99 lineto
-48.8 570.49 lineto
1884.6 570.49 lineto
1884.6 452.29 lineto
1901.4 452.29 lineto
stroke
0.5 setlinewidth
-420.2 561.99 newpath moveto
-48.8 561.99 lineto
-48.8 570.49 lineto
1884.6 570.49 lineto
1884.6 452.29 lineto
1901.4 452.29 lineto
stroke
restore
showpage
%%Trailer
end
%%Pages: 1
%%EOF
