%!PS-Adobe-3.0
%%Creator: Nlview
%%For: jschoenbohm
%%Title: root
%%BoundingBox: 28 28 568 814
%%CreationDate: 2020-10-07 11:23
%%Pages: (atend)
%%DocumentData: Clean7Bit
%%DocumentNeededResources: font Helvetica
%%EndComments

%%BeginProlog
50 dict begin
/line {
    newpath moveto lineto stroke
} bind def
/circle {
    newpath 2 div 0 360 arc stroke
} bind def
/filledcircle {
    newpath 2 div 0 360 arc fill
} bind def
/text {                                 % stack: x y rot jx jy len (str)
    gsave
    7 -2 roll moveto                    % stack: rot jx jy len (str)
    dup stringwidth pop /wid exch def   % string width --> wid
    5 -1 roll                           % stack: jx jy len (str) rot
    rotate
    4 2 roll                            % stack: len (str) jx jy
    Fdescent exch
    2 div Fdescent Fascent add mul sub  % desc - jy/2 * (asc+desc)
                                        % stack: len (str) jx ymove
    exch
    2 div wid mul neg                   % -jx/2 * wid
                                        % stack: len (str) ymove xmove
    exch rmoveto                        % stack: len (str)
    exch 0 exch                         % stack: (str) 0 len
    getinterval                         % stack: substr(str,0,len)
    show                                % stack:
    grestore
} bind def
/initfontfac {
    currentdict /Ffac known not {
        % Here we compute Ffac. Ffac is used below to resize the font
        % in a way that the font's ascent+descent/2 fits the required
        % text size. We compute Ffac only once, because the font F will
        % never change.
        %
        dup F exch scalefont setfont % stack sz font
        gsave
        newpath 0 0 moveto (XTgq) false charpath
        pathbbox                        % stack: sz l b r t
        grestore
        3 2 roll neg 2 div add          % fheight = ascent + descent/2
        3 1 roll pop pop                % stack: sz fheight
        div
        /Ffac exch def                  % Ffac = sz/fheight
    } if
} bind def
/textsize {
    Ffac mul F exch scalefont setfont
    gsave
    newpath
    0 0 moveto (XTgq) false charpath pathbbox
    /Fascent exch def			% top -> ascent
    pop
    /Fdescent exch neg 2 div def	% -bottom/2 -> descent
    pop
    grestore
} bind def
/linestyle {
				% stack: [dashdef] offs gwid
    dup 3 1 roll		%        [dashdef] gwid offs gwid
    mul [			%        [dashdef] gwid moffs [
    4 -2 roll exch		%        moffs [ gwid [dashdef]
    {exch dup 3 -1 roll mul exch} forall
    				%	 moffs [ a1 a2 a3 .. gwid
    pop ]			%	 moffs [a1 a2 a3..]
    exch			%	 [a1 a2 a3..] moffs
    setdash			% stack:
} bind def

% Define the array ISOLatin1Encoding (which specifies how characters are
% encoded for ISO-8859-1 fonts), if it isn't already present (Postscript
% level 2 is supposed to define it, but level 1 doesn't).
systemdict /ISOLatin1Encoding known not {
    /ISOLatin1Encoding [
	/space /space /space /space /space /space /space /space
	/space /space /space /space /space /space /space /space
	/space /space /space /space /space /space /space /space
	/space /space /space /space /space /space /space /space
	/space /exclam /quotedbl /numbersign /dollar /percent /ampersand
	    /quoteright
	/parenleft /parenright /asterisk /plus /comma /minus /period /slash
	/zero /one /two /three /four /five /six /seven
	/eight /nine /colon /semicolon /less /equal /greater /question
	/at /A /B /C /D /E /F /G
	/H /I /J /K /L /M /N /O
	/P /Q /R /S /T /U /V /W
	/X /Y /Z /bracketleft /backslash /bracketright /asciicircum
	/underscore /quoteleft /a /b /c /d /e /f /g
	/h /i /j /k /l /m /n /o
	/p /q /r /s /t /u /v /w
	/x /y /z /braceleft /bar /braceright /asciitilde /space
	/space /space /space /space /space /space /space /space
	/space /space /space /space /space /space /space /space
	/dotlessi /grave /acute /circumflex /tilde /macron /breve /dotaccent
	/dieresis /space /ring /cedilla /space /hungarumlaut /ogonek /caron
	/space /exclamdown /cent /sterling /currency /yen /brokenbar /section
	/dieresis /copyright /ordfeminine /guillemotleft /logicalnot /hyphen
	    /registered /macron
	/degree /plusminus /twosuperior /threesuperior /acute /mu /paragraph
	    /periodcentered
	/cedillar /onesuperior /ordmasculine /guillemotright /onequarter
	    /onehalf /threequarters /questiondown
	/Agrave /Aacute /Acircumflex /Atilde /Adieresis /Aring /AE /Ccedilla
	/Egrave /Eacute /Ecircumflex /Edieresis /Igrave /Iacute /Icircumflex
	    /Idieresis
	/Eth /Ntilde /Ograve /Oacute /Ocircumflex /Otilde /Odieresis
	    /multiply
	/Oslash /Ugrave /Uacute /Ucircumflex /Udieresis /Yacute /Thorn
	    /germandbls
	/agrave /aacute /acircumflex /atilde /adieresis /aring /ae /ccedilla
	/egrave /eacute /ecircumflex /edieresis /igrave /iacute /icircumflex
	    /idieresis
	/eth /ntilde /ograve /oacute /ocircumflex /otilde /odieresis /divide
	/oslash /ugrave /uacute /ucircumflex /udieresis /yacute /thorn
	    /ydieresis
    ] def
} if

% font ISOEncode font
% This procedure changes the encoding of a font from the default
% Postscript encoding to ISOLatin1. The body of this procedure comes
% from Section 5.6.1 of the Postscript book.
/ISOEncode {
    dup length dict begin
	{1 index /FID ne {def} {pop pop} ifelse} forall
	/Encoding ISOLatin1Encoding def
	currentdict
    end
    /Fname exch definefont
} bind def
%%EndProlog

%%BeginSetup
%%IncludeResource: font Helvetica
<< /PageSize [595 841] /Policies << /PageSize 3 >> >> setpagedevice
%%EndSetup

/DiagonalCross <<      % pattern prototype dictionary: XX
   /PatternType 1      % Tiling pattern
   /PaintType 2        % uncolored tiling pattern
   /TilingType 1
   /BBox [0 0 8 8]
   /XStep 8
   /YStep 8
   /PaintProc
     { pop
       1 setlinewidth
       [] 0 setdash
       newpath -1 3 moveto
       5 9 lineto
       stroke newpath -1 5 moveto
       5 -1 lineto
       stroke newpath 3 -1 moveto
       9 5 lineto
       stroke newpath 3 9 moveto
       9 3 lineto
       stroke
    } bind
>> def
/Cross <<              % pattern prototype dictionary: ++
   /PatternType 1      % Tiling pattern
   /PaintType 2        % uncolored tiling pattern
   /TilingType 1
   /BBox [0 0 8 8]
   /XStep 8
   /YStep 8
   /PaintProc
     { pop
       1 setlinewidth
       [] 0 setdash
       0 4 moveto
       8 4 lineto
       4 0 moveto
       4 8 lineto
       stroke
    } bind
>> def
/BackwardDiagonal <<   % pattern prototype dictionary: //
   /PatternType 1      % Tiling pattern
   /PaintType 2        % uncolored tiling pattern
   /TilingType 1
   /BBox [0 0 8 8]
   /XStep 8
   /YStep 8
   /PaintProc
     { pop
       1 setlinewidth
       [] 0 setdash
       newpath -1 3 moveto
       6 6 rlineto
       stroke newpath 3 -1 moveto
       6 6 rlineto
       stroke
    } bind
>> def
/ForwardDiagonal <<    % pattern prototype dictionary: \\
   /PatternType 1      % Tiling pattern
   /PaintType 2        % uncolored tiling pattern
   /TilingType 1
   /BBox [0 0 8 8]
   /XStep 8
   /YStep 8
   /PaintProc
     { pop
       1 setlinewidth
       [] 0 setdash
       newpath -1 5 moveto
       6 -6 rlineto
       stroke newpath 3 9 moveto
       6 -6 rlineto
       stroke
    } bind
>> def
/Vertical <<           % pattern prototype dictionary: ||
   /PatternType 1      % Tiling pattern
   /PaintType 2        % uncolored tiling pattern
   /TilingType 1
   /BBox [0 0 8 8]
   /XStep 8
   /YStep 8
   /PaintProc
     { pop
       1 setlinewidth
       [] 0 setdash
       4 0 moveto
       4 8 lineto
       stroke
    } bind
>> def
/Horizontal <<         % pattern prototype dictionary: ==
   /PatternType 1      % Tiling pattern
   /PaintType 2        % uncolored tiling pattern
   /TilingType 1
   /BBox [0 0 8 8]
   /XStep 8
   /YStep 8
   /PaintProc
     { pop
       1 setlinewidth
       [] 0 setdash
       0 4 moveto
       8 4 lineto
       stroke
    } bind
>> def
%%Page: 1 1
%%PageOrientation: Landscape
save
90 rotate
0 -841.89 translate
27.8 274.39 786.3 539.7 rectclip
/F /Helvetica findfont ISOEncode def
12 initfontfac
0 setlinecap 		% Butt caps (flat)
0 setlinejoin		% Miter joins
[/Pattern /DeviceRGB] setcolorspace
0.000 0.000 0.000 setrgbcolor
28.9 274.69 784.2 538.4 rectfill
150.3 610.29 newpath moveto
690.6 610.29 lineto
690.6 610.29 lineto
691.2 610.29 lineto
691.7 610.29 lineto
692.2 610.19 lineto
692.9 610.09 lineto
693.5 609.89 lineto
693.8 609.79 lineto
694.4 609.59 lineto
694.9 609.39 lineto
695.4 609.09 lineto
695.9 608.79 lineto
696.4 608.49 lineto
696.9 608.09 lineto
697.3 607.69 lineto
697.7 607.29 lineto
698.1 606.89 lineto
698.3 606.59 lineto
698.7 605.99 lineto
699 605.49 lineto
699.2 605.09 lineto
699.4 604.69 lineto
699.6 604.19 lineto
699.8 603.49 lineto
699.9 603.09 lineto
700.1 602.29 lineto
700.1 601.99 lineto
700.2 601.19 lineto
700.2 600.79 lineto
700.2 600.79 lineto
700.2 488.89 lineto
700.2 488.89 lineto
700.2 488.49 lineto
700.1 487.69 lineto
700 487.09 lineto
699.9 486.59 lineto
699.8 486.19 lineto
699.6 485.49 lineto
699.4 484.99 lineto
699.2 484.59 lineto
699 484.19 lineto
698.7 483.69 lineto
698.3 483.09 lineto
698 482.69 lineto
697.7 482.39 lineto
697.3 481.99 lineto
696.9 481.59 lineto
696.4 481.19 lineto
695.9 480.89 lineto
695.4 480.59 lineto
694.9 480.29 lineto
694.4 480.09 lineto
693.9 479.89 lineto
693.3 479.69 lineto
692.9 479.59 lineto
692.3 479.49 lineto
691.7 479.39 lineto
691.3 479.39 lineto
690.6 479.39 lineto
690.6 479.39 lineto
150.3 479.39 lineto
150.3 479.39 lineto
149.9 479.39 lineto
149.3 479.39 lineto
148.8 479.49 lineto
148.1 479.59 lineto
147.7 479.69 lineto
147 479.89 lineto
146.5 480.09 lineto
146.1 480.29 lineto
145.5 480.59 lineto
145 480.89 lineto
144.6 481.19 lineto
144.2 481.49 lineto
143.7 481.89 lineto
143.3 482.39 lineto
142.9 482.79 lineto
142.7 483.09 lineto
142.3 483.59 lineto
142 484.09 lineto
141.8 484.49 lineto
141.5 485.19 lineto
141.3 485.69 lineto
141.2 486.09 lineto
141 486.79 lineto
140.9 487.19 lineto
140.8 487.89 lineto
140.8 488.49 lineto
140.8 488.89 lineto
140.8 488.89 lineto
140.8 600.79 lineto
140.8 600.79 lineto
140.8 601.19 lineto
140.8 601.79 lineto
140.9 602.29 lineto
141 602.89 lineto
141.2 603.59 lineto
141.3 603.99 lineto
141.5 604.49 lineto
141.7 604.99 lineto
142 605.59 lineto
142.3 606.09 lineto
142.7 606.59 lineto
142.9 606.89 lineto
143.3 607.29 lineto
143.8 607.79 lineto
144.2 608.19 lineto
144.5 608.39 lineto
145 608.79 lineto
145.5 609.09 lineto
146.1 609.39 lineto
146.6 609.59 lineto
147.1 609.79 lineto
147.5 609.89 lineto
148.2 610.09 lineto
148.8 610.19 lineto
149.3 610.29 lineto
149.9 610.29 lineto
closepath
fill
0.6 setlinewidth
0.000 1.000 1.000 setrgbcolor
150.3 610.29 690.6 610.29 line
690.849 600.941 9.35223 92 -1 newpath arcn stroke
700.2 600.79 700.2 488.89 line
690.753 488.836 9.44718 0 -91 newpath arcn stroke
690.6 479.39 150.3 479.39 line
150.099 488.689 9.30152 271 179 newpath arcn stroke
140.8 488.89 140.8 600.79 line
150.097 600.993 9.29887 181 89 newpath arcn stroke
14.2816 textsize
420.5 612.69 0 1 0 19 (pack_out_last_s1_i0) text
420.5 476.99 0 1 2 26 (register_compression_reset) text
1.000 0.000 0.000 setrgbcolor
128.9 562.69 140.8 562.69 line
11.9014 textsize
138.4 565.09 0 2 0 15 (pack_out_last=x) text
128.9 515.09 140.8 515.09 line
138.4 517.49 0 2 0 5 (clk=x) text
128.9 538.89 140.8 538.89 line
138.4 541.29 0 2 0 5 (rst=x) text
712.1 538.89 700.2 538.89 line
702.5 541.29 0 0 0 18 (pack_out_last_s1=x) text
0.000 1.000 1.000 setrgbcolor
152.7 562.69 140.8 562.69 line
143.2 565.09 0 0 0 6 (d[0:0]) text
152.7 515.09 140.8 515.09 line
143.2 517.49 0 0 0 3 (clk) text
152.7 538.89 140.8 538.89 line
143.2 541.29 0 0 0 5 (reset) text
688.3 538.89 700.2 538.89 line
697.8 541.29 0 2 0 6 (q[0:0]) text
0.000 0.000 0.000 setrgbcolor
557.4 538.89 newpath moveto
557.4 553.19 lineto
593.1 538.89 lineto
557.4 524.59 lineto
closepath
fill
0.000 1.000 1.000 setrgbcolor
0.000 1.000 0.000 setrgbcolor
557.4 538.89 newpath moveto
557.4 553.19 lineto
593.1 538.89 lineto
557.4 524.59 lineto
closepath
stroke
1.000 0.000 0.000 setrgbcolor
545.5 538.89 557.4 538.89 line
555 540.09 0 2 0 12 (q_reg[0:0]=x) text
605 538.89 593.1 538.89 line
595.5 540.09 0 0 0 8 (q[0:0]=x) text
0.000 0.000 0.000 setrgbcolor
247.9 491.29 119 95.2 rectfill
1.000 0.000 0.000 setrgbcolor
0.000 1.000 0.000 setrgbcolor
247.9 491.29 119 95.2 rectstroke
247.9 511.49 newpath moveto
256.2 515.09 lineto
247.9 518.69 lineto
stroke
14.2816 textsize
307.4 588.89 0 1 0 10 (FlipFlop_0) text
236 562.69 247.9 562.69 line
11.9014 textsize
250.3 562.69 0 0 1 1 (D) text
0.251 0.878 0.816 setrgbcolor
245.5 563.89 0 2 0 8 (d[0:0]=x) text
0.000 1.000 0.000 setrgbcolor
236 538.89 247.9 538.89 line
250.3 538.89 0 0 1 5 (CLEAR) text
0.251 0.878 0.816 setrgbcolor
245.5 540.09 0 2 0 7 (reset=x) text
0.000 1.000 0.000 setrgbcolor
236 515.09 247.9 515.09 line
258.6 515.09 0 0 1 5 (CLOCK) text
0.251 0.878 0.816 setrgbcolor
245.5 516.29 0 2 0 5 (clk=x) text
0.000 1.000 0.000 setrgbcolor
378.8 538.89 366.9 538.89 line
364.5 538.89 0 2 1 1 (Q) text
0.251 0.878 0.816 setrgbcolor
369.3 540.09 0 0 0 12 (q_reg[0:0]=x) text
0.400 0.400 0.400 setrgbcolor
152.7 515.09 236 515.09 line
152.7 562.69 236 562.69 line
605 538.89 688.3 538.89 line
378.8 538.89 545.5 538.89 line
152.7 538.89 236 538.89 line
restore
showpage
%%Trailer
end
%%Pages: 1
%%EOF
