%!PS-Adobe-3.0
%%Creator: Nlview
%%For: jschoenbohm
%%Title: root
%%BoundingBox: 28 28 568 814
%%CreationDate: 2020-10-07 11:19
%%Pages: (atend)
%%DocumentData: Clean7Bit
%%DocumentNeededResources: font Helvetica
%%EndComments

%%BeginProlog
50 dict begin
/line {
    newpath moveto lineto stroke
} bind def
/circle {
    newpath 2 div 0 360 arc stroke
} bind def
/filledcircle {
    newpath 2 div 0 360 arc fill
} bind def
/text {                                 % stack: x y rot jx jy len (str)
    gsave
    7 -2 roll moveto                    % stack: rot jx jy len (str)
    dup stringwidth pop /wid exch def   % string width --> wid
    5 -1 roll                           % stack: jx jy len (str) rot
    rotate
    4 2 roll                            % stack: len (str) jx jy
    Fdescent exch
    2 div Fdescent Fascent add mul sub  % desc - jy/2 * (asc+desc)
                                        % stack: len (str) jx ymove
    exch
    2 div wid mul neg                   % -jx/2 * wid
                                        % stack: len (str) ymove xmove
    exch rmoveto                        % stack: len (str)
    exch 0 exch                         % stack: (str) 0 len
    getinterval                         % stack: substr(str,0,len)
    show                                % stack:
    grestore
} bind def
/initfontfac {
    currentdict /Ffac known not {
        % Here we compute Ffac. Ffac is used below to resize the font
        % in a way that the font's ascent+descent/2 fits the required
        % text size. We compute Ffac only once, because the font F will
        % never change.
        %
        dup F exch scalefont setfont % stack sz font
        gsave
        newpath 0 0 moveto (XTgq) false charpath
        pathbbox                        % stack: sz l b r t
        grestore
        3 2 roll neg 2 div add          % fheight = ascent + descent/2
        3 1 roll pop pop                % stack: sz fheight
        div
        /Ffac exch def                  % Ffac = sz/fheight
    } if
} bind def
/textsize {
    Ffac mul F exch scalefont setfont
    gsave
    newpath
    0 0 moveto (XTgq) false charpath pathbbox
    /Fascent exch def			% top -> ascent
    pop
    /Fdescent exch neg 2 div def	% -bottom/2 -> descent
    pop
    grestore
} bind def
/linestyle {
				% stack: [dashdef] offs gwid
    dup 3 1 roll		%        [dashdef] gwid offs gwid
    mul [			%        [dashdef] gwid moffs [
    4 -2 roll exch		%        moffs [ gwid [dashdef]
    {exch dup 3 -1 roll mul exch} forall
    				%	 moffs [ a1 a2 a3 .. gwid
    pop ]			%	 moffs [a1 a2 a3..]
    exch			%	 [a1 a2 a3..] moffs
    setdash			% stack:
} bind def

% Define the array ISOLatin1Encoding (which specifies how characters are
% encoded for ISO-8859-1 fonts), if it isn't already present (Postscript
% level 2 is supposed to define it, but level 1 doesn't).
systemdict /ISOLatin1Encoding known not {
    /ISOLatin1Encoding [
	/space /space /space /space /space /space /space /space
	/space /space /space /space /space /space /space /space
	/space /space /space /space /space /space /space /space
	/space /space /space /space /space /space /space /space
	/space /exclam /quotedbl /numbersign /dollar /percent /ampersand
	    /quoteright
	/parenleft /parenright /asterisk /plus /comma /minus /period /slash
	/zero /one /two /three /four /five /six /seven
	/eight /nine /colon /semicolon /less /equal /greater /question
	/at /A /B /C /D /E /F /G
	/H /I /J /K /L /M /N /O
	/P /Q /R /S /T /U /V /W
	/X /Y /Z /bracketleft /backslash /bracketright /asciicircum
	/underscore /quoteleft /a /b /c /d /e /f /g
	/h /i /j /k /l /m /n /o
	/p /q /r /s /t /u /v /w
	/x /y /z /braceleft /bar /braceright /asciitilde /space
	/space /space /space /space /space /space /space /space
	/space /space /space /space /space /space /space /space
	/dotlessi /grave /acute /circumflex /tilde /macron /breve /dotaccent
	/dieresis /space /ring /cedilla /space /hungarumlaut /ogonek /caron
	/space /exclamdown /cent /sterling /currency /yen /brokenbar /section
	/dieresis /copyright /ordfeminine /guillemotleft /logicalnot /hyphen
	    /registered /macron
	/degree /plusminus /twosuperior /threesuperior /acute /mu /paragraph
	    /periodcentered
	/cedillar /onesuperior /ordmasculine /guillemotright /onequarter
	    /onehalf /threequarters /questiondown
	/Agrave /Aacute /Acircumflex /Atilde /Adieresis /Aring /AE /Ccedilla
	/Egrave /Eacute /Ecircumflex /Edieresis /Igrave /Iacute /Icircumflex
	    /Idieresis
	/Eth /Ntilde /Ograve /Oacute /Ocircumflex /Otilde /Odieresis
	    /multiply
	/Oslash /Ugrave /Uacute /Ucircumflex /Udieresis /Yacute /Thorn
	    /germandbls
	/agrave /aacute /acircumflex /atilde /adieresis /aring /ae /ccedilla
	/egrave /eacute /ecircumflex /edieresis /igrave /iacute /icircumflex
	    /idieresis
	/eth /ntilde /ograve /oacute /ocircumflex /otilde /odieresis /divide
	/oslash /ugrave /uacute /ucircumflex /udieresis /yacute /thorn
	    /ydieresis
    ] def
} if

% font ISOEncode font
% This procedure changes the encoding of a font from the default
% Postscript encoding to ISOLatin1. The body of this procedure comes
% from Section 5.6.1 of the Postscript book.
/ISOEncode {
    dup length dict begin
	{1 index /FID ne {def} {pop pop} ifelse} forall
	/Encoding ISOLatin1Encoding def
	currentdict
    end
    /Fname exch definefont
} bind def
%%EndProlog

%%BeginSetup
%%IncludeResource: font Helvetica
<< /PageSize [595 841] /Policies << /PageSize 3 >> >> setpagedevice
%%EndSetup

/DiagonalCross <<      % pattern prototype dictionary: XX
   /PatternType 1      % Tiling pattern
   /PaintType 2        % uncolored tiling pattern
   /TilingType 1
   /BBox [0 0 8 8]
   /XStep 8
   /YStep 8
   /PaintProc
     { pop
       1 setlinewidth
       [] 0 setdash
       newpath -1 3 moveto
       5 9 lineto
       stroke newpath -1 5 moveto
       5 -1 lineto
       stroke newpath 3 -1 moveto
       9 5 lineto
       stroke newpath 3 9 moveto
       9 3 lineto
       stroke
    } bind
>> def
/Cross <<              % pattern prototype dictionary: ++
   /PatternType 1      % Tiling pattern
   /PaintType 2        % uncolored tiling pattern
   /TilingType 1
   /BBox [0 0 8 8]
   /XStep 8
   /YStep 8
   /PaintProc
     { pop
       1 setlinewidth
       [] 0 setdash
       0 4 moveto
       8 4 lineto
       4 0 moveto
       4 8 lineto
       stroke
    } bind
>> def
/BackwardDiagonal <<   % pattern prototype dictionary: //
   /PatternType 1      % Tiling pattern
   /PaintType 2        % uncolored tiling pattern
   /TilingType 1
   /BBox [0 0 8 8]
   /XStep 8
   /YStep 8
   /PaintProc
     { pop
       1 setlinewidth
       [] 0 setdash
       newpath -1 3 moveto
       6 6 rlineto
       stroke newpath 3 -1 moveto
       6 6 rlineto
       stroke
    } bind
>> def
/ForwardDiagonal <<    % pattern prototype dictionary: \\
   /PatternType 1      % Tiling pattern
   /PaintType 2        % uncolored tiling pattern
   /TilingType 1
   /BBox [0 0 8 8]
   /XStep 8
   /YStep 8
   /PaintProc
     { pop
       1 setlinewidth
       [] 0 setdash
       newpath -1 5 moveto
       6 -6 rlineto
       stroke newpath 3 9 moveto
       6 -6 rlineto
       stroke
    } bind
>> def
/Vertical <<           % pattern prototype dictionary: ||
   /PatternType 1      % Tiling pattern
   /PaintType 2        % uncolored tiling pattern
   /TilingType 1
   /BBox [0 0 8 8]
   /XStep 8
   /YStep 8
   /PaintProc
     { pop
       1 setlinewidth
       [] 0 setdash
       4 0 moveto
       4 8 lineto
       stroke
    } bind
>> def
/Horizontal <<         % pattern prototype dictionary: ==
   /PatternType 1      % Tiling pattern
   /PaintType 2        % uncolored tiling pattern
   /TilingType 1
   /BBox [0 0 8 8]
   /XStep 8
   /YStep 8
   /PaintProc
     { pop
       1 setlinewidth
       [] 0 setdash
       0 4 moveto
       8 4 lineto
       stroke
    } bind
>> def
%%Page: 1 1
%%PageOrientation: Landscape
save
90 rotate
0 -841.89 translate
27.8 274.39 786.3 539.7 rectclip
/F /Helvetica findfont ISOEncode def
12 initfontfac
0 setlinecap 		% Butt caps (flat)
0 setlinejoin		% Miter joins
[/Pattern /DeviceRGB] setcolorspace
0.000 0.000 0.000 setrgbcolor
28.9 274.59 784.2 538.5 rectfill
332.6 466.59 176.2 156 rectfill
0.5 setlinewidth
0.000 1.000 1.000 setrgbcolor
332.6 466.59 176.2 156 rectstroke
10.0659 textsize
420.7 624.29 0 1 0 19 (match_selection_UUT) text
420.7 464.89 0 1 2 15 (match_selection) text
1.000 0.000 0.000 setrgbcolor
324.2 609.19 332.6 609.19 line
8.38824 textsize
330.9 610.09 0 2 0 5 (clk=x) text
324.2 558.89 332.6 558.89 line
330.9 559.69 0 2 0 5 (rst=x) text
324.2 525.39 332.6 525.39 line
330.9 526.19 0 2 0 22 (hash_match_start_out=x) text
324.2 491.79 332.6 491.79 line
330.9 492.59 0 2 0 21 (hash_match_last_out=x) text
324.2 474.99 332.6 474.99 line
330.9 475.79 0 2 0 25 (hash_match_output_ready=x) text
517.1 542.09 508.8 542.09 line
510.4 542.89 0 0 0 27 (match_selection_ready_out=x) text
517.1 525.39 508.8 525.39 line
510.4 526.19 0 0 0 27 (match_selection_start_out=x) text
517.1 508.59 508.8 508.59 line
510.4 509.39 0 0 0 26 (match_selection_last_out=x) text
1.4 setlinewidth
324.2 592.49 332.6 592.49 line
330.9 593.29 0 2 0 63 (hash_match_literals_out[127:0]=xxxxxxxxxxxxxxxxxxxxxxxxxxxxxxxx) text
324.2 575.69 332.6 575.69 line
330.9 576.49 0 2 0 62 (hash_match_len_raw_out[127:0]=xxxxxxxxxxxxxxxxxxxxxxxxxxxxxxxx) text
324.2 542.09 332.6 542.09 line
330.9 542.89 0 2 0 66 (hash_match_dist_raw_out[255:0]=xxxxxxxxxxxxxxxxxxxxxxxxxxxxxxxx...) text
324.2 508.59 332.6 508.59 line
330.9 509.39 0 2 0 35 (hash_match_valid_raw_out[15:0]=xxxx) text
517.1 592.49 508.8 592.49 line
510.4 593.29 0 0 0 66 (match_selection_larray_out[127:0]=xxxxxxxxxxxxxxxxxxxxxxxxxxxxxxxx) text
517.1 575.69 508.8 575.69 line
510.4 576.49 0 0 0 69 (match_selection_darray_out[255:0]=xxxxxxxxxxxxxxxxxxxxxxxxxxxxxxxx...) text
517.1 558.89 508.8 558.89 line
510.4 559.69 0 0 0 36 (match_selection_valid_out[15:0]=xxxx) text
0.5 setlinewidth
0.000 1.000 1.000 setrgbcolor
341 609.19 332.6 609.19 line
334.3 610.09 0 0 0 3 (clk) text
341 558.89 332.6 558.89 line
334.3 559.69 0 0 0 5 (reset) text
341 525.39 332.6 525.39 line
334.3 526.19 0 0 0 5 (start) text
341 491.79 332.6 491.79 line
334.3 492.59 0 0 0 4 (last) text
341 474.99 332.6 474.99 line
334.3 475.79 0 0 0 2 (en) text
500.3 542.09 508.8 542.09 line
507.1 542.89 0 2 0 9 (ready_out) text
500.3 525.39 508.8 525.39 line
507.1 526.19 0 2 0 9 (start_out) text
500.3 508.59 508.8 508.59 line
507.1 509.39 0 2 0 8 (last_out) text
1.4 setlinewidth
341 592.49 332.6 592.49 line
334.3 593.29 0 0 0 15 (literals[127:0]) text
341 575.69 332.6 575.69 line
334.3 576.49 0 0 0 14 (len_raw[127:0]) text
341 542.09 332.6 542.09 line
334.3 542.89 0 0 0 15 (dist_raw[255:0]) text
341 508.59 332.6 508.59 line
334.3 509.39 0 0 0 15 (valid_raw[15:0]) text
500.3 592.49 508.8 592.49 line
507.1 593.29 0 2 0 17 (larray_out[127:0]) text
500.3 575.69 508.8 575.69 line
507.1 576.49 0 2 0 17 (darray_out[255:0]) text
500.3 558.89 508.8 558.89 line
507.1 559.69 0 2 0 15 (valid_out[15:0]) text
restore
showpage
%%Trailer
end
%%Pages: 1
%%EOF
