%!PS-Adobe-3.0
%%Creator: Nlview
%%For: jschoenbohm
%%Title: root
%%BoundingBox: 28 28 568 814
%%CreationDate: 2020-10-07 11:20
%%Pages: (atend)
%%DocumentData: Clean7Bit
%%DocumentNeededResources: font Helvetica
%%EndComments

%%BeginProlog
50 dict begin
/line {
    newpath moveto lineto stroke
} bind def
/circle {
    newpath 2 div 0 360 arc stroke
} bind def
/filledcircle {
    newpath 2 div 0 360 arc fill
} bind def
/text {                                 % stack: x y rot jx jy len (str)
    gsave
    7 -2 roll moveto                    % stack: rot jx jy len (str)
    dup stringwidth pop /wid exch def   % string width --> wid
    5 -1 roll                           % stack: jx jy len (str) rot
    rotate
    4 2 roll                            % stack: len (str) jx jy
    Fdescent exch
    2 div Fdescent Fascent add mul sub  % desc - jy/2 * (asc+desc)
                                        % stack: len (str) jx ymove
    exch
    2 div wid mul neg                   % -jx/2 * wid
                                        % stack: len (str) ymove xmove
    exch rmoveto                        % stack: len (str)
    exch 0 exch                         % stack: (str) 0 len
    getinterval                         % stack: substr(str,0,len)
    show                                % stack:
    grestore
} bind def
/initfontfac {
    currentdict /Ffac known not {
        % Here we compute Ffac. Ffac is used below to resize the font
        % in a way that the font's ascent+descent/2 fits the required
        % text size. We compute Ffac only once, because the font F will
        % never change.
        %
        dup F exch scalefont setfont % stack sz font
        gsave
        newpath 0 0 moveto (XTgq) false charpath
        pathbbox                        % stack: sz l b r t
        grestore
        3 2 roll neg 2 div add          % fheight = ascent + descent/2
        3 1 roll pop pop                % stack: sz fheight
        div
        /Ffac exch def                  % Ffac = sz/fheight
    } if
} bind def
/textsize {
    Ffac mul F exch scalefont setfont
    gsave
    newpath
    0 0 moveto (XTgq) false charpath pathbbox
    /Fascent exch def			% top -> ascent
    pop
    /Fdescent exch neg 2 div def	% -bottom/2 -> descent
    pop
    grestore
} bind def
/linestyle {
				% stack: [dashdef] offs gwid
    dup 3 1 roll		%        [dashdef] gwid offs gwid
    mul [			%        [dashdef] gwid moffs [
    4 -2 roll exch		%        moffs [ gwid [dashdef]
    {exch dup 3 -1 roll mul exch} forall
    				%	 moffs [ a1 a2 a3 .. gwid
    pop ]			%	 moffs [a1 a2 a3..]
    exch			%	 [a1 a2 a3..] moffs
    setdash			% stack:
} bind def

% Define the array ISOLatin1Encoding (which specifies how characters are
% encoded for ISO-8859-1 fonts), if it isn't already present (Postscript
% level 2 is supposed to define it, but level 1 doesn't).
systemdict /ISOLatin1Encoding known not {
    /ISOLatin1Encoding [
	/space /space /space /space /space /space /space /space
	/space /space /space /space /space /space /space /space
	/space /space /space /space /space /space /space /space
	/space /space /space /space /space /space /space /space
	/space /exclam /quotedbl /numbersign /dollar /percent /ampersand
	    /quoteright
	/parenleft /parenright /asterisk /plus /comma /minus /period /slash
	/zero /one /two /three /four /five /six /seven
	/eight /nine /colon /semicolon /less /equal /greater /question
	/at /A /B /C /D /E /F /G
	/H /I /J /K /L /M /N /O
	/P /Q /R /S /T /U /V /W
	/X /Y /Z /bracketleft /backslash /bracketright /asciicircum
	/underscore /quoteleft /a /b /c /d /e /f /g
	/h /i /j /k /l /m /n /o
	/p /q /r /s /t /u /v /w
	/x /y /z /braceleft /bar /braceright /asciitilde /space
	/space /space /space /space /space /space /space /space
	/space /space /space /space /space /space /space /space
	/dotlessi /grave /acute /circumflex /tilde /macron /breve /dotaccent
	/dieresis /space /ring /cedilla /space /hungarumlaut /ogonek /caron
	/space /exclamdown /cent /sterling /currency /yen /brokenbar /section
	/dieresis /copyright /ordfeminine /guillemotleft /logicalnot /hyphen
	    /registered /macron
	/degree /plusminus /twosuperior /threesuperior /acute /mu /paragraph
	    /periodcentered
	/cedillar /onesuperior /ordmasculine /guillemotright /onequarter
	    /onehalf /threequarters /questiondown
	/Agrave /Aacute /Acircumflex /Atilde /Adieresis /Aring /AE /Ccedilla
	/Egrave /Eacute /Ecircumflex /Edieresis /Igrave /Iacute /Icircumflex
	    /Idieresis
	/Eth /Ntilde /Ograve /Oacute /Ocircumflex /Otilde /Odieresis
	    /multiply
	/Oslash /Ugrave /Uacute /Ucircumflex /Udieresis /Yacute /Thorn
	    /germandbls
	/agrave /aacute /acircumflex /atilde /adieresis /aring /ae /ccedilla
	/egrave /eacute /ecircumflex /edieresis /igrave /iacute /icircumflex
	    /idieresis
	/eth /ntilde /ograve /oacute /ocircumflex /otilde /odieresis /divide
	/oslash /ugrave /uacute /ucircumflex /udieresis /yacute /thorn
	    /ydieresis
    ] def
} if

% font ISOEncode font
% This procedure changes the encoding of a font from the default
% Postscript encoding to ISOLatin1. The body of this procedure comes
% from Section 5.6.1 of the Postscript book.
/ISOEncode {
    dup length dict begin
	{1 index /FID ne {def} {pop pop} ifelse} forall
	/Encoding ISOLatin1Encoding def
	currentdict
    end
    /Fname exch definefont
} bind def
%%EndProlog

%%BeginSetup
%%IncludeResource: font Helvetica
<< /PageSize [595 841] /Policies << /PageSize 3 >> >> setpagedevice
%%EndSetup

/DiagonalCross <<      % pattern prototype dictionary: XX
   /PatternType 1      % Tiling pattern
   /PaintType 2        % uncolored tiling pattern
   /TilingType 1
   /BBox [0 0 8 8]
   /XStep 8
   /YStep 8
   /PaintProc
     { pop
       1 setlinewidth
       [] 0 setdash
       newpath -1 3 moveto
       5 9 lineto
       stroke newpath -1 5 moveto
       5 -1 lineto
       stroke newpath 3 -1 moveto
       9 5 lineto
       stroke newpath 3 9 moveto
       9 3 lineto
       stroke
    } bind
>> def
/Cross <<              % pattern prototype dictionary: ++
   /PatternType 1      % Tiling pattern
   /PaintType 2        % uncolored tiling pattern
   /TilingType 1
   /BBox [0 0 8 8]
   /XStep 8
   /YStep 8
   /PaintProc
     { pop
       1 setlinewidth
       [] 0 setdash
       0 4 moveto
       8 4 lineto
       4 0 moveto
       4 8 lineto
       stroke
    } bind
>> def
/BackwardDiagonal <<   % pattern prototype dictionary: //
   /PatternType 1      % Tiling pattern
   /PaintType 2        % uncolored tiling pattern
   /TilingType 1
   /BBox [0 0 8 8]
   /XStep 8
   /YStep 8
   /PaintProc
     { pop
       1 setlinewidth
       [] 0 setdash
       newpath -1 3 moveto
       6 6 rlineto
       stroke newpath 3 -1 moveto
       6 6 rlineto
       stroke
    } bind
>> def
/ForwardDiagonal <<    % pattern prototype dictionary: \\
   /PatternType 1      % Tiling pattern
   /PaintType 2        % uncolored tiling pattern
   /TilingType 1
   /BBox [0 0 8 8]
   /XStep 8
   /YStep 8
   /PaintProc
     { pop
       1 setlinewidth
       [] 0 setdash
       newpath -1 5 moveto
       6 -6 rlineto
       stroke newpath 3 9 moveto
       6 -6 rlineto
       stroke
    } bind
>> def
/Vertical <<           % pattern prototype dictionary: ||
   /PatternType 1      % Tiling pattern
   /PaintType 2        % uncolored tiling pattern
   /TilingType 1
   /BBox [0 0 8 8]
   /XStep 8
   /YStep 8
   /PaintProc
     { pop
       1 setlinewidth
       [] 0 setdash
       4 0 moveto
       4 8 lineto
       stroke
    } bind
>> def
/Horizontal <<         % pattern prototype dictionary: ==
   /PatternType 1      % Tiling pattern
   /PaintType 2        % uncolored tiling pattern
   /TilingType 1
   /BBox [0 0 8 8]
   /XStep 8
   /YStep 8
   /PaintProc
     { pop
       1 setlinewidth
       [] 0 setdash
       0 4 moveto
       8 4 lineto
       stroke
    } bind
>> def
%%Page: 1 1
%%PageOrientation: Landscape
save
90 rotate
0 -841.89 translate
27.8 274.39 786.3 539.7 rectclip
/F /Helvetica findfont ISOEncode def
12 initfontfac
0 setlinecap 		% Butt caps (flat)
0 setlinejoin		% Miter joins
[/Pattern /DeviceRGB] setcolorspace
0.000 0.000 0.000 setrgbcolor
28.9 274.89 784.2 538.2 rectfill
326.5 470.29 188.2 148.8 rectfill
0.5 setlinewidth
0.000 1.000 1.000 setrgbcolor
326.5 470.29 188.2 148.8 rectstroke
10.7561 textsize
420.6 620.89 0 1 0 17 (pack_out_data_UUT) text
420.6 468.49 0 1 2 13 (pack_out_data) text
1.000 0.000 0.000 setrgbcolor
317.5 586.79 326.5 586.79 line
8.96343 textsize
324.7 587.69 0 2 0 5 (clk=x) text
317.5 550.99 326.5 550.99 line
324.7 551.89 0 2 0 5 (rst=x) text
317.5 515.09 326.5 515.09 line
324.7 515.99 0 2 0 27 (match_selection_start_out=x) text
317.5 497.19 326.5 497.19 line
324.7 498.09 0 2 0 26 (match_selection_last_out=x) text
317.5 479.29 326.5 479.29 line
324.7 480.09 0 2 0 27 (match_selection_ready_out=x) text
523.7 532.99 514.7 532.99 line
516.5 533.89 0 0 0 16 (pack_out_ready=x) text
523.7 515.09 514.7 515.09 line
516.5 515.99 0 0 0 15 (pack_out_last=x) text
1.5 setlinewidth
317.5 604.69 326.5 604.69 line
324.7 605.59 0 2 0 66 (match_selection_larray_out[127:0]=xxxxxxxxxxxxxxxxxxxxxxxxxxxxxxxx) text
317.5 568.89 326.5 568.89 line
324.7 569.79 0 2 0 69 (match_selection_darray_out[255:0]=xxxxxxxxxxxxxxxxxxxxxxxxxxxxxxxx...) text
317.5 532.99 326.5 532.99 line
324.7 533.89 0 2 0 36 (match_selection_valid_out[15:0]=xxxx) text
523.7 568.89 514.7 568.89 line
516.5 569.79 0 0 0 56 (pack_out_data[255:0]=xxxxxxxxxxxxxxxxxxxxxxxxxxxxxxxx...) text
523.7 550.99 514.7 550.99 line
516.5 551.89 0 0 0 20 (pack_out_len[7:0]=xx) text
0.5 setlinewidth
0.000 1.000 1.000 setrgbcolor
335.5 586.79 326.5 586.79 line
328.3 587.69 0 0 0 3 (clk) text
335.5 550.99 326.5 550.99 line
328.3 551.89 0 0 0 5 (reset) text
335.5 515.09 326.5 515.09 line
328.3 515.99 0 0 0 5 (start) text
335.5 497.19 326.5 497.19 line
328.3 498.09 0 0 0 4 (last) text
335.5 479.29 326.5 479.29 line
328.3 480.09 0 0 0 2 (en) text
505.8 532.99 514.7 532.99 line
512.9 533.89 0 2 0 9 (out_ready) text
505.8 515.09 514.7 515.09 line
512.9 515.99 0 2 0 8 (out_last) text
1.5 setlinewidth
335.5 604.69 326.5 604.69 line
328.3 605.59 0 0 0 16 (larray_in[127:0]) text
335.5 568.89 326.5 568.89 line
328.3 569.79 0 0 0 16 (darray_in[255:0]) text
335.5 532.99 326.5 532.99 line
328.3 533.89 0 0 0 14 (valid_in[15:0]) text
505.8 568.89 514.7 568.89 line
512.9 569.79 0 2 0 15 (out_data[255:0]) text
505.8 550.99 514.7 550.99 line
512.9 551.89 0 2 0 12 (out_len[7:0]) text
restore
showpage
%%Trailer
end
%%Pages: 1
%%EOF
