%!PS-Adobe-3.0
%%Creator: Nlview
%%For: jschoenbohm
%%Title: root
%%BoundingBox: 28 28 568 814
%%CreationDate: 2020-10-06 16:10
%%Pages: (atend)
%%DocumentData: Clean7Bit
%%DocumentNeededResources: font Helvetica
%%EndComments

%%BeginProlog
50 dict begin
/line {
    newpath moveto lineto stroke
} bind def
/circle {
    newpath 2 div 0 360 arc stroke
} bind def
/filledcircle {
    newpath 2 div 0 360 arc fill
} bind def
/text {                                 % stack: x y rot jx jy len (str)
    gsave
    7 -2 roll moveto                    % stack: rot jx jy len (str)
    dup stringwidth pop /wid exch def   % string width --> wid
    5 -1 roll                           % stack: jx jy len (str) rot
    rotate
    4 2 roll                            % stack: len (str) jx jy
    Fdescent exch
    2 div Fdescent Fascent add mul sub  % desc - jy/2 * (asc+desc)
                                        % stack: len (str) jx ymove
    exch
    2 div wid mul neg                   % -jx/2 * wid
                                        % stack: len (str) ymove xmove
    exch rmoveto                        % stack: len (str)
    exch 0 exch                         % stack: (str) 0 len
    getinterval                         % stack: substr(str,0,len)
    show                                % stack:
    grestore
} bind def
/initfontfac {
    currentdict /Ffac known not {
        % Here we compute Ffac. Ffac is used below to resize the font
        % in a way that the font's ascent+descent/2 fits the required
        % text size. We compute Ffac only once, because the font F will
        % never change.
        %
        dup F exch scalefont setfont % stack sz font
        gsave
        newpath 0 0 moveto (XTgq) false charpath
        pathbbox                        % stack: sz l b r t
        grestore
        3 2 roll neg 2 div add          % fheight = ascent + descent/2
        3 1 roll pop pop                % stack: sz fheight
        div
        /Ffac exch def                  % Ffac = sz/fheight
    } if
} bind def
/textsize {
    Ffac mul F exch scalefont setfont
    gsave
    newpath
    0 0 moveto (XTgq) false charpath pathbbox
    /Fascent exch def			% top -> ascent
    pop
    /Fdescent exch neg 2 div def	% -bottom/2 -> descent
    pop
    grestore
} bind def
/linestyle {
				% stack: [dashdef] offs gwid
    dup 3 1 roll		%        [dashdef] gwid offs gwid
    mul [			%        [dashdef] gwid moffs [
    4 -2 roll exch		%        moffs [ gwid [dashdef]
    {exch dup 3 -1 roll mul exch} forall
    				%	 moffs [ a1 a2 a3 .. gwid
    pop ]			%	 moffs [a1 a2 a3..]
    exch			%	 [a1 a2 a3..] moffs
    setdash			% stack:
} bind def

% Define the array ISOLatin1Encoding (which specifies how characters are
% encoded for ISO-8859-1 fonts), if it isn't already present (Postscript
% level 2 is supposed to define it, but level 1 doesn't).
systemdict /ISOLatin1Encoding known not {
    /ISOLatin1Encoding [
	/space /space /space /space /space /space /space /space
	/space /space /space /space /space /space /space /space
	/space /space /space /space /space /space /space /space
	/space /space /space /space /space /space /space /space
	/space /exclam /quotedbl /numbersign /dollar /percent /ampersand
	    /quoteright
	/parenleft /parenright /asterisk /plus /comma /minus /period /slash
	/zero /one /two /three /four /five /six /seven
	/eight /nine /colon /semicolon /less /equal /greater /question
	/at /A /B /C /D /E /F /G
	/H /I /J /K /L /M /N /O
	/P /Q /R /S /T /U /V /W
	/X /Y /Z /bracketleft /backslash /bracketright /asciicircum
	/underscore /quoteleft /a /b /c /d /e /f /g
	/h /i /j /k /l /m /n /o
	/p /q /r /s /t /u /v /w
	/x /y /z /braceleft /bar /braceright /asciitilde /space
	/space /space /space /space /space /space /space /space
	/space /space /space /space /space /space /space /space
	/dotlessi /grave /acute /circumflex /tilde /macron /breve /dotaccent
	/dieresis /space /ring /cedilla /space /hungarumlaut /ogonek /caron
	/space /exclamdown /cent /sterling /currency /yen /brokenbar /section
	/dieresis /copyright /ordfeminine /guillemotleft /logicalnot /hyphen
	    /registered /macron
	/degree /plusminus /twosuperior /threesuperior /acute /mu /paragraph
	    /periodcentered
	/cedillar /onesuperior /ordmasculine /guillemotright /onequarter
	    /onehalf /threequarters /questiondown
	/Agrave /Aacute /Acircumflex /Atilde /Adieresis /Aring /AE /Ccedilla
	/Egrave /Eacute /Ecircumflex /Edieresis /Igrave /Iacute /Icircumflex
	    /Idieresis
	/Eth /Ntilde /Ograve /Oacute /Ocircumflex /Otilde /Odieresis
	    /multiply
	/Oslash /Ugrave /Uacute /Ucircumflex /Udieresis /Yacute /Thorn
	    /germandbls
	/agrave /aacute /acircumflex /atilde /adieresis /aring /ae /ccedilla
	/egrave /eacute /ecircumflex /edieresis /igrave /iacute /icircumflex
	    /idieresis
	/eth /ntilde /ograve /oacute /ocircumflex /otilde /odieresis /divide
	/oslash /ugrave /uacute /ucircumflex /udieresis /yacute /thorn
	    /ydieresis
    ] def
} if

% font ISOEncode font
% This procedure changes the encoding of a font from the default
% Postscript encoding to ISOLatin1. The body of this procedure comes
% from Section 5.6.1 of the Postscript book.
/ISOEncode {
    dup length dict begin
	{1 index /FID ne {def} {pop pop} ifelse} forall
	/Encoding ISOLatin1Encoding def
	currentdict
    end
    /Fname exch definefont
} bind def
%%EndProlog

%%BeginSetup
%%IncludeResource: font Helvetica
<< /PageSize [595 841] /Policies << /PageSize 3 >> >> setpagedevice
%%EndSetup

/DiagonalCross <<      % pattern prototype dictionary: XX
   /PatternType 1      % Tiling pattern
   /PaintType 2        % uncolored tiling pattern
   /TilingType 1
   /BBox [0 0 8 8]
   /XStep 8
   /YStep 8
   /PaintProc
     { pop
       1 setlinewidth
       [] 0 setdash
       newpath -1 3 moveto
       5 9 lineto
       stroke newpath -1 5 moveto
       5 -1 lineto
       stroke newpath 3 -1 moveto
       9 5 lineto
       stroke newpath 3 9 moveto
       9 3 lineto
       stroke
    } bind
>> def
/Cross <<              % pattern prototype dictionary: ++
   /PatternType 1      % Tiling pattern
   /PaintType 2        % uncolored tiling pattern
   /TilingType 1
   /BBox [0 0 8 8]
   /XStep 8
   /YStep 8
   /PaintProc
     { pop
       1 setlinewidth
       [] 0 setdash
       0 4 moveto
       8 4 lineto
       4 0 moveto
       4 8 lineto
       stroke
    } bind
>> def
/BackwardDiagonal <<   % pattern prototype dictionary: //
   /PatternType 1      % Tiling pattern
   /PaintType 2        % uncolored tiling pattern
   /TilingType 1
   /BBox [0 0 8 8]
   /XStep 8
   /YStep 8
   /PaintProc
     { pop
       1 setlinewidth
       [] 0 setdash
       newpath -1 3 moveto
       6 6 rlineto
       stroke newpath 3 -1 moveto
       6 6 rlineto
       stroke
    } bind
>> def
/ForwardDiagonal <<    % pattern prototype dictionary: \\
   /PatternType 1      % Tiling pattern
   /PaintType 2        % uncolored tiling pattern
   /TilingType 1
   /BBox [0 0 8 8]
   /XStep 8
   /YStep 8
   /PaintProc
     { pop
       1 setlinewidth
       [] 0 setdash
       newpath -1 5 moveto
       6 -6 rlineto
       stroke newpath 3 9 moveto
       6 -6 rlineto
       stroke
    } bind
>> def
/Vertical <<           % pattern prototype dictionary: ||
   /PatternType 1      % Tiling pattern
   /PaintType 2        % uncolored tiling pattern
   /TilingType 1
   /BBox [0 0 8 8]
   /XStep 8
   /YStep 8
   /PaintProc
     { pop
       1 setlinewidth
       [] 0 setdash
       4 0 moveto
       4 8 lineto
       stroke
    } bind
>> def
/Horizontal <<         % pattern prototype dictionary: ==
   /PatternType 1      % Tiling pattern
   /PaintType 2        % uncolored tiling pattern
   /TilingType 1
   /BBox [0 0 8 8]
   /XStep 8
   /YStep 8
   /PaintProc
     { pop
       1 setlinewidth
       [] 0 setdash
       0 4 moveto
       8 4 lineto
       stroke
    } bind
>> def
%%Page: 1 1
%%PageOrientation: Landscape
save
90 rotate
0 -841.89 translate
27.8 274.39 786.3 539.7 rectclip
/F /Helvetica findfont ISOEncode def
12 initfontfac
0 setlinecap 		% Butt caps (flat)
0 setlinejoin		% Miter joins
[/Pattern /DeviceRGB] setcolorspace
0.000 0.000 0.000 setrgbcolor
28.9 275.29 784.2 537.8 rectfill
31.8 588.89 newpath moveto
810.2 588.89 lineto
810.2 588.89 lineto
810.5 588.79 lineto
810.8 588.69 lineto
811 588.59 lineto
811.2 588.39 lineto
811.4 588.09 lineto
811.5 587.79 lineto
811.5 587.49 lineto
811.5 587.49 lineto
811.5 500.79 lineto
811.5 500.79 lineto
811.5 500.49 lineto
811.4 500.29 lineto
811.2 499.99 lineto
811 499.79 lineto
810.7 499.59 lineto
810.5 499.49 lineto
810.2 499.49 lineto
810.2 499.49 lineto
31.8 499.49 lineto
31.8 499.49 lineto
31.5 499.49 lineto
31.3 499.59 lineto
31 499.79 lineto
30.8 499.99 lineto
30.6 500.29 lineto
30.5 500.49 lineto
30.5 500.79 lineto
30.5 500.79 lineto
30.5 587.49 lineto
30.5 587.49 lineto
30.5 587.79 lineto
30.6 588.09 lineto
30.8 588.39 lineto
31 588.59 lineto
31.2 588.69 lineto
31.5 588.79 lineto
closepath
fill
0.1 setlinewidth
0.000 1.000 1.000 setrgbcolor
31.8 588.89 810.2 588.89 line
810.107 587.5 1.39288 86 0 newpath arcn stroke
811.5 587.49 811.5 500.79 line
810.219 500.771 1.28103 1 -91 newpath arcn stroke
810.2 499.49 31.8 499.49 line
31.7823 500.772 1.28243 271 179 newpath arcn stroke
30.5 500.79 30.5 587.49 line
31.8018 587.585 1.30528 184 90 newpath arcn stroke
1.98557 textsize
421 589.19 0 1 0 22 (simulator::deflate_top) text
421 499.19 0 1 2 11 (deflate_top) text
28.9 585.59 30.5 585.59 line
28.9 570.69 30.5 570.69 line
28.9 567.39 30.5 567.39 line
28.9 564.09 30.5 564.09 line
28.9 560.79 30.5 560.79 line
813.2 552.49 811.5 552.49 line
813.2 557.49 811.5 557.49 line
0.4 setlinewidth
28.9 573.99 30.5 573.99 line
813.2 517.69 811.5 517.69 line
813.2 547.49 811.5 547.49 line
0.1 setlinewidth
32.2 585.59 30.5 585.59 line
1.65464 textsize
30.8 585.89 0 0 0 3 (clk) text
32.2 570.69 30.5 570.69 line
30.8 570.99 0 0 0 3 (rst) text
32.2 567.39 30.5 567.39 line
30.8 567.69 0 0 0 5 (start) text
32.2 564.09 30.5 564.09 line
30.8 564.39 0 0 0 4 (last) text
32.2 560.79 30.5 560.79 line
30.8 561.09 0 0 0 7 (inValid) text
809.8 552.49 811.5 552.49 line
811.2 552.79 0 2 0 9 (out_ready) text
809.8 557.49 811.5 557.49 line
811.2 557.69 0 2 0 8 (out_last) text
0.4 setlinewidth
32.2 573.99 30.5 573.99 line
30.8 574.29 0 0 0 21 (data_window_in[255:0]) text
809.8 517.69 811.5 517.69 line
811.2 517.99 0 2 0 15 (out_data[511:0]) text
809.8 547.49 811.5 547.49 line
811.2 547.79 0 2 0 17 (out_last_len[8:0]) text
0.000 0.000 0.000 setrgbcolor
751.9 552.49 newpath moveto
751.9 554.49 lineto
756.9 552.49 lineto
751.9 550.49 lineto
closepath
fill
0.000 1.000 1.000 setrgbcolor
0.1 setlinewidth
0.000 1.000 0.000 setrgbcolor
751.9 552.49 newpath moveto
751.9 554.49 lineto
756.9 552.49 lineto
751.9 550.49 lineto
closepath
stroke
1.000 1.000 1.000 setrgbcolor
750.3 552.49 751.9 552.49 line
751.6 552.69 0 2 0 14 (out_ready_reg=) text
758.6 552.49 756.9 552.49 line
757.2 552.69 0 0 0 10 (out_ready=) text
0.000 0.000 0.000 setrgbcolor
751.9 557.49 newpath moveto
751.9 559.49 lineto
756.9 557.49 lineto
751.9 555.49 lineto
closepath
fill
1.000 1.000 1.000 setrgbcolor
0.000 1.000 0.000 setrgbcolor
751.9 557.49 newpath moveto
751.9 559.49 lineto
756.9 557.49 lineto
751.9 555.49 lineto
closepath
stroke
1.000 1.000 1.000 setrgbcolor
750.3 557.49 751.9 557.49 line
751.6 557.69 0 2 0 13 (out_last_reg=) text
758.6 557.49 756.9 557.49 line
757.2 557.69 0 0 0 9 (out_last=) text
0.000 0.000 0.000 setrgbcolor
751.9 547.49 newpath moveto
751.9 549.49 lineto
756.9 547.49 lineto
751.9 545.49 lineto
closepath
fill
1.000 1.000 1.000 setrgbcolor
0.000 1.000 0.000 setrgbcolor
751.9 547.49 newpath moveto
751.9 549.49 lineto
756.9 547.49 lineto
751.9 545.49 lineto
closepath
stroke
0.4 setlinewidth
1.000 1.000 1.000 setrgbcolor
750.3 547.49 751.9 547.49 line
751.6 547.69 0 2 0 22 (out_last_len_reg[8:0]=) text
758.6 547.49 756.9 547.49 line
757.2 547.69 0 0 0 18 (out_last_len[8:0]=) text
0.000 0.000 0.000 setrgbcolor
751.9 511.09 39.7 13.2 rectfill
1.000 1.000 1.000 setrgbcolor
0.1 setlinewidth
0.000 1.000 0.000 setrgbcolor
751.9 511.09 39.7 13.2 rectstroke
1.98557 textsize
771.8 524.59 0 1 0 9 (Unknown_0) text
0.4 setlinewidth
1.000 1.000 1.000 setrgbcolor
750.3 521.09 751.9 521.09 line
1.65464 textsize
752.2 520.99 0 0 1 11 (state[2:0]=) text
750.3 517.69 751.9 517.69 line
752.2 517.69 0 0 1 20 (out_data_op1[511:0]=) text
750.3 514.39 751.9 514.39 line
752.2 514.39 0 0 1 20 (out_data_op2[511:0]=) text
793.3 517.69 791.6 517.69 line
791.3 517.69 0 2 1 16 (out_data[511:0]=) text
0.000 0.000 0.000 setrgbcolor
690.7 522.69 29.8 13.2 rectfill
1.000 1.000 1.000 setrgbcolor
0.1 setlinewidth
0.000 1.000 0.000 setrgbcolor
690.7 522.69 29.8 13.2 rectstroke
1.98557 textsize
705.6 536.19 0 1 0 9 (Unknown_1) text
1.000 1.000 1.000 setrgbcolor
689.1 532.59 690.7 532.59 line
1.65464 textsize
691 532.59 0 0 1 4 (clk=) text
689.1 529.29 690.7 529.29 line
691 529.29 0 0 1 4 (rst=) text
0.4 setlinewidth
689.1 525.99 690.7 525.99 line
691 525.99 0 0 1 16 (next_state[2:0]=) text
722.1 529.29 720.5 529.29 line
720.2 529.29 0 2 1 11 (state[2:0]=) text
0.000 0.000 0.000 setrgbcolor
606.3 532.59 61.2 36.4 rectfill
1.000 1.000 1.000 setrgbcolor
0.1 setlinewidth
0.000 1.000 0.000 setrgbcolor
606.3 532.59 61.2 36.4 rectstroke
1.98557 textsize
636.9 569.29 0 1 0 9 (Unknown_2) text
1.000 1.000 1.000 setrgbcolor
604.7 565.69 606.3 565.69 line
1.65464 textsize
606.6 565.69 0 0 1 25 (barrel_shifter_data_full=) text
604.7 562.39 606.3 562.39 line
606.6 562.39 0 0 1 17 (pack_out_last_s1=) text
669.2 557.49 667.5 557.49 line
667.2 557.39 0 2 1 13 (out_last_reg=) text
669.2 554.09 667.5 554.09 line
667.2 554.09 0 2 1 14 (out_ready_reg=) text
0.4 setlinewidth
604.7 559.09 606.3 559.09 line
606.6 559.09 0 0 1 31 (barrel_shifter_data_out[511:0]=) text
604.7 555.79 606.3 555.79 line
606.6 555.79 0 0 1 32 (barrel_shifter_current_len[8:0]=) text
604.7 552.49 606.3 552.49 line
606.6 552.49 0 0 1 11 (state[2:0]=) text
604.7 549.19 606.3 549.19 line
606.6 549.09 0 0 1 36 (barrel_shifter_data_to_write[255:0]=) text
604.7 545.89 606.3 545.89 line
606.6 545.79 0 0 1 20 (out_data_op2[511:0]=) text
604.7 542.59 606.3 542.59 line
606.6 542.49 0 0 1 40 (barrel_shifter_data_to_write_reg[255:0]=) text
604.7 539.29 606.3 539.29 line
606.6 539.19 0 0 1 31 (barrel_shifter_data_out[255:0]=) text
604.7 535.89 606.3 535.89 line
606.6 535.89 0 0 1 20 (out_data_op2[255:0]=) text
669.2 550.79 667.5 550.79 line
667.2 550.79 0 2 1 20 (out_data_op1[511:0]=) text
669.2 547.49 667.5 547.49 line
667.2 547.49 0 2 1 22 (out_last_len_reg[8:0]=) text
669.2 544.19 667.5 544.19 line
667.2 544.19 0 2 1 16 (next_state[2:0]=) text
0.000 0.000 0.000 setrgbcolor
528.6 535.99 21.5 7.6 rectfill
1.000 1.000 1.000 setrgbcolor
0.1 setlinewidth
0.000 1.000 1.000 setrgbcolor
528.6 535.99 21.5 7.6 rectstroke
1.98557 textsize
539.4 543.89 0 1 0 31 (barrel_shifter_data_to_write_i0) text
539.4 535.69 0 1 2 20 (register_compression) text
1.000 1.000 1.000 setrgbcolor
526.9 537.59 528.6 537.59 line
1.65464 textsize
528.3 537.79 0 2 0 4 (clk=) text
0.4 setlinewidth
526.9 540.89 528.6 540.89 line
528.3 541.09 0 2 0 36 (barrel_shifter_data_to_write[255:0]=) text
551.7 540.89 550.1 540.89 line
550.4 541.09 0 0 0 40 (barrel_shifter_data_to_write_reg[255:0]=) text
0.1 setlinewidth
0.000 1.000 1.000 setrgbcolor
530.2 537.59 528.6 537.59 line
528.9 537.79 0 0 0 3 (clk) text
0.4 setlinewidth
530.2 540.89 528.6 540.89 line
528.9 541.09 0 0 0 8 (d[255:0]) text
548.4 540.89 550.1 540.89 line
549.8 541.09 0 2 0 8 (q[255:0]) text
0.000 0.000 0.000 setrgbcolor
409.4 562.39 33.1 20.9 rectfill
0.000 1.000 1.000 setrgbcolor
0.1 setlinewidth
409.4 562.39 33.1 20.9 rectstroke
1.98557 textsize
425.9 583.59 0 1 0 26 (barrel_shifter_512bits_UUT) text
425.9 562.09 0 1 2 22 (barrel_shifter_512bits) text
1.000 1.000 1.000 setrgbcolor
407.8 580.59 409.4 580.59 line
1.65464 textsize
409.1 580.79 0 2 0 4 (clk=) text
407.8 573.99 409.4 573.99 line
409.1 574.19 0 2 0 4 (rst=) text
407.8 567.39 409.4 567.39 line
409.1 567.59 0 2 0 15 (pack_out_ready=) text
407.8 564.09 409.4 564.09 line
409.1 564.29 0 2 0 14 (pack_out_last=) text
444.2 567.39 442.5 567.39 line
442.8 567.59 0 0 0 25 (barrel_shifter_data_full=) text
0.4 setlinewidth
407.8 577.29 409.4 577.29 line
409.1 577.49 0 2 0 21 (pack_out_data[255:0]=) text
407.8 570.69 409.4 570.69 line
409.1 570.89 0 2 0 18 (pack_out_len[7:0]=) text
444.2 577.29 442.5 577.29 line
442.8 577.49 0 0 0 32 (barrel_shifter_current_len[8:0]=) text
444.2 573.99 442.5 573.99 line
442.8 574.19 0 0 0 36 (barrel_shifter_data_to_write[255:0]=) text
444.2 570.69 442.5 570.69 line
442.8 570.89 0 0 0 31 (barrel_shifter_data_out[511:0]=) text
0.1 setlinewidth
0.000 1.000 1.000 setrgbcolor
411.1 580.59 409.4 580.59 line
409.7 580.79 0 0 0 3 (clk) text
411.1 573.99 409.4 573.99 line
409.7 574.19 0 0 0 5 (reset) text
411.1 567.39 409.4 567.39 line
409.7 567.59 0 0 0 6 (enable) text
411.1 564.09 409.4 564.09 line
409.7 564.29 0 0 0 4 (last) text
440.9 567.39 442.5 567.39 line
442.2 567.59 0 2 0 9 (data_full) text
0.4 setlinewidth
411.1 577.29 409.4 577.29 line
409.7 577.49 0 0 0 14 (data_in[255:0]) text
411.1 570.69 409.4 570.69 line
409.7 570.89 0 0 0 11 (len_in[7:0]) text
440.9 577.29 442.5 577.29 line
442.2 577.49 0 2 0 16 (current_len[8:0]) text
440.9 573.99 442.5 573.99 line
442.2 574.19 0 2 0 20 (data_to_write[255:0]) text
440.9 570.69 442.5 570.69 line
442.2 570.89 0 2 0 15 (data_out[511:0]) text
0.000 0.000 0.000 setrgbcolor
81.8 555.79 43 24.2 rectfill
0.000 1.000 1.000 setrgbcolor
0.1 setlinewidth
81.8 555.79 43 24.2 rectstroke
1.98557 textsize
103.3 580.29 0 1 0 14 (hash_match_UUT) text
103.3 555.49 0 1 2 10 (hash_match) text
1.000 1.000 1.000 setrgbcolor
80.1 577.29 81.8 577.29 line
1.65464 textsize
81.5 577.49 0 2 0 4 (clk=) text
80.1 570.69 81.8 570.69 line
81.5 570.89 0 2 0 4 (rst=) text
80.1 567.39 81.8 567.39 line
81.5 567.59 0 2 0 6 (start=) text
80.1 564.09 81.8 564.09 line
81.5 564.29 0 2 0 5 (last=) text
80.1 560.79 81.8 560.79 line
81.5 560.99 0 2 0 8 (inValid=) text
126.5 564.09 124.8 564.09 line
125.2 564.29 0 0 0 24 (hash_match_output_ready=) text
126.5 560.79 124.8 560.79 line
125.2 560.99 0 0 0 21 (hash_match_start_out=) text
126.5 557.49 124.8 557.49 line
125.2 557.69 0 0 0 20 (hash_match_last_out=) text
0.4 setlinewidth
80.1 573.99 81.8 573.99 line
81.5 574.19 0 2 0 22 (data_window_in[255:0]=) text
126.5 577.29 124.8 577.29 line
125.2 577.49 0 0 0 31 (hash_match_literals_out[127:0]=) text
126.5 573.99 124.8 573.99 line
125.2 574.19 0 0 0 30 (hash_match_len_raw_out[127:0]=) text
126.5 570.69 124.8 570.69 line
125.2 570.89 0 0 0 31 (hash_match_dist_raw_out[255:0]=) text
126.5 567.39 124.8 567.39 line
125.2 567.59 0 0 0 31 (hash_match_valid_raw_out[15:0]=) text
0.1 setlinewidth
0.000 1.000 1.000 setrgbcolor
83.5 577.29 81.8 577.29 line
82.1 577.49 0 0 0 3 (clk) text
83.5 570.69 81.8 570.69 line
82.1 570.89 0 0 0 3 (rst) text
83.5 567.39 81.8 567.39 line
82.1 567.59 0 0 0 5 (start) text
83.5 564.09 81.8 564.09 line
82.1 564.29 0 0 0 4 (last) text
83.5 560.79 81.8 560.79 line
82.1 560.99 0 0 0 7 (inValid) text
123.2 564.09 124.8 564.09 line
124.5 564.29 0 2 0 12 (output_ready) text
123.2 560.79 124.8 560.79 line
124.5 560.99 0 2 0 9 (start_out) text
123.2 557.49 124.8 557.49 line
124.5 557.69 0 2 0 8 (last_out) text
0.4 setlinewidth
83.5 573.99 81.8 573.99 line
82.1 574.19 0 0 0 21 (data_window_in[255:0]) text
123.2 577.29 124.8 577.29 line
124.5 577.49 0 2 0 19 (literals_out[127:0]) text
123.2 573.99 124.8 573.99 line
124.5 574.19 0 2 0 18 (len_raw_out[127:0]) text
123.2 570.69 124.8 570.69 line
124.5 570.89 0 2 0 19 (dist_raw_out[255:0]) text
123.2 567.39 124.8 567.39 line
124.5 567.59 0 2 0 19 (valid_raw_out[15:0]) text
0.000 0.000 0.000 setrgbcolor
207.6 552.49 34.7 30.8 rectfill
0.000 1.000 1.000 setrgbcolor
0.1 setlinewidth
207.6 552.49 34.7 30.8 rectstroke
1.98557 textsize
225 583.59 0 1 0 19 (match_selection_UUT) text
225 552.19 0 1 2 15 (match_selection) text
1.000 1.000 1.000 setrgbcolor
205.9 580.59 207.6 580.59 line
1.65464 textsize
207.3 580.79 0 2 0 4 (clk=) text
205.9 570.69 207.6 570.69 line
207.3 570.89 0 2 0 4 (rst=) text
205.9 564.09 207.6 564.09 line
207.3 564.29 0 2 0 21 (hash_match_start_out=) text
205.9 557.49 207.6 557.49 line
207.3 557.59 0 2 0 20 (hash_match_last_out=) text
205.9 554.09 207.6 554.09 line
207.3 554.29 0 2 0 24 (hash_match_output_ready=) text
244 567.39 242.3 567.39 line
242.7 567.59 0 0 0 26 (match_selection_ready_out=) text
244 564.09 242.3 564.09 line
242.7 564.29 0 0 0 26 (match_selection_start_out=) text
244 560.79 242.3 560.79 line
242.7 560.99 0 0 0 25 (match_selection_last_out=) text
0.4 setlinewidth
205.9 577.29 207.6 577.29 line
207.3 577.49 0 2 0 31 (hash_match_literals_out[127:0]=) text
205.9 573.99 207.6 573.99 line
207.3 574.19 0 2 0 30 (hash_match_len_raw_out[127:0]=) text
205.9 567.39 207.6 567.39 line
207.3 567.59 0 2 0 31 (hash_match_dist_raw_out[255:0]=) text
205.9 560.79 207.6 560.79 line
207.3 560.99 0 2 0 31 (hash_match_valid_raw_out[15:0]=) text
244 577.29 242.3 577.29 line
242.7 577.49 0 0 0 34 (match_selection_larray_out[127:0]=) text
244 573.99 242.3 573.99 line
242.7 574.19 0 0 0 34 (match_selection_darray_out[255:0]=) text
244 570.69 242.3 570.69 line
242.7 570.89 0 0 0 32 (match_selection_valid_out[15:0]=) text
0.1 setlinewidth
0.000 1.000 1.000 setrgbcolor
209.2 580.59 207.6 580.59 line
207.9 580.79 0 0 0 3 (clk) text
209.2 570.69 207.6 570.69 line
207.9 570.89 0 0 0 5 (reset) text
209.2 564.09 207.6 564.09 line
207.9 564.29 0 0 0 5 (start) text
209.2 557.49 207.6 557.49 line
207.9 557.59 0 0 0 4 (last) text
209.2 554.09 207.6 554.09 line
207.9 554.29 0 0 0 2 (en) text
240.6 567.39 242.3 567.39 line
242 567.59 0 2 0 9 (ready_out) text
240.6 564.09 242.3 564.09 line
242 564.29 0 2 0 9 (start_out) text
240.6 560.79 242.3 560.79 line
242 560.99 0 2 0 8 (last_out) text
0.4 setlinewidth
209.2 577.29 207.6 577.29 line
207.9 577.49 0 0 0 15 (literals[127:0]) text
209.2 573.99 207.6 573.99 line
207.9 574.19 0 0 0 14 (len_raw[127:0]) text
209.2 567.39 207.6 567.39 line
207.9 567.59 0 0 0 15 (dist_raw[255:0]) text
209.2 560.79 207.6 560.79 line
207.9 560.99 0 0 0 15 (valid_raw[15:0]) text
240.6 577.29 242.3 577.29 line
242 577.49 0 2 0 17 (larray_out[127:0]) text
240.6 573.99 242.3 573.99 line
242 574.19 0 2 0 17 (darray_out[255:0]) text
240.6 570.69 242.3 570.69 line
242 570.89 0 2 0 15 (valid_out[15:0]) text
0.000 0.000 0.000 setrgbcolor
321.7 555.79 34.7 27.5 rectfill
0.000 1.000 1.000 setrgbcolor
0.1 setlinewidth
321.7 555.79 34.7 27.5 rectstroke
1.98557 textsize
339.1 583.59 0 1 0 17 (pack_out_data_UUT) text
339.1 555.49 0 1 2 13 (pack_out_data) text
1.000 1.000 1.000 setrgbcolor
320.1 577.29 321.7 577.29 line
1.65464 textsize
321.4 577.49 0 2 0 4 (clk=) text
320.1 570.69 321.7 570.69 line
321.4 570.89 0 2 0 4 (rst=) text
320.1 564.09 321.7 564.09 line
321.4 564.29 0 2 0 26 (match_selection_start_out=) text
320.1 560.79 321.7 560.79 line
321.4 560.99 0 2 0 25 (match_selection_last_out=) text
320.1 557.49 321.7 557.49 line
321.4 557.59 0 2 0 26 (match_selection_ready_out=) text
358.1 567.39 356.4 567.39 line
356.8 567.59 0 0 0 15 (pack_out_ready=) text
358.1 564.09 356.4 564.09 line
356.8 564.29 0 0 0 14 (pack_out_last=) text
0.4 setlinewidth
320.1 580.59 321.7 580.59 line
321.4 580.79 0 2 0 34 (match_selection_larray_out[127:0]=) text
320.1 573.99 321.7 573.99 line
321.4 574.19 0 2 0 34 (match_selection_darray_out[255:0]=) text
320.1 567.39 321.7 567.39 line
321.4 567.59 0 2 0 32 (match_selection_valid_out[15:0]=) text
358.1 573.99 356.4 573.99 line
356.8 574.19 0 0 0 21 (pack_out_data[255:0]=) text
358.1 570.69 356.4 570.69 line
356.8 570.89 0 0 0 18 (pack_out_len[7:0]=) text
0.1 setlinewidth
0.000 1.000 1.000 setrgbcolor
323.4 577.29 321.7 577.29 line
322 577.49 0 0 0 3 (clk) text
323.4 570.69 321.7 570.69 line
322 570.89 0 0 0 5 (reset) text
323.4 564.09 321.7 564.09 line
322 564.29 0 0 0 5 (start) text
323.4 560.79 321.7 560.79 line
322 560.99 0 0 0 4 (last) text
323.4 557.49 321.7 557.49 line
322 557.59 0 0 0 2 (en) text
354.8 567.39 356.4 567.39 line
356.1 567.59 0 2 0 9 (out_ready) text
354.8 564.09 356.4 564.09 line
356.1 564.29 0 2 0 8 (out_last) text
0.4 setlinewidth
323.4 580.59 321.7 580.59 line
322 580.79 0 0 0 16 (larray_in[127:0]) text
323.4 573.99 321.7 573.99 line
322 574.19 0 0 0 16 (darray_in[255:0]) text
323.4 567.39 321.7 567.39 line
322 567.59 0 0 0 14 (valid_in[15:0]) text
354.8 573.99 356.4 573.99 line
356.1 574.19 0 2 0 15 (out_data[255:0]) text
354.8 570.69 356.4 570.69 line
356.1 570.89 0 2 0 12 (out_len[7:0]) text
0.000 0.000 0.000 setrgbcolor
528.6 552.49 16.5 10.9 rectfill
0.000 1.000 1.000 setrgbcolor
0.1 setlinewidth
528.6 552.49 16.5 10.9 rectstroke
1.98557 textsize
536.9 563.69 0 1 0 19 (pack_out_last_s1_i0) text
536.9 552.09 0 1 2 26 (register_compression_reset) text
1.000 1.000 1.000 setrgbcolor
526.9 560.79 528.6 560.79 line
1.65464 textsize
528.3 560.89 0 2 0 14 (pack_out_last=) text
526.9 557.49 528.6 557.49 line
528.3 557.59 0 2 0 4 (clk=) text
526.9 554.09 528.6 554.09 line
528.3 554.29 0 2 0 4 (rst=) text
546.8 557.49 545.1 557.49 line
545.5 557.59 0 0 0 17 (pack_out_last_s1=) text
0.000 1.000 1.000 setrgbcolor
530.2 560.79 528.6 560.79 line
528.9 560.89 0 0 0 6 (d[0:0]) text
530.2 557.49 528.6 557.49 line
528.9 557.59 0 0 0 3 (clk) text
530.2 554.09 528.6 554.09 line
528.9 554.29 0 0 0 5 (reset) text
543.4 557.49 545.1 557.49 line
544.8 557.59 0 2 0 6 (q[0:0]) text
0.000 0.000 0.000 setrgbcolor
528.6 502.89 24.8 17.5 rectfill
0.000 1.000 1.000 setrgbcolor
528.6 502.89 24.8 17.5 rectstroke
1.98557 textsize
541 520.69 0 1 0 21 (shift_reg_512bits_UUT) text
541 502.49 0 1 2 17 (shift_reg_512bits) text
1.000 1.000 1.000 setrgbcolor
526.9 517.69 528.6 517.69 line
1.65464 textsize
528.3 517.89 0 2 0 4 (clk=) text
526.9 511.09 528.6 511.09 line
528.3 511.29 0 2 0 4 (rst=) text
526.9 504.49 528.6 504.49 line
528.3 504.69 0 2 0 25 (barrel_shifter_data_full=) text
0.4 setlinewidth
526.9 514.39 528.6 514.39 line
528.3 514.59 0 2 0 11 (state[2:0]=) text
526.9 507.79 528.6 507.79 line
528.3 507.99 0 2 0 36 (barrel_shifter_data_to_write[255:0]=) text
555 511.09 553.4 511.09 line
553.8 511.29 0 0 0 20 (out_data_op2[511:0]=) text
0.1 setlinewidth
0.000 1.000 1.000 setrgbcolor
530.2 517.69 528.6 517.69 line
528.9 517.89 0 0 0 3 (clk) text
530.2 511.09 528.6 511.09 line
528.9 511.29 0 0 0 5 (reset) text
530.2 504.49 528.6 504.49 line
528.9 504.69 0 0 0 6 (enable) text
0.4 setlinewidth
530.2 514.39 528.6 514.39 line
528.9 514.59 0 0 0 10 (state[2:0]) text
530.2 507.79 528.6 507.79 line
528.9 507.99 0 0 0 14 (data_in[255:0]) text
551.7 511.09 553.4 511.09 line
553.1 511.29 0 2 0 15 (data_out[511:0]) text
0.400 0.400 0.400 setrgbcolor
526.9 514.39 newpath moveto
493.8 514.39 lineto
493.8 524.39 lineto
594.7 524.39 lineto
stroke
594.3 523.99 0.8 0.8 rectfill
604.7 552.49 newpath moveto
594.7 552.49 lineto
594.7 517.69 lineto
728.8 517.69 lineto
728.8 529.29 lineto
722.1 529.29 lineto
stroke
728.8 521.09 750.3 521.09 line
728.4 520.69 0.8 0.8 rectfill
0.1 setlinewidth
526.9 514.39 newpath moveto
493.8 514.39 lineto
493.8 524.39 lineto
594.7 524.39 lineto
stroke
604.7 552.49 newpath moveto
594.7 552.49 lineto
594.7 517.69 lineto
728.8 517.69 lineto
728.8 529.29 lineto
722.1 529.29 lineto
stroke
728.8 521.09 750.3 521.09 line
444.2 567.39 newpath moveto
480.6 567.39 lineto
480.6 504.49 lineto
526.9 504.49 lineto
stroke
480.6 567.39 newpath moveto
594.7 567.39 lineto
594.7 565.69 lineto
604.7 565.69 lineto
stroke
480.4 567.09 0.5 0.5 rectfill
0.4 setlinewidth
0.549 0.549 0.549 setrgbcolor
444.2 570.69 479.7 570.69 line
0.000 0.820 0.820 setrgbcolor
479.7 570.69 480.6 571.49 line
0.400 0.400 0.400 setrgbcolor
480.6 571.49 newpath moveto
480.6 573.99 lineto
591.4 573.99 lineto
591.4 539.29 lineto
604.7 539.29 lineto
stroke
0.000 0.820 0.820 setrgbcolor
591.4 559.89 592.3 559.09 line
0.549 0.549 0.549 setrgbcolor
592.3 559.09 604.7 559.09 line
0.2 setlinewidth
444.2 570.69 479.7 570.69 line
0.1 setlinewidth
0.000 0.820 0.820 setrgbcolor
479.7 570.69 480.6 571.49 line
0.400 0.400 0.400 setrgbcolor
480.6 571.49 newpath moveto
480.6 573.99 lineto
591.4 573.99 lineto
591.4 539.29 lineto
604.7 539.29 lineto
stroke
0.000 0.820 0.820 setrgbcolor
591.4 559.89 592.3 559.09 line
0.2 setlinewidth
0.549 0.549 0.549 setrgbcolor
592.3 559.09 604.7 559.09 line
0.4 setlinewidth
444.2 570.69 483.1 570.69 line
0.000 0.820 0.820 setrgbcolor
483.1 570.69 483.9 570.69 line
0.400 0.400 0.400 setrgbcolor
483.9 570.69 newpath moveto
598.1 570.69 lineto
598.1 559.89 lineto
stroke
0.000 0.820 0.820 setrgbcolor
598.1 559.89 598.9 559.09 line
0.549 0.549 0.549 setrgbcolor
598.9 559.09 604.7 559.09 line
0.2 setlinewidth
444.2 570.69 483.1 570.69 line
0.1 setlinewidth
0.000 0.820 0.820 setrgbcolor
483.1 570.69 483.9 570.69 line
0.400 0.400 0.400 setrgbcolor
483.9 570.69 newpath moveto
598.1 570.69 lineto
598.1 559.89 lineto
stroke
0.000 0.820 0.820 setrgbcolor
598.1 559.89 598.9 559.09 line
0.2 setlinewidth
0.549 0.549 0.549 setrgbcolor
598.9 559.09 604.7 559.09 line
0.4 setlinewidth
0.400 0.400 0.400 setrgbcolor
444.2 573.99 newpath moveto
477.3 573.99 lineto
477.3 507.79 lineto
526.9 507.79 lineto
stroke
477.3 547.49 newpath moveto
588.1 547.49 lineto
588.1 549.19 lineto
604.7 549.19 lineto
stroke
477.3 540.89 526.9 540.89 line
476.9 547.09 0.8 0.8 rectfill
476.9 540.49 0.8 0.8 rectfill
0.1 setlinewidth
444.2 573.99 newpath moveto
477.3 573.99 lineto
477.3 507.79 lineto
526.9 507.79 lineto
stroke
477.3 547.49 newpath moveto
588.1 547.49 lineto
588.1 549.19 lineto
604.7 549.19 lineto
stroke
477.3 540.89 526.9 540.89 line
0.4 setlinewidth
551.7 540.89 newpath moveto
588.1 540.89 lineto
588.1 542.59 lineto
604.7 542.59 lineto
stroke
0.1 setlinewidth
551.7 540.89 newpath moveto
588.1 540.89 lineto
588.1 542.59 lineto
604.7 542.59 lineto
stroke
80.1 577.29 newpath moveto
53.7 577.29 lineto
53.7 587.19 lineto
174.5 587.19 lineto
174.5 580.59 lineto
205.9 580.59 lineto
stroke
174.5 587.19 newpath moveto
280.4 587.19 lineto
280.4 550.79 lineto
379.6 550.79 lineto
379.6 580.59 lineto
407.8 580.59 lineto
stroke
379.6 554.09 487.2 554.09 line
487.2 537.59 526.9 537.59 line
487.2 530.99 newpath moveto
672.5 530.99 lineto
672.5 532.59 lineto
689.1 532.59 lineto
stroke
32.2 585.59 53.7 585.59 line
53.5 585.29 0.5 0.5 rectfill
174.3 586.89 0.5 0.5 rectfill
280.4 577.29 320.1 577.29 line
280.2 576.99 0.5 0.5 rectfill
379.4 553.79 0.5 0.5 rectfill
526.9 557.49 newpath moveto
487.2 557.49 lineto
487.2 517.69 lineto
526.9 517.69 lineto
stroke
487 553.79 0.5 0.5 rectfill
487 537.29 0.5 0.5 rectfill
487 530.69 0.5 0.5 rectfill
0.4 setlinewidth
32.2 573.99 80.1 573.99 line
0.1 setlinewidth
32.2 573.99 80.1 573.99 line
0.4 setlinewidth
126.5 570.69 newpath moveto
167.8 570.69 lineto
167.8 567.39 lineto
205.9 567.39 lineto
stroke
0.1 setlinewidth
126.5 570.69 newpath moveto
167.8 570.69 lineto
167.8 567.39 lineto
205.9 567.39 lineto
stroke
126.5 557.49 205.9 557.49 line
0.4 setlinewidth
126.5 573.99 205.9 573.99 line
0.1 setlinewidth
126.5 573.99 205.9 573.99 line
0.4 setlinewidth
126.5 577.29 205.9 577.29 line
0.1 setlinewidth
126.5 577.29 205.9 577.29 line
126.5 564.09 newpath moveto
157.9 564.09 lineto
157.9 554.09 lineto
205.9 554.09 lineto
stroke
126.5 560.79 newpath moveto
161.2 560.79 lineto
161.2 564.09 lineto
205.9 564.09 lineto
stroke
0.4 setlinewidth
126.5 567.39 newpath moveto
164.5 567.39 lineto
164.5 560.79 lineto
205.9 560.79 lineto
stroke
0.1 setlinewidth
126.5 567.39 newpath moveto
164.5 567.39 lineto
164.5 560.79 lineto
205.9 560.79 lineto
stroke
32.2 560.79 80.1 560.79 line
32.2 564.09 80.1 564.09 line
0.4 setlinewidth
244 573.99 320.1 573.99 line
0.1 setlinewidth
244 573.99 320.1 573.99 line
0.4 setlinewidth
244 577.29 newpath moveto
277.1 577.29 lineto
277.1 580.59 lineto
320.1 580.59 lineto
stroke
0.1 setlinewidth
244 577.29 newpath moveto
277.1 577.29 lineto
277.1 580.59 lineto
320.1 580.59 lineto
stroke
244 560.79 320.1 560.79 line
244 567.39 newpath moveto
277.1 567.39 lineto
277.1 557.49 lineto
320.1 557.49 lineto
stroke
244 564.09 320.1 564.09 line
0.4 setlinewidth
244 570.69 newpath moveto
283.7 570.69 lineto
283.7 567.39 lineto
320.1 567.39 lineto
stroke
0.1 setlinewidth
244 570.69 newpath moveto
283.7 570.69 lineto
283.7 567.39 lineto
320.1 567.39 lineto
stroke
0.4 setlinewidth
669.2 544.19 newpath moveto
679.1 544.19 lineto
679.1 525.99 lineto
689.1 525.99 lineto
stroke
0.1 setlinewidth
669.2 544.19 newpath moveto
679.1 544.19 lineto
679.1 525.99 lineto
689.1 525.99 lineto
stroke
0.4 setlinewidth
793.3 517.69 809.8 517.69 line
0.1 setlinewidth
793.3 517.69 809.8 517.69 line
0.4 setlinewidth
669.2 550.79 newpath moveto
682.4 550.79 lineto
682.4 521.09 lineto
725.5 521.09 lineto
725.5 519.39 lineto
747 519.39 lineto
747 517.69 lineto
750.3 517.69 lineto
stroke
0.1 setlinewidth
669.2 550.79 newpath moveto
682.4 550.79 lineto
682.4 521.09 lineto
725.5 521.09 lineto
725.5 519.39 lineto
747 519.39 lineto
747 517.69 lineto
750.3 517.69 lineto
stroke
0.4 setlinewidth
0.549 0.549 0.549 setrgbcolor
555 511.09 597.2 511.09 line
0.000 0.820 0.820 setrgbcolor
597.2 511.09 598.1 511.89 line
0.400 0.400 0.400 setrgbcolor
598.1 511.89 598.1 544.99 line
0.000 0.820 0.820 setrgbcolor
598.1 544.99 598.9 545.89 line
0.549 0.549 0.549 setrgbcolor
598.9 545.89 604.7 545.89 line
0.400 0.400 0.400 setrgbcolor
598.1 514.39 725.5 514.39 line
0.000 0.820 0.820 setrgbcolor
725.5 514.39 726.3 514.39 line
0.549 0.549 0.549 setrgbcolor
726.3 514.39 750.3 514.39 line
0.400 0.400 0.400 setrgbcolor
598.1 535.89 604.7 535.89 line
597.7 513.99 0.8 0.8 rectfill
597.7 535.49 0.8 0.8 rectfill
0.2 setlinewidth
0.549 0.549 0.549 setrgbcolor
555 511.09 597.2 511.09 line
0.1 setlinewidth
0.000 0.820 0.820 setrgbcolor
597.2 511.09 598.1 511.89 line
0.400 0.400 0.400 setrgbcolor
598.1 511.89 598.1 544.99 line
0.000 0.820 0.820 setrgbcolor
598.1 544.99 598.9 545.89 line
0.2 setlinewidth
0.549 0.549 0.549 setrgbcolor
598.9 545.89 604.7 545.89 line
0.1 setlinewidth
0.400 0.400 0.400 setrgbcolor
598.1 514.39 725.5 514.39 line
0.000 0.820 0.820 setrgbcolor
725.5 514.39 726.3 514.39 line
0.2 setlinewidth
0.549 0.549 0.549 setrgbcolor
726.3 514.39 750.3 514.39 line
0.1 setlinewidth
0.400 0.400 0.400 setrgbcolor
598.1 535.89 604.7 535.89 line
0.4 setlinewidth
0.549 0.549 0.549 setrgbcolor
604.7 545.89 602.2 545.89 line
0.000 0.820 0.820 setrgbcolor
602.2 545.89 601.4 544.99 line
0.400 0.400 0.400 setrgbcolor
601.4 544.99 newpath moveto
601.4 511.09 lineto
728.8 511.09 lineto
728.8 513.59 lineto
stroke
0.000 0.820 0.820 setrgbcolor
728.8 513.59 729.6 514.39 line
0.549 0.549 0.549 setrgbcolor
729.6 514.39 750.3 514.39 line
555 511.09 600.5 511.09 line
0.000 0.820 0.820 setrgbcolor
600.5 511.09 601.4 511.89 line
0.2 setlinewidth
0.549 0.549 0.549 setrgbcolor
604.7 545.89 602.2 545.89 line
0.1 setlinewidth
0.000 0.820 0.820 setrgbcolor
602.2 545.89 601.4 544.99 line
0.400 0.400 0.400 setrgbcolor
601.4 544.99 newpath moveto
601.4 511.09 lineto
728.8 511.09 lineto
728.8 513.59 lineto
stroke
0.000 0.820 0.820 setrgbcolor
728.8 513.59 729.6 514.39 line
0.2 setlinewidth
0.549 0.549 0.549 setrgbcolor
729.6 514.39 750.3 514.39 line
555 511.09 600.5 511.09 line
0.1 setlinewidth
0.000 0.820 0.820 setrgbcolor
600.5 511.09 601.4 511.89 line
0.400 0.400 0.400 setrgbcolor
758.6 557.49 809.8 557.49 line
0.4 setlinewidth
758.6 547.49 809.8 547.49 line
0.1 setlinewidth
758.6 547.49 809.8 547.49 line
0.4 setlinewidth
669.2 547.49 750.3 547.49 line
0.1 setlinewidth
669.2 547.49 750.3 547.49 line
669.2 557.49 750.3 557.49 line
758.6 552.49 809.8 552.49 line
669.2 554.09 newpath moveto
685.7 554.09 lineto
685.7 552.49 lineto
750.3 552.49 lineto
stroke
0.4 setlinewidth
358.1 573.99 newpath moveto
382.9 573.99 lineto
382.9 577.29 lineto
407.8 577.29 lineto
stroke
0.1 setlinewidth
358.1 573.99 newpath moveto
382.9 573.99 lineto
382.9 577.29 lineto
407.8 577.29 lineto
stroke
358.1 564.09 newpath moveto
382.9 564.09 lineto
382.9 557.49 lineto
483.9 557.49 lineto
483.9 560.79 lineto
526.9 560.79 lineto
stroke
382.9 564.09 407.8 564.09 line
382.7 563.79 0.5 0.5 rectfill
546.8 557.49 newpath moveto
588.1 557.49 lineto
588.1 562.39 lineto
604.7 562.39 lineto
stroke
0.4 setlinewidth
358.1 570.69 407.8 570.69 line
0.1 setlinewidth
358.1 570.69 407.8 570.69 line
358.1 567.39 407.8 567.39 line
80.1 570.69 newpath moveto
57 570.69 lineto
57 583.89 lineto
171.2 583.89 lineto
171.2 547.49 lineto
287 547.49 lineto
stroke
286.8 547.19 0.5 0.5 rectfill
32.2 570.69 57 570.69 line
56.8 570.39 0.5 0.5 rectfill
171.2 570.69 205.9 570.69 line
171 570.39 0.5 0.5 rectfill
320.1 570.69 newpath moveto
287 570.69 lineto
287 547.49 lineto
386.3 547.49 lineto
386.3 573.99 lineto
407.8 573.99 lineto
stroke
386.3 550.79 490.5 550.79 line
490.5 527.69 newpath moveto
675.8 527.69 lineto
675.8 529.29 lineto
689.1 529.29 lineto
stroke
386.1 550.49 0.5 0.5 rectfill
526.9 554.09 newpath moveto
490.5 554.09 lineto
490.5 511.09 lineto
526.9 511.09 lineto
stroke
490.3 550.49 0.5 0.5 rectfill
490.3 527.39 0.5 0.5 rectfill
32.2 567.39 80.1 567.39 line
0.4 setlinewidth
444.2 577.29 newpath moveto
601.4 577.29 lineto
601.4 555.79 lineto
604.7 555.79 lineto
stroke
0.1 setlinewidth
444.2 577.29 newpath moveto
601.4 577.29 lineto
601.4 555.79 lineto
604.7 555.79 lineto
stroke
restore
showpage
%%Trailer
end
%%Pages: 1
%%EOF
