%!PS-Adobe-3.0
%%Creator: Nlview
%%For: jschoenbohm
%%Title: root
%%BoundingBox: 28 28 568 814
%%CreationDate: 2020-10-06 16:08
%%Pages: (atend)
%%DocumentData: Clean7Bit
%%DocumentNeededResources: font Helvetica
%%EndComments

%%BeginProlog
50 dict begin
/line {
    newpath moveto lineto stroke
} bind def
/circle {
    newpath 2 div 0 360 arc stroke
} bind def
/filledcircle {
    newpath 2 div 0 360 arc fill
} bind def
/text {                                 % stack: x y rot jx jy len (str)
    gsave
    7 -2 roll moveto                    % stack: rot jx jy len (str)
    dup stringwidth pop /wid exch def   % string width --> wid
    5 -1 roll                           % stack: jx jy len (str) rot
    rotate
    4 2 roll                            % stack: len (str) jx jy
    Fdescent exch
    2 div Fdescent Fascent add mul sub  % desc - jy/2 * (asc+desc)
                                        % stack: len (str) jx ymove
    exch
    2 div wid mul neg                   % -jx/2 * wid
                                        % stack: len (str) ymove xmove
    exch rmoveto                        % stack: len (str)
    exch 0 exch                         % stack: (str) 0 len
    getinterval                         % stack: substr(str,0,len)
    show                                % stack:
    grestore
} bind def
/initfontfac {
    currentdict /Ffac known not {
        % Here we compute Ffac. Ffac is used below to resize the font
        % in a way that the font's ascent+descent/2 fits the required
        % text size. We compute Ffac only once, because the font F will
        % never change.
        %
        dup F exch scalefont setfont % stack sz font
        gsave
        newpath 0 0 moveto (XTgq) false charpath
        pathbbox                        % stack: sz l b r t
        grestore
        3 2 roll neg 2 div add          % fheight = ascent + descent/2
        3 1 roll pop pop                % stack: sz fheight
        div
        /Ffac exch def                  % Ffac = sz/fheight
    } if
} bind def
/textsize {
    Ffac mul F exch scalefont setfont
    gsave
    newpath
    0 0 moveto (XTgq) false charpath pathbbox
    /Fascent exch def			% top -> ascent
    pop
    /Fdescent exch neg 2 div def	% -bottom/2 -> descent
    pop
    grestore
} bind def
/linestyle {
				% stack: [dashdef] offs gwid
    dup 3 1 roll		%        [dashdef] gwid offs gwid
    mul [			%        [dashdef] gwid moffs [
    4 -2 roll exch		%        moffs [ gwid [dashdef]
    {exch dup 3 -1 roll mul exch} forall
    				%	 moffs [ a1 a2 a3 .. gwid
    pop ]			%	 moffs [a1 a2 a3..]
    exch			%	 [a1 a2 a3..] moffs
    setdash			% stack:
} bind def

% Define the array ISOLatin1Encoding (which specifies how characters are
% encoded for ISO-8859-1 fonts), if it isn't already present (Postscript
% level 2 is supposed to define it, but level 1 doesn't).
systemdict /ISOLatin1Encoding known not {
    /ISOLatin1Encoding [
	/space /space /space /space /space /space /space /space
	/space /space /space /space /space /space /space /space
	/space /space /space /space /space /space /space /space
	/space /space /space /space /space /space /space /space
	/space /exclam /quotedbl /numbersign /dollar /percent /ampersand
	    /quoteright
	/parenleft /parenright /asterisk /plus /comma /minus /period /slash
	/zero /one /two /three /four /five /six /seven
	/eight /nine /colon /semicolon /less /equal /greater /question
	/at /A /B /C /D /E /F /G
	/H /I /J /K /L /M /N /O
	/P /Q /R /S /T /U /V /W
	/X /Y /Z /bracketleft /backslash /bracketright /asciicircum
	/underscore /quoteleft /a /b /c /d /e /f /g
	/h /i /j /k /l /m /n /o
	/p /q /r /s /t /u /v /w
	/x /y /z /braceleft /bar /braceright /asciitilde /space
	/space /space /space /space /space /space /space /space
	/space /space /space /space /space /space /space /space
	/dotlessi /grave /acute /circumflex /tilde /macron /breve /dotaccent
	/dieresis /space /ring /cedilla /space /hungarumlaut /ogonek /caron
	/space /exclamdown /cent /sterling /currency /yen /brokenbar /section
	/dieresis /copyright /ordfeminine /guillemotleft /logicalnot /hyphen
	    /registered /macron
	/degree /plusminus /twosuperior /threesuperior /acute /mu /paragraph
	    /periodcentered
	/cedillar /onesuperior /ordmasculine /guillemotright /onequarter
	    /onehalf /threequarters /questiondown
	/Agrave /Aacute /Acircumflex /Atilde /Adieresis /Aring /AE /Ccedilla
	/Egrave /Eacute /Ecircumflex /Edieresis /Igrave /Iacute /Icircumflex
	    /Idieresis
	/Eth /Ntilde /Ograve /Oacute /Ocircumflex /Otilde /Odieresis
	    /multiply
	/Oslash /Ugrave /Uacute /Ucircumflex /Udieresis /Yacute /Thorn
	    /germandbls
	/agrave /aacute /acircumflex /atilde /adieresis /aring /ae /ccedilla
	/egrave /eacute /ecircumflex /edieresis /igrave /iacute /icircumflex
	    /idieresis
	/eth /ntilde /ograve /oacute /ocircumflex /otilde /odieresis /divide
	/oslash /ugrave /uacute /ucircumflex /udieresis /yacute /thorn
	    /ydieresis
    ] def
} if

% font ISOEncode font
% This procedure changes the encoding of a font from the default
% Postscript encoding to ISOLatin1. The body of this procedure comes
% from Section 5.6.1 of the Postscript book.
/ISOEncode {
    dup length dict begin
	{1 index /FID ne {def} {pop pop} ifelse} forall
	/Encoding ISOLatin1Encoding def
	currentdict
    end
    /Fname exch definefont
} bind def
%%EndProlog

%%BeginSetup
%%IncludeResource: font Helvetica
<< /PageSize [595 841] /Policies << /PageSize 3 >> >> setpagedevice
%%EndSetup

/DiagonalCross <<      % pattern prototype dictionary: XX
   /PatternType 1      % Tiling pattern
   /PaintType 2        % uncolored tiling pattern
   /TilingType 1
   /BBox [0 0 8 8]
   /XStep 8
   /YStep 8
   /PaintProc
     { pop
       1 setlinewidth
       [] 0 setdash
       newpath -1 3 moveto
       5 9 lineto
       stroke newpath -1 5 moveto
       5 -1 lineto
       stroke newpath 3 -1 moveto
       9 5 lineto
       stroke newpath 3 9 moveto
       9 3 lineto
       stroke
    } bind
>> def
/Cross <<              % pattern prototype dictionary: ++
   /PatternType 1      % Tiling pattern
   /PaintType 2        % uncolored tiling pattern
   /TilingType 1
   /BBox [0 0 8 8]
   /XStep 8
   /YStep 8
   /PaintProc
     { pop
       1 setlinewidth
       [] 0 setdash
       0 4 moveto
       8 4 lineto
       4 0 moveto
       4 8 lineto
       stroke
    } bind
>> def
/BackwardDiagonal <<   % pattern prototype dictionary: //
   /PatternType 1      % Tiling pattern
   /PaintType 2        % uncolored tiling pattern
   /TilingType 1
   /BBox [0 0 8 8]
   /XStep 8
   /YStep 8
   /PaintProc
     { pop
       1 setlinewidth
       [] 0 setdash
       newpath -1 3 moveto
       6 6 rlineto
       stroke newpath 3 -1 moveto
       6 6 rlineto
       stroke
    } bind
>> def
/ForwardDiagonal <<    % pattern prototype dictionary: \\
   /PatternType 1      % Tiling pattern
   /PaintType 2        % uncolored tiling pattern
   /TilingType 1
   /BBox [0 0 8 8]
   /XStep 8
   /YStep 8
   /PaintProc
     { pop
       1 setlinewidth
       [] 0 setdash
       newpath -1 5 moveto
       6 -6 rlineto
       stroke newpath 3 9 moveto
       6 -6 rlineto
       stroke
    } bind
>> def
/Vertical <<           % pattern prototype dictionary: ||
   /PatternType 1      % Tiling pattern
   /PaintType 2        % uncolored tiling pattern
   /TilingType 1
   /BBox [0 0 8 8]
   /XStep 8
   /YStep 8
   /PaintProc
     { pop
       1 setlinewidth
       [] 0 setdash
       4 0 moveto
       4 8 lineto
       stroke
    } bind
>> def
/Horizontal <<         % pattern prototype dictionary: ==
   /PatternType 1      % Tiling pattern
   /PaintType 2        % uncolored tiling pattern
   /TilingType 1
   /BBox [0 0 8 8]
   /XStep 8
   /YStep 8
   /PaintProc
     { pop
       1 setlinewidth
       [] 0 setdash
       0 4 moveto
       8 4 lineto
       stroke
    } bind
>> def
%%Page: 1 1
%%PageOrientation: Landscape
save
90 rotate
0 -841.89 translate
27.8 274.39 786.3 539.7 rectclip
/F /Helvetica findfont ISOEncode def
12 initfontfac
0 setlinecap 		% Butt caps (flat)
0 setlinejoin		% Miter joins
0 setgray		% Black color (mono mode)
0.4 setlinewidth
125.7 584.09 165.7 93 rectstroke
7.64549 textsize
208.5 678.39 0 1 0 14 (hash_match_UUT) text
208.5 582.79 0 1 2 10 (hash_match) text
119.3 666.89 125.7 666.89 line
6.37124 textsize
124.4 667.59 0 2 0 4 (clk=) text
119.3 641.39 125.7 641.39 line
124.4 642.09 0 2 0 4 (rst=) text
119.3 628.69 125.7 628.69 line
124.4 629.29 0 2 0 6 (start=) text
119.3 615.89 125.7 615.89 line
124.4 616.59 0 2 0 5 (last=) text
119.3 603.19 125.7 603.19 line
124.4 603.89 0 2 0 8 (inValid=) text
297.7 615.89 291.4 615.89 line
292.6 616.59 0 0 0 24 (hash_match_output_ready=) text
297.7 603.19 291.4 603.19 line
292.6 603.89 0 0 0 21 (hash_match_start_out=) text
297.7 590.49 291.4 590.49 line
292.6 591.09 0 0 0 20 (hash_match_last_out=) text
1.1 setlinewidth
119.3 654.19 125.7 654.19 line
124.4 654.79 0 2 0 22 (data_window_in[255:0]=) text
297.7 666.89 291.4 666.89 line
292.6 667.59 0 0 0 31 (hash_match_literals_out[127:0]=) text
297.7 654.19 291.4 654.19 line
292.6 654.79 0 0 0 30 (hash_match_len_raw_out[127:0]=) text
297.7 641.39 291.4 641.39 line
292.6 642.09 0 0 0 31 (hash_match_dist_raw_out[255:0]=) text
297.7 628.69 291.4 628.69 line
292.6 629.29 0 0 0 31 (hash_match_valid_raw_out[15:0]=) text
0.4 setlinewidth
132.1 666.89 125.7 666.89 line
127 667.59 0 0 0 3 (clk) text
132.1 641.39 125.7 641.39 line
127 642.09 0 0 0 3 (rst) text
132.1 628.69 125.7 628.69 line
127 629.29 0 0 0 5 (start) text
132.1 615.89 125.7 615.89 line
127 616.59 0 0 0 4 (last) text
132.1 603.19 125.7 603.19 line
127 603.89 0 0 0 7 (inValid) text
285 615.89 291.4 615.89 line
290.1 616.59 0 2 0 12 (output_ready) text
285 603.19 291.4 603.19 line
290.1 603.89 0 2 0 9 (start_out) text
285 590.49 291.4 590.49 line
290.1 591.09 0 2 0 8 (last_out) text
1.1 setlinewidth
132.1 654.19 125.7 654.19 line
127 654.79 0 0 0 21 (data_window_in[255:0]) text
285 666.89 291.4 666.89 line
290.1 667.59 0 2 0 19 (literals_out[127:0]) text
285 654.19 291.4 654.19 line
290.1 654.79 0 2 0 18 (len_raw_out[127:0]) text
285 641.39 291.4 641.39 line
290.1 642.09 0 2 0 19 (dist_raw_out[255:0]) text
285 628.69 291.4 628.69 line
290.1 629.29 0 2 0 19 (valid_raw_out[15:0]) text
restore
showpage
%%Trailer
end
%%Pages: 1
%%EOF
