%!PS-Adobe-3.0
%%Creator: Nlview
%%For: jschoenbohm
%%Title: root
%%BoundingBox: 28 28 568 814
%%CreationDate: 2020-10-07 11:23
%%Pages: (atend)
%%DocumentData: Clean7Bit
%%DocumentNeededResources: font Helvetica
%%EndComments

%%BeginProlog
50 dict begin
/line {
    newpath moveto lineto stroke
} bind def
/circle {
    newpath 2 div 0 360 arc stroke
} bind def
/filledcircle {
    newpath 2 div 0 360 arc fill
} bind def
/text {                                 % stack: x y rot jx jy len (str)
    gsave
    7 -2 roll moveto                    % stack: rot jx jy len (str)
    dup stringwidth pop /wid exch def   % string width --> wid
    5 -1 roll                           % stack: jx jy len (str) rot
    rotate
    4 2 roll                            % stack: len (str) jx jy
    Fdescent exch
    2 div Fdescent Fascent add mul sub  % desc - jy/2 * (asc+desc)
                                        % stack: len (str) jx ymove
    exch
    2 div wid mul neg                   % -jx/2 * wid
                                        % stack: len (str) ymove xmove
    exch rmoveto                        % stack: len (str)
    exch 0 exch                         % stack: (str) 0 len
    getinterval                         % stack: substr(str,0,len)
    show                                % stack:
    grestore
} bind def
/initfontfac {
    currentdict /Ffac known not {
        % Here we compute Ffac. Ffac is used below to resize the font
        % in a way that the font's ascent+descent/2 fits the required
        % text size. We compute Ffac only once, because the font F will
        % never change.
        %
        dup F exch scalefont setfont % stack sz font
        gsave
        newpath 0 0 moveto (XTgq) false charpath
        pathbbox                        % stack: sz l b r t
        grestore
        3 2 roll neg 2 div add          % fheight = ascent + descent/2
        3 1 roll pop pop                % stack: sz fheight
        div
        /Ffac exch def                  % Ffac = sz/fheight
    } if
} bind def
/textsize {
    Ffac mul F exch scalefont setfont
    gsave
    newpath
    0 0 moveto (XTgq) false charpath pathbbox
    /Fascent exch def			% top -> ascent
    pop
    /Fdescent exch neg 2 div def	% -bottom/2 -> descent
    pop
    grestore
} bind def
/linestyle {
				% stack: [dashdef] offs gwid
    dup 3 1 roll		%        [dashdef] gwid offs gwid
    mul [			%        [dashdef] gwid moffs [
    4 -2 roll exch		%        moffs [ gwid [dashdef]
    {exch dup 3 -1 roll mul exch} forall
    				%	 moffs [ a1 a2 a3 .. gwid
    pop ]			%	 moffs [a1 a2 a3..]
    exch			%	 [a1 a2 a3..] moffs
    setdash			% stack:
} bind def

% Define the array ISOLatin1Encoding (which specifies how characters are
% encoded for ISO-8859-1 fonts), if it isn't already present (Postscript
% level 2 is supposed to define it, but level 1 doesn't).
systemdict /ISOLatin1Encoding known not {
    /ISOLatin1Encoding [
	/space /space /space /space /space /space /space /space
	/space /space /space /space /space /space /space /space
	/space /space /space /space /space /space /space /space
	/space /space /space /space /space /space /space /space
	/space /exclam /quotedbl /numbersign /dollar /percent /ampersand
	    /quoteright
	/parenleft /parenright /asterisk /plus /comma /minus /period /slash
	/zero /one /two /three /four /five /six /seven
	/eight /nine /colon /semicolon /less /equal /greater /question
	/at /A /B /C /D /E /F /G
	/H /I /J /K /L /M /N /O
	/P /Q /R /S /T /U /V /W
	/X /Y /Z /bracketleft /backslash /bracketright /asciicircum
	/underscore /quoteleft /a /b /c /d /e /f /g
	/h /i /j /k /l /m /n /o
	/p /q /r /s /t /u /v /w
	/x /y /z /braceleft /bar /braceright /asciitilde /space
	/space /space /space /space /space /space /space /space
	/space /space /space /space /space /space /space /space
	/dotlessi /grave /acute /circumflex /tilde /macron /breve /dotaccent
	/dieresis /space /ring /cedilla /space /hungarumlaut /ogonek /caron
	/space /exclamdown /cent /sterling /currency /yen /brokenbar /section
	/dieresis /copyright /ordfeminine /guillemotleft /logicalnot /hyphen
	    /registered /macron
	/degree /plusminus /twosuperior /threesuperior /acute /mu /paragraph
	    /periodcentered
	/cedillar /onesuperior /ordmasculine /guillemotright /onequarter
	    /onehalf /threequarters /questiondown
	/Agrave /Aacute /Acircumflex /Atilde /Adieresis /Aring /AE /Ccedilla
	/Egrave /Eacute /Ecircumflex /Edieresis /Igrave /Iacute /Icircumflex
	    /Idieresis
	/Eth /Ntilde /Ograve /Oacute /Ocircumflex /Otilde /Odieresis
	    /multiply
	/Oslash /Ugrave /Uacute /Ucircumflex /Udieresis /Yacute /Thorn
	    /germandbls
	/agrave /aacute /acircumflex /atilde /adieresis /aring /ae /ccedilla
	/egrave /eacute /ecircumflex /edieresis /igrave /iacute /icircumflex
	    /idieresis
	/eth /ntilde /ograve /oacute /ocircumflex /otilde /odieresis /divide
	/oslash /ugrave /uacute /ucircumflex /udieresis /yacute /thorn
	    /ydieresis
    ] def
} if

% font ISOEncode font
% This procedure changes the encoding of a font from the default
% Postscript encoding to ISOLatin1. The body of this procedure comes
% from Section 5.6.1 of the Postscript book.
/ISOEncode {
    dup length dict begin
	{1 index /FID ne {def} {pop pop} ifelse} forall
	/Encoding ISOLatin1Encoding def
	currentdict
    end
    /Fname exch definefont
} bind def
%%EndProlog

%%BeginSetup
%%IncludeResource: font Helvetica
<< /PageSize [595 841] /Policies << /PageSize 3 >> >> setpagedevice
%%EndSetup

/DiagonalCross <<      % pattern prototype dictionary: XX
   /PatternType 1      % Tiling pattern
   /PaintType 2        % uncolored tiling pattern
   /TilingType 1
   /BBox [0 0 8 8]
   /XStep 8
   /YStep 8
   /PaintProc
     { pop
       1 setlinewidth
       [] 0 setdash
       newpath -1 3 moveto
       5 9 lineto
       stroke newpath -1 5 moveto
       5 -1 lineto
       stroke newpath 3 -1 moveto
       9 5 lineto
       stroke newpath 3 9 moveto
       9 3 lineto
       stroke
    } bind
>> def
/Cross <<              % pattern prototype dictionary: ++
   /PatternType 1      % Tiling pattern
   /PaintType 2        % uncolored tiling pattern
   /TilingType 1
   /BBox [0 0 8 8]
   /XStep 8
   /YStep 8
   /PaintProc
     { pop
       1 setlinewidth
       [] 0 setdash
       0 4 moveto
       8 4 lineto
       4 0 moveto
       4 8 lineto
       stroke
    } bind
>> def
/BackwardDiagonal <<   % pattern prototype dictionary: //
   /PatternType 1      % Tiling pattern
   /PaintType 2        % uncolored tiling pattern
   /TilingType 1
   /BBox [0 0 8 8]
   /XStep 8
   /YStep 8
   /PaintProc
     { pop
       1 setlinewidth
       [] 0 setdash
       newpath -1 3 moveto
       6 6 rlineto
       stroke newpath 3 -1 moveto
       6 6 rlineto
       stroke
    } bind
>> def
/ForwardDiagonal <<    % pattern prototype dictionary: \\
   /PatternType 1      % Tiling pattern
   /PaintType 2        % uncolored tiling pattern
   /TilingType 1
   /BBox [0 0 8 8]
   /XStep 8
   /YStep 8
   /PaintProc
     { pop
       1 setlinewidth
       [] 0 setdash
       newpath -1 5 moveto
       6 -6 rlineto
       stroke newpath 3 9 moveto
       6 -6 rlineto
       stroke
    } bind
>> def
/Vertical <<           % pattern prototype dictionary: ||
   /PatternType 1      % Tiling pattern
   /PaintType 2        % uncolored tiling pattern
   /TilingType 1
   /BBox [0 0 8 8]
   /XStep 8
   /YStep 8
   /PaintProc
     { pop
       1 setlinewidth
       [] 0 setdash
       4 0 moveto
       4 8 lineto
       stroke
    } bind
>> def
/Horizontal <<         % pattern prototype dictionary: ==
   /PatternType 1      % Tiling pattern
   /PaintType 2        % uncolored tiling pattern
   /TilingType 1
   /BBox [0 0 8 8]
   /XStep 8
   /YStep 8
   /PaintProc
     { pop
       1 setlinewidth
       [] 0 setdash
       0 4 moveto
       8 4 lineto
       stroke
    } bind
>> def
%%Page: 1 1
%%PageOrientation: Landscape
save
90 rotate
0 -841.89 translate
27.8 274.39 786.3 539.7 rectclip
/F /Helvetica findfont ISOEncode def
12 initfontfac
0 setlinecap 		% Butt caps (flat)
0 setlinejoin		% Miter joins
[/Pattern /DeviceRGB] setcolorspace
0.000 0.000 0.000 setrgbcolor
28.9 275.29 784.2 537.8 rectfill
116.4 579.49 newpath moveto
724.7 579.49 lineto
724.7 579.49 lineto
725 579.49 lineto
725.4 579.39 lineto
725.6 579.29 lineto
725.9 579.19 lineto
726.1 578.99 lineto
726.3 578.79 lineto
726.5 578.59 lineto
726.7 578.29 lineto
726.8 577.99 lineto
726.8 577.69 lineto
726.8 577.39 lineto
726.8 577.39 lineto
726.8 511.19 lineto
726.8 511.19 lineto
726.8 510.89 lineto
726.7 510.59 lineto
726.7 510.39 lineto
726.5 510.09 lineto
726.3 509.79 lineto
726.1 509.59 lineto
725.9 509.49 lineto
725.6 509.29 lineto
725.3 509.19 lineto
725 509.09 lineto
724.7 509.09 lineto
724.7 509.09 lineto
116.4 509.09 lineto
116.4 509.09 lineto
116.1 509.09 lineto
115.8 509.19 lineto
115.5 509.29 lineto
115.3 509.39 lineto
115 509.59 lineto
114.8 509.79 lineto
114.6 510.09 lineto
114.5 510.29 lineto
114.4 510.59 lineto
114.3 510.89 lineto
114.3 511.19 lineto
114.3 511.19 lineto
114.3 577.39 lineto
114.3 577.39 lineto
114.3 577.69 lineto
114.4 577.99 lineto
114.5 578.29 lineto
114.6 578.49 lineto
114.8 578.79 lineto
115 578.99 lineto
115.3 579.19 lineto
115.5 579.29 lineto
115.8 579.39 lineto
116.1 579.49 lineto
closepath
fill
0.2 setlinewidth
0.000 1.000 1.000 setrgbcolor
116.4 579.49 724.7 579.49 line
724.786 577.476 2.01562 92 -2 newpath arcn stroke
726.8 577.39 726.8 511.19 line
724.756 511.134 2.0447 2 -92 newpath arcn stroke
724.7 509.09 116.4 509.09 line
116.372 511.162 2.07192 271 179 newpath arcn stroke
114.3 511.19 114.3 577.39 line
116.355 577.435 2.05568 181 89 newpath arcn stroke
3.12782 textsize
420.6 579.99 0 1 0 21 (shift_reg_512bits_UUT) text
420.6 508.59 0 1 2 17 (shift_reg_512bits) text
1.000 0.000 0.000 setrgbcolor
111.7 569.09 114.3 569.09 line
2.60651 textsize
113.8 569.59 0 2 0 5 (clk=x) text
111.7 511.69 114.3 511.69 line
113.8 512.29 0 2 0 5 (rst=x) text
111.7 535.19 114.3 535.19 line
113.8 535.69 0 2 0 26 (barrel_shifter_data_full=x) text
0.5 setlinewidth
111.7 574.29 114.3 574.29 line
113.8 574.79 0 2 0 12 (state[2:0]=x) text
111.7 553.39 114.3 553.39 line
113.8 553.99 0 2 0 71 (barrel_shifter_data_to_write[255:0]=xxxxxxxxxxxxxxxxxxxxxxxxxxxxxxxx...) text
729.5 540.39 726.8 540.39 line
727.4 540.89 0 0 0 55 (out_data_op2[511:0]=xxxxxxxxxxxxxxxxxxxxxxxxxxxxxxxx...) text
0.2 setlinewidth
0.000 1.000 1.000 setrgbcolor
117 569.09 114.3 569.09 line
114.8 569.59 0 0 0 3 (clk) text
117 511.69 114.3 511.69 line
114.8 512.29 0 0 0 5 (reset) text
117 535.19 114.3 535.19 line
114.8 535.69 0 0 0 6 (enable) text
0.5 setlinewidth
117 574.29 114.3 574.29 line
114.8 574.79 0 0 0 10 (state[2:0]) text
117 553.39 114.3 553.39 line
114.8 553.99 0 0 0 14 (data_in[255:0]) text
724.3 540.39 726.8 540.39 line
726.3 540.89 0 2 0 15 (data_out[511:0]) text
0.000 0.000 0.000 setrgbcolor
622.6 540.39 newpath moveto
622.6 543.49 lineto
630.4 540.39 lineto
622.6 537.29 lineto
closepath
fill
0.000 1.000 1.000 setrgbcolor
0.2 setlinewidth
0.000 1.000 0.000 setrgbcolor
622.6 540.39 newpath moveto
622.6 543.49 lineto
630.4 540.39 lineto
622.6 537.29 lineto
closepath
stroke
0.5 setlinewidth
1.000 0.000 0.000 setrgbcolor
620 540.39 622.6 540.39 line
622.1 540.69 0 2 0 55 (data_out_reg[511:0]=xxxxxxxxxxxxxxxxxxxxxxxxxxxxxxxx...) text
633 540.39 630.4 540.39 line
630.9 540.69 0 0 0 51 (data_out[511:0]=xxxxxxxxxxxxxxxxxxxxxxxxxxxxxxxx...) text
0.000 0.000 0.000 setrgbcolor
429.7 511.69 26.1 20.8 rectfill
1.000 0.000 0.000 setrgbcolor
0.2 setlinewidth
0.000 1.000 0.000 setrgbcolor
429.7 511.69 26.1 20.8 rectstroke
429.7 516.09 newpath moveto
431.5 516.89 lineto
429.7 517.69 lineto
stroke
3.12782 textsize
442.7 532.99 0 1 0 10 (FlipFlop_0) text
427.1 527.39 429.7 527.39 line
2.60651 textsize
430.2 527.29 0 0 1 1 (D) text
427.1 522.09 429.7 522.09 line
430.2 522.09 0 0 1 5 (CLEAR) text
0.251 0.878 0.816 setrgbcolor
429.2 522.39 0 2 0 7 (reset=x) text
0.000 1.000 0.000 setrgbcolor
427.1 516.89 429.7 516.89 line
432 516.89 0 0 1 5 (CLOCK) text
0.251 0.878 0.816 setrgbcolor
429.2 517.09 0 2 0 5 (clk=x) text
0.5 setlinewidth
0.000 1.000 0.000 setrgbcolor
458.4 522.09 455.8 522.09 line
455.2 522.09 0 2 1 1 (Q) text
0.251 0.878 0.816 setrgbcolor
456.3 522.39 0 0 0 55 (data_out_reg[511:0]=xxxxxxxxxxxxxxxxxxxxxxxxxxxxxxxx...) text
0.000 0.000 0.000 setrgbcolor
145.6 561.19 10.4 filledcircle
0.251 0.878 0.816 setrgbcolor
0.2 setlinewidth
0.000 1.000 0.000 setrgbcolor
145.6 561.19 10.4 circle
150.8 561.19 150.8 561.19 line
3.12782 textsize
145.6 561.19 0 1 1 4 (init) text
153.4 561.19 150.8 561.19 line
2.60651 textsize
151.3 561.49 0 0 0 3 (\(0\)) text
247.3 566.49 247.3 556.09 line
244.7 563.79 247.3 563.79 line
246.8 564.19 0 2 0 3 (\(0\)) text
249.9 563.79 247.3 563.79 line
0.5 setlinewidth
1.000 0.000 0.000 setrgbcolor
244.7 558.59 247.3 558.59 line
246.8 558.89 0 2 0 50 (data_in[255:0]=xxxxxxxxxxxxxxxxxxxxxxxxxxxxxxxx...) text
0.2 setlinewidth
0.000 1.000 0.000 setrgbcolor
247.3 553.39 247.3 542.99 line
249.9 550.79 247.3 550.79 line
0.5 setlinewidth
1.000 0.000 0.000 setrgbcolor
244.7 550.79 247.3 550.79 line
246.8 551.09 0 2 0 50 (data_in[255:0]=xxxxxxxxxxxxxxxxxxxxxxxxxxxxxxxx...) text
244.7 545.59 247.3 545.59 line
246.8 545.79 0 2 0 55 (data_out_reg[255:0]=xxxxxxxxxxxxxxxxxxxxxxxxxxxxxxxx...) text
0.000 0.000 0.000 setrgbcolor
276 568.99 newpath moveto
286.4 565.09 lineto
286.4 557.29 lineto
276 553.39 lineto
closepath
fill
1.000 0.000 0.000 setrgbcolor
0.2 setlinewidth
0.000 1.000 0.000 setrgbcolor
276 568.99 newpath moveto
286.4 565.09 lineto
286.4 557.29 lineto
276 553.39 lineto
closepath
stroke
273.3 563.79 276 563.79 line
273.3 558.59 276 558.59 line
289 561.19 286.4 561.19 line
0.5 setlinewidth
1.000 0.000 0.000 setrgbcolor
281.2 569.09 281.2 566.89 line
280.7 568.99 0 2 0 12 (state[2:0]=x) text
0.000 0.000 0.000 setrgbcolor
385.4 529.89 newpath moveto
395.8 525.99 lineto
395.8 518.19 lineto
385.4 514.29 lineto
closepath
fill
1.000 0.000 0.000 setrgbcolor
0.2 setlinewidth
0.000 1.000 0.000 setrgbcolor
385.4 529.89 newpath moveto
395.8 525.99 lineto
395.8 518.19 lineto
385.4 514.29 lineto
closepath
stroke
1.000 0.000 0.000 setrgbcolor
390.6 529.99 390.6 527.79 line
390.1 529.89 0 2 0 8 (enable=x) text
0.000 1.000 0.000 setrgbcolor
382.8 524.79 385.4 524.79 line
398.5 522.09 395.8 522.09 line
0.5 setlinewidth
1.000 0.000 0.000 setrgbcolor
382.8 519.49 385.4 519.49 line
384.9 519.79 0 2 0 55 (data_out_reg[511:0]=xxxxxxxxxxxxxxxxxxxxxxxxxxxxxxxx...) text
0.400 0.400 0.400 setrgbcolor
117 574.29 newpath moveto
281.2 574.29 lineto
281.2 569.09 lineto
stroke
0.2 setlinewidth
117 574.29 newpath moveto
281.2 574.29 lineto
281.2 569.09 lineto
stroke
398.5 522.09 newpath moveto
403.7 522.09 lineto
403.7 527.39 lineto
427.1 527.39 lineto
stroke
289 561.19 newpath moveto
294.2 561.19 lineto
294.2 524.79 lineto
382.8 524.79 lineto
stroke
249.9 563.79 273.3 563.79 line
249.9 550.79 newpath moveto
255.1 550.79 lineto
255.1 558.59 lineto
273.3 558.59 lineto
stroke
117 569.09 newpath moveto
260.3 569.09 lineto
260.3 550.79 lineto
408.9 550.79 lineto
408.9 516.89 lineto
427.1 516.89 lineto
stroke
0.5 setlinewidth
117 553.39 166.5 553.39 line
166 552.79 1.1 1.1 rectfill
244.7 558.59 newpath moveto
166.5 558.59 lineto
166.5 550.79 lineto
244.7 550.79 lineto
stroke
0.2 setlinewidth
117 553.39 166.5 553.39 line
244.7 558.59 newpath moveto
166.5 558.59 lineto
166.5 550.79 lineto
244.7 550.79 lineto
stroke
0.5 setlinewidth
633 540.39 724.3 540.39 line
0.2 setlinewidth
633 540.39 724.3 540.39 line
0.5 setlinewidth
244.7 545.59 newpath moveto
161.3 545.59 lineto
161.3 540.39 lineto
299.4 540.39 lineto
299.4 520.79 lineto
stroke
0.000 0.820 0.820 setrgbcolor
299.4 520.79 300.7 519.49 line
0.549 0.549 0.549 setrgbcolor
300.7 519.49 382.8 519.49 line
0.400 0.400 0.400 setrgbcolor
299.4 540.39 newpath moveto
536.6 540.39 lineto
536.6 523.39 lineto
stroke
0.000 0.820 0.820 setrgbcolor
536.6 523.39 535.3 522.09 line
0.549 0.549 0.549 setrgbcolor
535.3 522.09 458.4 522.09 line
0.000 0.820 0.820 setrgbcolor
536.6 539.09 537.9 540.39 line
0.549 0.549 0.549 setrgbcolor
537.9 540.39 620 540.39 line
0.400 0.400 0.400 setrgbcolor
298.9 539.79 1.1 1.1 rectfill
0.2 setlinewidth
244.7 545.59 newpath moveto
161.3 545.59 lineto
161.3 540.39 lineto
299.4 540.39 lineto
299.4 520.79 lineto
stroke
0.000 0.820 0.820 setrgbcolor
299.4 520.79 300.7 519.49 line
0.3 setlinewidth
0.549 0.549 0.549 setrgbcolor
300.7 519.49 382.8 519.49 line
0.2 setlinewidth
0.400 0.400 0.400 setrgbcolor
299.4 540.39 newpath moveto
536.6 540.39 lineto
536.6 523.39 lineto
stroke
0.000 0.820 0.820 setrgbcolor
536.6 523.39 535.3 522.09 line
0.3 setlinewidth
0.549 0.549 0.549 setrgbcolor
535.3 522.09 458.4 522.09 line
0.2 setlinewidth
0.000 0.820 0.820 setrgbcolor
536.6 539.09 537.9 540.39 line
0.3 setlinewidth
0.549 0.549 0.549 setrgbcolor
537.9 540.39 620 540.39 line
0.5 setlinewidth
382.8 519.49 305.9 519.49 line
0.000 0.820 0.820 setrgbcolor
305.9 519.49 304.6 520.79 line
0.400 0.400 0.400 setrgbcolor
304.6 520.79 newpath moveto
304.6 545.59 lineto
541.8 545.59 lineto
541.8 523.39 lineto
stroke
0.000 0.820 0.820 setrgbcolor
541.8 523.39 540.5 522.09 line
0.549 0.549 0.549 setrgbcolor
540.5 522.09 458.4 522.09 line
0.000 0.820 0.820 setrgbcolor
541.8 541.69 543.1 540.39 line
0.549 0.549 0.549 setrgbcolor
543.1 540.39 620 540.39 line
0.3 setlinewidth
382.8 519.49 305.9 519.49 line
0.2 setlinewidth
0.000 0.820 0.820 setrgbcolor
305.9 519.49 304.6 520.79 line
0.400 0.400 0.400 setrgbcolor
304.6 520.79 newpath moveto
304.6 545.59 lineto
541.8 545.59 lineto
541.8 523.39 lineto
stroke
0.000 0.820 0.820 setrgbcolor
541.8 523.39 540.5 522.09 line
0.3 setlinewidth
0.549 0.549 0.549 setrgbcolor
540.5 522.09 458.4 522.09 line
0.2 setlinewidth
0.000 0.820 0.820 setrgbcolor
541.8 541.69 543.1 540.39 line
0.3 setlinewidth
0.549 0.549 0.549 setrgbcolor
543.1 540.39 620 540.39 line
0.2 setlinewidth
0.400 0.400 0.400 setrgbcolor
117 535.19 newpath moveto
390.6 535.19 lineto
390.6 529.99 lineto
stroke
117 511.69 newpath moveto
414.1 511.69 lineto
414.1 522.09 lineto
427.1 522.09 lineto
stroke
153.4 561.19 newpath moveto
161.3 561.19 lineto
161.3 563.79 lineto
244.7 563.79 lineto
stroke
restore
showpage
%%Trailer
end
%%Pages: 1
%%EOF
