%!PS-Adobe-3.0
%%Creator: Nlview
%%For: jschoenbohm
%%Title: root
%%BoundingBox: 28 28 568 814
%%CreationDate: 2020-10-07 11:24
%%Pages: (atend)
%%DocumentData: Clean7Bit
%%DocumentNeededResources: font Helvetica
%%EndComments

%%BeginProlog
50 dict begin
/line {
    newpath moveto lineto stroke
} bind def
/circle {
    newpath 2 div 0 360 arc stroke
} bind def
/filledcircle {
    newpath 2 div 0 360 arc fill
} bind def
/text {                                 % stack: x y rot jx jy len (str)
    gsave
    7 -2 roll moveto                    % stack: rot jx jy len (str)
    dup stringwidth pop /wid exch def   % string width --> wid
    5 -1 roll                           % stack: jx jy len (str) rot
    rotate
    4 2 roll                            % stack: len (str) jx jy
    Fdescent exch
    2 div Fdescent Fascent add mul sub  % desc - jy/2 * (asc+desc)
                                        % stack: len (str) jx ymove
    exch
    2 div wid mul neg                   % -jx/2 * wid
                                        % stack: len (str) ymove xmove
    exch rmoveto                        % stack: len (str)
    exch 0 exch                         % stack: (str) 0 len
    getinterval                         % stack: substr(str,0,len)
    show                                % stack:
    grestore
} bind def
/initfontfac {
    currentdict /Ffac known not {
        % Here we compute Ffac. Ffac is used below to resize the font
        % in a way that the font's ascent+descent/2 fits the required
        % text size. We compute Ffac only once, because the font F will
        % never change.
        %
        dup F exch scalefont setfont % stack sz font
        gsave
        newpath 0 0 moveto (XTgq) false charpath
        pathbbox                        % stack: sz l b r t
        grestore
        3 2 roll neg 2 div add          % fheight = ascent + descent/2
        3 1 roll pop pop                % stack: sz fheight
        div
        /Ffac exch def                  % Ffac = sz/fheight
    } if
} bind def
/textsize {
    Ffac mul F exch scalefont setfont
    gsave
    newpath
    0 0 moveto (XTgq) false charpath pathbbox
    /Fascent exch def			% top -> ascent
    pop
    /Fdescent exch neg 2 div def	% -bottom/2 -> descent
    pop
    grestore
} bind def
/linestyle {
				% stack: [dashdef] offs gwid
    dup 3 1 roll		%        [dashdef] gwid offs gwid
    mul [			%        [dashdef] gwid moffs [
    4 -2 roll exch		%        moffs [ gwid [dashdef]
    {exch dup 3 -1 roll mul exch} forall
    				%	 moffs [ a1 a2 a3 .. gwid
    pop ]			%	 moffs [a1 a2 a3..]
    exch			%	 [a1 a2 a3..] moffs
    setdash			% stack:
} bind def

% Define the array ISOLatin1Encoding (which specifies how characters are
% encoded for ISO-8859-1 fonts), if it isn't already present (Postscript
% level 2 is supposed to define it, but level 1 doesn't).
systemdict /ISOLatin1Encoding known not {
    /ISOLatin1Encoding [
	/space /space /space /space /space /space /space /space
	/space /space /space /space /space /space /space /space
	/space /space /space /space /space /space /space /space
	/space /space /space /space /space /space /space /space
	/space /exclam /quotedbl /numbersign /dollar /percent /ampersand
	    /quoteright
	/parenleft /parenright /asterisk /plus /comma /minus /period /slash
	/zero /one /two /three /four /five /six /seven
	/eight /nine /colon /semicolon /less /equal /greater /question
	/at /A /B /C /D /E /F /G
	/H /I /J /K /L /M /N /O
	/P /Q /R /S /T /U /V /W
	/X /Y /Z /bracketleft /backslash /bracketright /asciicircum
	/underscore /quoteleft /a /b /c /d /e /f /g
	/h /i /j /k /l /m /n /o
	/p /q /r /s /t /u /v /w
	/x /y /z /braceleft /bar /braceright /asciitilde /space
	/space /space /space /space /space /space /space /space
	/space /space /space /space /space /space /space /space
	/dotlessi /grave /acute /circumflex /tilde /macron /breve /dotaccent
	/dieresis /space /ring /cedilla /space /hungarumlaut /ogonek /caron
	/space /exclamdown /cent /sterling /currency /yen /brokenbar /section
	/dieresis /copyright /ordfeminine /guillemotleft /logicalnot /hyphen
	    /registered /macron
	/degree /plusminus /twosuperior /threesuperior /acute /mu /paragraph
	    /periodcentered
	/cedillar /onesuperior /ordmasculine /guillemotright /onequarter
	    /onehalf /threequarters /questiondown
	/Agrave /Aacute /Acircumflex /Atilde /Adieresis /Aring /AE /Ccedilla
	/Egrave /Eacute /Ecircumflex /Edieresis /Igrave /Iacute /Icircumflex
	    /Idieresis
	/Eth /Ntilde /Ograve /Oacute /Ocircumflex /Otilde /Odieresis
	    /multiply
	/Oslash /Ugrave /Uacute /Ucircumflex /Udieresis /Yacute /Thorn
	    /germandbls
	/agrave /aacute /acircumflex /atilde /adieresis /aring /ae /ccedilla
	/egrave /eacute /ecircumflex /edieresis /igrave /iacute /icircumflex
	    /idieresis
	/eth /ntilde /ograve /oacute /ocircumflex /otilde /odieresis /divide
	/oslash /ugrave /uacute /ucircumflex /udieresis /yacute /thorn
	    /ydieresis
    ] def
} if

% font ISOEncode font
% This procedure changes the encoding of a font from the default
% Postscript encoding to ISOLatin1. The body of this procedure comes
% from Section 5.6.1 of the Postscript book.
/ISOEncode {
    dup length dict begin
	{1 index /FID ne {def} {pop pop} ifelse} forall
	/Encoding ISOLatin1Encoding def
	currentdict
    end
    /Fname exch definefont
} bind def
%%EndProlog

%%BeginSetup
%%IncludeResource: font Helvetica
<< /PageSize [595 841] /Policies << /PageSize 3 >> >> setpagedevice
%%EndSetup

/DiagonalCross <<      % pattern prototype dictionary: XX
   /PatternType 1      % Tiling pattern
   /PaintType 2        % uncolored tiling pattern
   /TilingType 1
   /BBox [0 0 8 8]
   /XStep 8
   /YStep 8
   /PaintProc
     { pop
       1 setlinewidth
       [] 0 setdash
       newpath -1 3 moveto
       5 9 lineto
       stroke newpath -1 5 moveto
       5 -1 lineto
       stroke newpath 3 -1 moveto
       9 5 lineto
       stroke newpath 3 9 moveto
       9 3 lineto
       stroke
    } bind
>> def
/Cross <<              % pattern prototype dictionary: ++
   /PatternType 1      % Tiling pattern
   /PaintType 2        % uncolored tiling pattern
   /TilingType 1
   /BBox [0 0 8 8]
   /XStep 8
   /YStep 8
   /PaintProc
     { pop
       1 setlinewidth
       [] 0 setdash
       0 4 moveto
       8 4 lineto
       4 0 moveto
       4 8 lineto
       stroke
    } bind
>> def
/BackwardDiagonal <<   % pattern prototype dictionary: //
   /PatternType 1      % Tiling pattern
   /PaintType 2        % uncolored tiling pattern
   /TilingType 1
   /BBox [0 0 8 8]
   /XStep 8
   /YStep 8
   /PaintProc
     { pop
       1 setlinewidth
       [] 0 setdash
       newpath -1 3 moveto
       6 6 rlineto
       stroke newpath 3 -1 moveto
       6 6 rlineto
       stroke
    } bind
>> def
/ForwardDiagonal <<    % pattern prototype dictionary: \\
   /PatternType 1      % Tiling pattern
   /PaintType 2        % uncolored tiling pattern
   /TilingType 1
   /BBox [0 0 8 8]
   /XStep 8
   /YStep 8
   /PaintProc
     { pop
       1 setlinewidth
       [] 0 setdash
       newpath -1 5 moveto
       6 -6 rlineto
       stroke newpath 3 9 moveto
       6 -6 rlineto
       stroke
    } bind
>> def
/Vertical <<           % pattern prototype dictionary: ||
   /PatternType 1      % Tiling pattern
   /PaintType 2        % uncolored tiling pattern
   /TilingType 1
   /BBox [0 0 8 8]
   /XStep 8
   /YStep 8
   /PaintProc
     { pop
       1 setlinewidth
       [] 0 setdash
       4 0 moveto
       4 8 lineto
       stroke
    } bind
>> def
/Horizontal <<         % pattern prototype dictionary: ==
   /PatternType 1      % Tiling pattern
   /PaintType 2        % uncolored tiling pattern
   /TilingType 1
   /BBox [0 0 8 8]
   /XStep 8
   /YStep 8
   /PaintProc
     { pop
       1 setlinewidth
       [] 0 setdash
       0 4 moveto
       8 4 lineto
       stroke
    } bind
>> def
%%Page: 1 1
%%PageOrientation: Landscape
save
90 rotate
0 -841.89 translate
27.8 274.39 786.3 539.7 rectclip
/F /Helvetica findfont ISOEncode def
12 initfontfac
0 setlinecap 		% Butt caps (flat)
0 setlinejoin		% Miter joins
[/Pattern /DeviceRGB] setcolorspace
0.000 0.000 0.000 setrgbcolor
28.9 275.39 784.2 537.7 rectfill
-120.6 645.79 newpath moveto
535.3 645.79 lineto
535.3 645.79 lineto
535.5 645.69 lineto
535.6 645.39 lineto
535.6 645.39 lineto
535.6 613.29 lineto
535.6 613.29 lineto
535.5 613.09 lineto
535.3 612.99 lineto
535.3 612.99 lineto
-120.6 612.99 lineto
-120.6 612.99 lineto
-120.9 613.09 lineto
-121 613.29 lineto
-121 613.29 lineto
-121 645.39 lineto
-121 645.39 lineto
-120.9 645.69 lineto
closepath
fill
0.1 setlinewidth
0.000 1.000 1.000 setrgbcolor
-120.6 645.79 535.3 645.79 line
535.198 645.401 0.402183 75 -2 newpath arcn stroke
535.6 645.39 535.6 613.29 line
535.359 613.23 0.247772 14 -104 newpath arcn stroke
535.3 612.99 -120.6 612.99 line
0.546424 textsize
207.3 645.79 0 1 0 22 (simulator::deflate_top) text
207.3 612.89 0 1 2 11 (deflate_top) text
536.1 635.79 535.6 635.79 line
536.1 637.09 535.6 637.09 line
0.2 setlinewidth
536.1 626.19 535.6 626.19 line
536.1 634.39 535.6 634.39 line
0.1 setlinewidth
535.2 635.79 535.6 635.79 line
0.455353 textsize
535.5 635.79 0 2 0 9 (out_ready) text
535.2 637.09 535.6 637.09 line
535.5 637.19 0 2 0 8 (out_last) text
0.2 setlinewidth
535.2 626.19 535.6 626.19 line
535.5 626.29 0 2 0 15 (out_data[511:0]) text
535.2 634.39 535.6 634.39 line
535.5 634.49 0 2 0 17 (out_last_len[8:0]) text
0.000 0.000 0.000 setrgbcolor
44.2 644.49 newpath moveto
372.7 644.49 lineto
372.7 644.49 lineto
372.9 644.39 lineto
373 644.09 lineto
373 644.09 lineto
373 616.99 lineto
373 616.99 lineto
372.9 616.79 lineto
372.7 616.69 lineto
372.7 616.69 lineto
44.2 616.69 lineto
44.2 616.69 lineto
43.9 616.79 lineto
43.8 616.99 lineto
43.8 616.99 lineto
43.8 644.09 lineto
43.8 644.09 lineto
43.9 644.39 lineto
closepath
fill
0.000 1.000 1.000 setrgbcolor
0.1 setlinewidth
44.2 644.49 372.7 644.49 line
372.6 644.102 0.399994 76 -2 newpath arcn stroke
373 644.09 373 616.99 line
372.758 616.932 0.248796 13 -103 newpath arcn stroke
372.7 616.69 44.2 616.69 line
44.1143 616.992 0.314279 -74 -180 newpath arcn stroke
43.8 616.99 43.8 644.09 line
44.232 644.058 0.433205 176 94 newpath arcn stroke
0.546424 textsize
208.4 644.49 0 1 0 26 (barrel_shifter_512bits_UUT) text
208.4 616.59 0 1 2 22 (barrel_shifter_512bits) text
1.000 0.000 0.000 setrgbcolor
43.4 625.79 43.8 625.79 line
0.455353 textsize
43.7 625.89 0 2 0 5 (clk=x) text
43.4 621.69 43.8 621.69 line
43.7 621.79 0 2 0 5 (rst=x) text
43.4 622.99 43.8 622.99 line
43.7 623.09 0 2 0 16 (pack_out_ready=x) text
43.4 626.69 43.8 626.69 line
43.7 626.79 0 2 0 15 (pack_out_last=x) text
373.5 624.39 373 624.39 line
373.1 624.49 0 0 0 26 (barrel_shifter_data_full=x) text
0.2 setlinewidth
43.4 640.29 43.8 640.29 line
43.7 640.39 0 2 0 56 (pack_out_data[255:0]=xxxxxxxxxxxxxxxxxxxxxxxxxxxxxxxx...) text
43.4 630.79 43.8 630.79 line
43.7 630.89 0 2 0 20 (pack_out_len[7:0]=xx) text
373.5 634.89 373 634.89 line
373.1 634.99 0 0 0 35 (barrel_shifter_current_len[8:0]=xxx) text
373.5 619.79 373 619.79 line
373.1 619.99 0 0 0 71 (barrel_shifter_data_to_write[255:0]=xxxxxxxxxxxxxxxxxxxxxxxxxxxxxxxx...) text
373.5 617.59 373 617.59 line
373.1 617.69 0 0 0 66 (barrel_shifter_data_out[511:0]=xxxxxxxxxxxxxxxxxxxxxxxxxxxxxxxx...) text
0.1 setlinewidth
0.000 1.000 1.000 setrgbcolor
44.3 625.79 43.8 625.79 line
43.9 625.89 0 0 0 3 (clk) text
44.3 621.69 43.8 621.69 line
43.9 621.79 0 0 0 5 (reset) text
44.3 622.99 43.8 622.99 line
43.9 623.09 0 0 0 6 (enable) text
44.3 626.69 43.8 626.69 line
43.9 626.79 0 0 0 4 (last) text
372.6 624.39 373 624.39 line
372.9 624.49 0 2 0 9 (data_full) text
0.2 setlinewidth
44.3 640.29 43.8 640.29 line
43.9 640.39 0 0 0 14 (data_in[255:0]) text
44.3 630.79 43.8 630.79 line
43.9 630.89 0 0 0 11 (len_in[7:0]) text
372.6 634.89 373 634.89 line
372.9 634.99 0 2 0 16 (current_len[8:0]) text
372.6 619.79 373 619.79 line
372.9 619.99 0 2 0 20 (data_to_write[255:0]) text
372.6 617.59 373 617.59 line
372.9 617.69 0 2 0 15 (data_out[511:0]) text
0.000 0.000 0.000 setrgbcolor
502.8 637.09 newpath moveto
502.8 637.59 lineto
504.2 637.09 lineto
502.8 636.59 lineto
closepath
fill
0.000 1.000 1.000 setrgbcolor
0.1 setlinewidth
0.000 1.000 0.000 setrgbcolor
502.8 637.09 newpath moveto
502.8 637.59 lineto
504.2 637.09 lineto
502.8 636.59 lineto
closepath
stroke
1.000 0.000 0.000 setrgbcolor
502.4 637.09 502.8 637.09 line
502.7 637.09 0 2 0 14 (out_last_reg=x) text
504.7 637.09 504.2 637.09 line
504.3 637.09 0 0 0 10 (out_last=x) text
0.000 0.000 0.000 setrgbcolor
502.8 634.39 newpath moveto
502.8 634.89 lineto
504.2 634.39 lineto
502.8 633.89 lineto
closepath
fill
1.000 0.000 0.000 setrgbcolor
0.000 1.000 0.000 setrgbcolor
502.8 634.39 newpath moveto
502.8 634.89 lineto
504.2 634.39 lineto
502.8 633.89 lineto
closepath
stroke
0.2 setlinewidth
1.000 0.000 0.000 setrgbcolor
502.4 634.39 502.8 634.39 line
502.7 634.39 0 2 0 25 (out_last_len_reg[8:0]=xxx) text
504.7 634.39 504.2 634.39 line
504.3 634.39 0 0 0 21 (out_last_len[8:0]=xxx) text
0.000 0.000 0.000 setrgbcolor
502.8 624.39 27.3 3.6 rectfill
1.000 0.000 0.000 setrgbcolor
0.1 setlinewidth
0.000 1.000 0.000 setrgbcolor
502.8 624.39 27.3 3.6 rectstroke
0.546424 textsize
516.5 628.09 0 1 0 9 (Unknown_0) text
0.2 setlinewidth
1.000 0.000 0.000 setrgbcolor
502.4 627.09 502.8 627.09 line
0.455353 textsize
502.9 627.09 0 0 1 12 (state[2:0]=x) text
502.4 626.19 502.8 626.19 line
502.9 626.19 0 0 1 55 (out_data_op1[511:0]=xxxxxxxxxxxxxxxxxxxxxxxxxxxxxxxx...) text
502.4 625.29 502.8 625.29 line
502.9 625.29 0 0 1 55 (out_data_op2[511:0]=xxxxxxxxxxxxxxxxxxxxxxxxxxxxxxxx...) text
530.6 626.19 530.1 626.19 line
530 626.19 0 2 1 51 (out_data[511:0]=xxxxxxxxxxxxxxxxxxxxxxxxxxxxxxxx...) text
0.000 0.000 0.000 setrgbcolor
484.6 627.59 8.7 3.6 rectfill
1.000 0.000 0.000 setrgbcolor
0.1 setlinewidth
0.000 1.000 0.000 setrgbcolor
484.6 627.59 8.7 3.6 rectstroke
0.546424 textsize
488.9 631.29 0 1 0 9 (Unknown_1) text
1.000 0.000 0.000 setrgbcolor
484.2 630.29 484.6 630.29 line
0.455353 textsize
484.7 630.29 0 0 1 5 (clk=x) text
484.2 629.39 484.6 629.39 line
484.7 629.39 0 0 1 5 (rst=x) text
0.2 setlinewidth
484.2 628.49 484.6 628.49 line
484.7 628.49 0 0 1 17 (next_state[2:0]=x) text
493.7 629.39 493.3 629.39 line
493.2 629.39 0 2 1 12 (state[2:0]=x) text
0.000 0.000 0.000 setrgbcolor
445.5 630.29 32.8 10 rectfill
1.000 0.000 0.000 setrgbcolor
0.1 setlinewidth
0.000 1.000 0.000 setrgbcolor
445.5 630.29 32.8 10 rectstroke
0.546424 textsize
461.9 640.39 0 1 0 9 (Unknown_2) text
1.000 0.000 0.000 setrgbcolor
445 639.39 445.5 639.39 line
0.455353 textsize
445.6 639.39 0 0 1 26 (barrel_shifter_data_full=x) text
445 638.49 445.5 638.49 line
445.6 638.49 0 0 1 18 (pack_out_last_s1=x) text
478.7 637.09 478.3 637.09 line
478.2 637.09 0 2 1 14 (out_last_reg=x) text
478.7 636.19 478.3 636.19 line
478.2 636.19 0 2 1 15 (out_ready_reg=x) text
0.2 setlinewidth
445 637.59 445.5 637.59 line
445.6 637.59 0 0 1 66 (barrel_shifter_data_out[511:0]=xxxxxxxxxxxxxxxxxxxxxxxxxxxxxxxx...) text
445 636.69 445.5 636.69 line
445.6 636.69 0 0 1 35 (barrel_shifter_current_len[8:0]=xxx) text
445 635.79 445.5 635.79 line
445.6 635.79 0 0 1 12 (state[2:0]=x) text
445 634.89 445.5 634.89 line
445.6 634.79 0 0 1 71 (barrel_shifter_data_to_write[255:0]=xxxxxxxxxxxxxxxxxxxxxxxxxxxxxxxx...) text
445 633.99 445.5 633.99 line
445.6 633.89 0 0 1 55 (out_data_op2[511:0]=xxxxxxxxxxxxxxxxxxxxxxxxxxxxxxxx...) text
445 632.99 445.5 632.99 line
445.6 632.99 0 0 1 75 (barrel_shifter_data_to_write_reg[255:0]=xxxxxxxxxxxxxxxxxxxxxxxxxxxxxxxx...) text
445 632.09 445.5 632.09 line
445.6 632.09 0 0 1 66 (barrel_shifter_data_out[255:0]=xxxxxxxxxxxxxxxxxxxxxxxxxxxxxxxx...) text
445 631.19 445.5 631.19 line
445.6 631.19 0 0 1 55 (out_data_op2[255:0]=xxxxxxxxxxxxxxxxxxxxxxxxxxxxxxxx...) text
478.7 635.29 478.3 635.29 line
478.2 635.29 0 2 1 55 (out_data_op1[511:0]=xxxxxxxxxxxxxxxxxxxxxxxxxxxxxxxx...) text
478.7 634.39 478.3 634.39 line
478.2 634.39 0 2 1 25 (out_last_len_reg[8:0]=xxx) text
478.7 633.49 478.3 633.49 line
478.2 633.49 0 2 1 17 (next_state[2:0]=x) text
0.000 0.000 0.000 setrgbcolor
415.9 631.19 5.9 2.1 rectfill
1.000 0.000 0.000 setrgbcolor
0.1 setlinewidth
0.000 1.000 1.000 setrgbcolor
415.9 631.19 5.9 2.1 rectstroke
0.546424 textsize
418.9 633.39 0 1 0 31 (barrel_shifter_data_to_write_i0) text
418.9 631.09 0 1 2 20 (register_compression) text
1.000 0.000 0.000 setrgbcolor
415.4 631.69 415.9 631.69 line
0.455353 textsize
415.8 631.69 0 2 0 5 (clk=x) text
0.2 setlinewidth
415.4 632.59 415.9 632.59 line
415.8 632.59 0 2 0 71 (barrel_shifter_data_to_write[255:0]=xxxxxxxxxxxxxxxxxxxxxxxxxxxxxxxx...) text
422.2 632.59 421.8 632.59 line
421.9 632.59 0 0 0 75 (barrel_shifter_data_to_write_reg[255:0]=xxxxxxxxxxxxxxxxxxxxxxxxxxxxxxxx...) text
0.1 setlinewidth
0.000 1.000 1.000 setrgbcolor
416.3 631.69 415.9 631.69 line
416 631.69 0 0 0 3 (clk) text
0.2 setlinewidth
416.3 632.59 415.9 632.59 line
416 632.59 0 0 0 8 (d[255:0]) text
421.3 632.59 421.8 632.59 line
421.7 632.59 0 2 0 8 (q[255:0]) text
0.000 0.000 0.000 setrgbcolor
415.9 635.79 4.6 3 rectfill
0.000 1.000 1.000 setrgbcolor
0.1 setlinewidth
415.9 635.79 4.6 3 rectstroke
0.546424 textsize
418.2 638.89 0 1 0 19 (pack_out_last_s1_i0) text
418.2 635.69 0 1 2 26 (register_compression_reset) text
1.000 0.000 0.000 setrgbcolor
415.4 637.99 415.9 637.99 line
0.455353 textsize
415.8 638.09 0 2 0 15 (pack_out_last=x) text
415.4 637.09 415.9 637.09 line
415.8 637.19 0 2 0 5 (clk=x) text
415.4 636.19 415.9 636.19 line
415.8 636.29 0 2 0 5 (rst=x) text
420.9 637.09 420.5 637.09 line
420.5 637.19 0 0 0 18 (pack_out_last_s1=x) text
0.000 1.000 1.000 setrgbcolor
416.3 637.99 415.9 637.99 line
416 638.09 0 0 0 6 (d[0:0]) text
416.3 637.09 415.9 637.09 line
416 637.19 0 0 0 3 (clk) text
416.3 636.19 415.9 636.19 line
416 636.29 0 0 0 5 (reset) text
420 637.09 420.5 637.09 line
420.4 637.19 0 2 0 6 (q[0:0]) text
0.000 0.000 0.000 setrgbcolor
85.3 622.09 newpath moveto
85.3 621.39 lineto
86.4 621.39 lineto
86.4 621.39 lineto
86.7 621.49 lineto
87 621.69 lineto
87.1 621.89 lineto
87.1 622.29 lineto
87 622.49 lineto
86.7 622.69 lineto
86.4 622.79 lineto
86.4 622.79 lineto
85.3 622.79 lineto
closepath
fill
0.000 1.000 1.000 setrgbcolor
0.000 1.000 0.000 setrgbcolor
85.3 622.09 newpath moveto
85.3 621.39 lineto
86.4 621.39 lineto
stroke
86.4023 622.09 0.700004 -90 90 newpath arc stroke
86.4 622.79 newpath moveto
85.3 622.79 lineto
85.3 622.09 lineto
stroke
1.000 0.000 0.000 setrgbcolor
84.8 622.59 85.3 622.59 line
85.3 622.59 0 2 0 8 (enable=x) text
0.000 1.000 0.000 setrgbcolor
84.8 621.69 85.3 621.69 line
87.6 622.09 87.1 622.09 line
0.000 0.000 0.000 setrgbcolor
251.5 624.79 newpath moveto
251.5 624.09 lineto
252.6 624.09 lineto
252.6 624.09 lineto
252.9 624.19 lineto
253.2 624.39 lineto
253.3 624.59 lineto
253.3 624.99 lineto
253.2 625.19 lineto
252.9 625.39 lineto
252.6 625.49 lineto
252.6 625.49 lineto
251.5 625.49 lineto
closepath
fill
0.000 1.000 0.000 setrgbcolor
251.5 624.79 newpath moveto
251.5 624.09 lineto
252.6 624.09 lineto
stroke
252.602 624.79 0.700004 -90 90 newpath arc stroke
252.6 625.49 newpath moveto
251.5 625.49 lineto
251.5 624.79 lineto
stroke
1.000 0.000 0.000 setrgbcolor
251 625.29 251.5 625.29 line
251.5 625.29 0 2 0 8 (enable=x) text
0.000 1.000 0.000 setrgbcolor
251 624.39 251.5 624.39 line
253.8 624.79 253.3 624.79 line
0.000 0.000 0.000 setrgbcolor
78 630.79 1.8 filledcircle
0.000 1.000 0.000 setrgbcolor
78 630.79 1.8 circle
77.1 631.29 77.2 631.19 line
78.9 630.79 78.9 630.79 line
77.1 630.29 77.2 630.39 line
0.546424 textsize
78 630.79 0 1 1 1 (+) text
76.6 631.19 77.1 631.19 line
79.4 630.79 78.9 630.79 line
0.2 setlinewidth
1.000 0.000 0.000 setrgbcolor
76.6 630.29 77.1 630.29 line
0.455353 textsize
77 630.39 0 2 0 24 (current_len_reg[8:0]=xxx) text
0.000 0.000 0.000 setrgbcolor
66.6 630.79 1.8 filledcircle
1.000 0.000 0.000 setrgbcolor
0.1 setlinewidth
0.000 1.000 0.000 setrgbcolor
66.6 630.79 1.8 circle
65.7 631.29 65.8 631.19 line
67.5 630.79 67.5 630.79 line
65.7 630.29 65.8 630.39 line
0.546424 textsize
66.6 630.79 0 1 1 1 (+) text
65.3 631.19 65.7 631.19 line
68 630.79 67.5 630.79 line
0.2 setlinewidth
1.000 0.000 0.000 setrgbcolor
65.3 630.29 65.7 630.29 line
0.455353 textsize
65.6 630.39 0 2 0 24 (current_len_reg[8:0]=xxx) text
0.000 0.000 0.000 setrgbcolor
78 628.49 1.8 filledcircle
1.000 0.000 0.000 setrgbcolor
0.1 setlinewidth
0.000 1.000 0.000 setrgbcolor
78 628.49 1.8 circle
77.1 628.99 77.2 628.89 line
77.1 627.99 77.2 628.09 line
78.9 628.49 78.9 628.49 line
0.546424 textsize
78 628.49 0 1 1 1 (+) text
76.6 628.89 77.1 628.89 line
76.6 627.99 77.1 627.99 line
0.455353 textsize
77 628.09 0 2 0 3 (\(7\)) text
79.4 628.49 78.9 628.49 line
0.000 0.000 0.000 setrgbcolor
352.6 634.89 newpath moveto
352.6 635.39 lineto
354 634.89 lineto
352.6 634.39 lineto
closepath
fill
0.000 1.000 0.000 setrgbcolor
352.6 634.89 newpath moveto
352.6 635.39 lineto
354 634.89 lineto
352.6 634.39 lineto
closepath
stroke
0.2 setlinewidth
1.000 0.000 0.000 setrgbcolor
352.1 634.89 352.6 634.89 line
352.5 634.89 0 2 0 24 (current_len_reg[8:0]=xxx) text
354.4 634.89 354 634.89 line
354.1 634.89 0 0 0 20 (current_len[8:0]=xxx) text
0.000 0.000 0.000 setrgbcolor
352.6 624.39 newpath moveto
352.6 624.89 lineto
354 624.39 lineto
352.6 623.89 lineto
closepath
fill
1.000 0.000 0.000 setrgbcolor
0.1 setlinewidth
0.000 1.000 0.000 setrgbcolor
352.6 624.39 newpath moveto
352.6 624.89 lineto
354 624.39 lineto
352.6 623.89 lineto
closepath
stroke
1.000 0.000 0.000 setrgbcolor
352.1 624.39 352.6 624.39 line
352.5 624.39 0 2 0 15 (data_full_reg=x) text
354.4 624.39 354 624.39 line
354.1 624.39 0 0 0 11 (data_full=x) text
0.000 0.000 0.000 setrgbcolor
352.6 619.79 newpath moveto
352.6 620.29 lineto
354 619.79 lineto
352.6 619.29 lineto
closepath
fill
1.000 0.000 0.000 setrgbcolor
0.000 1.000 0.000 setrgbcolor
352.6 619.79 newpath moveto
352.6 620.29 lineto
354 619.79 lineto
352.6 619.29 lineto
closepath
stroke
0.2 setlinewidth
1.000 0.000 0.000 setrgbcolor
352.1 619.79 352.6 619.79 line
352.5 619.79 0 2 0 60 (data_to_write_reg[255:0]=xxxxxxxxxxxxxxxxxxxxxxxxxxxxxxxx...) text
354.4 619.79 354 619.79 line
354.1 619.79 0 0 0 56 (data_to_write[255:0]=xxxxxxxxxxxxxxxxxxxxxxxxxxxxxxxx...) text
0.000 0.000 0.000 setrgbcolor
352.6 617.59 newpath moveto
352.6 618.09 lineto
354 617.59 lineto
352.6 617.09 lineto
closepath
fill
1.000 0.000 0.000 setrgbcolor
0.1 setlinewidth
0.000 1.000 0.000 setrgbcolor
352.6 617.59 newpath moveto
352.6 618.09 lineto
354 617.59 lineto
352.6 617.09 lineto
closepath
stroke
0.2 setlinewidth
1.000 0.000 0.000 setrgbcolor
352.1 617.59 352.6 617.59 line
352.5 617.59 0 2 0 55 (data_out_reg[511:0]=xxxxxxxxxxxxxxxxxxxxxxxxxxxxxxxx...) text
354.4 617.59 354 617.59 line
354.1 617.59 0 0 0 51 (data_out[511:0]=xxxxxxxxxxxxxxxxxxxxxxxxxxxxxxxx...) text
0.000 0.000 0.000 setrgbcolor
180.9 620.79 4.6 3.6 rectfill
1.000 0.000 0.000 setrgbcolor
0.1 setlinewidth
0.000 1.000 0.000 setrgbcolor
180.9 620.79 4.6 3.6 rectstroke
180.9 621.59 newpath moveto
181.2 621.69 lineto
180.9 621.79 lineto
stroke
0.546424 textsize
183.2 624.49 0 1 0 10 (FlipFlop_0) text
180.5 623.49 180.9 623.49 line
0.455353 textsize
181 623.49 0 0 1 1 (D) text
180.5 622.59 180.9 622.59 line
181 622.59 0 0 1 5 (CLEAR) text
0.251 0.878 0.816 setrgbcolor
180.8 622.59 0 2 0 7 (reset=x) text
0.000 1.000 0.000 setrgbcolor
180.5 621.69 180.9 621.69 line
181.3 621.69 0 0 1 5 (CLOCK) text
0.251 0.878 0.816 setrgbcolor
180.8 621.69 0 2 0 5 (clk=x) text
0.2 setlinewidth
0.000 1.000 0.000 setrgbcolor
185.9 622.59 185.5 622.59 line
185.4 622.59 0 2 1 1 (Q) text
0.251 0.878 0.816 setrgbcolor
185.5 622.59 0 0 0 24 (current_len_reg[8:0]=xxx) text
0.000 0.000 0.000 setrgbcolor
208.7 620.79 4.6 3.6 rectfill
0.251 0.878 0.816 setrgbcolor
0.1 setlinewidth
0.000 1.000 0.000 setrgbcolor
208.7 620.79 4.6 3.6 rectstroke
208.7 621.59 newpath moveto
209 621.69 lineto
208.7 621.79 lineto
stroke
0.546424 textsize
211 624.49 0 1 0 10 (FlipFlop_1) text
208.2 623.49 208.7 623.49 line
0.455353 textsize
208.8 623.49 0 0 1 1 (D) text
208.2 622.59 208.7 622.59 line
208.8 622.59 0 0 1 5 (CLEAR) text
0.251 0.878 0.816 setrgbcolor
208.6 622.59 0 2 0 7 (reset=x) text
0.000 1.000 0.000 setrgbcolor
208.2 621.69 208.7 621.69 line
209.1 621.69 0 0 1 5 (CLOCK) text
0.251 0.878 0.816 setrgbcolor
208.6 621.69 0 2 0 5 (clk=x) text
0.2 setlinewidth
0.000 1.000 0.000 setrgbcolor
213.7 622.59 213.3 622.59 line
213.2 622.59 0 2 1 1 (Q) text
0.251 0.878 0.816 setrgbcolor
213.3 622.59 0 0 0 55 (data_out_reg[511:0]=xxxxxxxxxxxxxxxxxxxxxxxxxxxxxxxx...) text
0.000 0.000 0.000 setrgbcolor
318 622.59 4.6 3.6 rectfill
0.251 0.878 0.816 setrgbcolor
0.1 setlinewidth
0.000 1.000 0.000 setrgbcolor
318 622.59 4.6 3.6 rectstroke
318 623.39 newpath moveto
318.3 623.49 lineto
318 623.59 lineto
stroke
0.546424 textsize
320.3 626.29 0 1 0 10 (FlipFlop_2) text
317.5 625.29 318 625.29 line
0.455353 textsize
318.1 625.29 0 0 1 1 (D) text
317.5 624.39 318 624.39 line
318.1 624.39 0 0 1 5 (CLEAR) text
0.251 0.878 0.816 setrgbcolor
317.9 624.39 0 2 0 7 (reset=x) text
0.000 1.000 0.000 setrgbcolor
317.5 623.49 318 623.49 line
318.4 623.49 0 0 1 5 (CLOCK) text
0.251 0.878 0.816 setrgbcolor
317.9 623.49 0 2 0 5 (clk=x) text
0.000 1.000 0.000 setrgbcolor
323 624.39 322.6 624.39 line
322.5 624.39 0 2 1 1 (Q) text
0.251 0.878 0.816 setrgbcolor
322.6 624.39 0 0 0 15 (data_full_reg=x) text
0.000 0.000 0.000 setrgbcolor
318 617.99 4.6 3.6 rectfill
0.251 0.878 0.816 setrgbcolor
0.000 1.000 0.000 setrgbcolor
318 617.99 4.6 3.6 rectstroke
318 618.79 newpath moveto
318.3 618.89 lineto
318 618.99 lineto
stroke
0.546424 textsize
320.3 621.69 0 1 0 10 (FlipFlop_3) text
317.5 620.69 318 620.69 line
0.455353 textsize
318.1 620.69 0 0 1 1 (D) text
317.5 619.79 318 619.79 line
318.1 619.79 0 0 1 5 (CLEAR) text
0.251 0.878 0.816 setrgbcolor
317.9 619.79 0 2 0 7 (reset=x) text
0.000 1.000 0.000 setrgbcolor
317.5 618.89 318 618.89 line
318.4 618.89 0 0 1 5 (CLOCK) text
0.251 0.878 0.816 setrgbcolor
317.9 618.89 0 2 0 5 (clk=x) text
0.2 setlinewidth
0.000 1.000 0.000 setrgbcolor
323 619.79 322.6 619.79 line
322.5 619.79 0 2 1 1 (Q) text
0.251 0.878 0.816 setrgbcolor
322.6 619.79 0 0 0 60 (data_to_write_reg[255:0]=xxxxxxxxxxxxxxxxxxxxxxxxxxxxxxxx...) text
0.000 0.000 0.000 setrgbcolor
93.5 626.19 4.6 3.6 rectfill
0.251 0.878 0.816 setrgbcolor
0.1 setlinewidth
0.000 1.000 0.000 setrgbcolor
93.5 626.19 4.6 3.6 rectstroke
93.5 626.99 newpath moveto
93.8 627.09 lineto
93.5 627.19 lineto
stroke
0.546424 textsize
95.8 629.89 0 1 0 10 (FlipFlop_4) text
93 628.89 93.5 628.89 line
0.455353 textsize
93.6 628.89 0 0 1 1 (D) text
93 627.99 93.5 627.99 line
93.6 627.99 0 0 1 4 (LOAD) text
93 627.09 93.5 627.09 line
93.9 627.09 0 0 1 5 (CLOCK) text
0.251 0.878 0.816 setrgbcolor
93.4 627.09 0 2 0 5 (clk=x) text
0.2 setlinewidth
0.000 1.000 0.000 setrgbcolor
98.5 627.99 98.1 627.99 line
98 627.99 0 2 1 1 (Q) text
0.251 0.878 0.816 setrgbcolor
98.1 627.99 0 0 0 16 (len_sum[8:0]=xxx) text
0.000 0.000 0.000 setrgbcolor
257.9 623.99 4.6 3.6 rectfill
0.251 0.878 0.816 setrgbcolor
0.1 setlinewidth
0.000 1.000 0.000 setrgbcolor
257.9 623.99 4.6 3.6 rectstroke
257.9 624.79 newpath moveto
258.2 624.89 lineto
257.9 624.99 lineto
stroke
0.546424 textsize
260.2 627.69 0 1 0 10 (FlipFlop_5) text
257.4 626.69 257.9 626.69 line
0.455353 textsize
258 626.69 0 0 1 1 (D) text
257.4 625.79 257.9 625.79 line
258 625.79 0 0 1 4 (LOAD) text
257.4 624.79 257.9 624.79 line
258.3 624.89 0 0 1 5 (CLOCK) text
0.251 0.878 0.816 setrgbcolor
257.8 624.89 0 2 0 5 (clk=x) text
0.2 setlinewidth
0.000 1.000 0.000 setrgbcolor
262.9 625.79 262.5 625.79 line
262.4 625.79 0 2 1 1 (Q) text
0.251 0.878 0.816 setrgbcolor
262.5 625.79 0 0 0 51 (data_tmp[511:0]=xxxxxxxxxxxxxxxxxxxxxxxxxxxxxxxx...) text
0.000 0.000 0.000 setrgbcolor
49.3 632.09 1.8 filledcircle
0.251 0.878 0.816 setrgbcolor
0.1 setlinewidth
0.000 1.000 0.000 setrgbcolor
49.3 632.09 1.8 circle
50.2 632.09 50.2 632.09 line
0.546424 textsize
49.3 632.09 0 1 1 4 (init) text
50.7 632.09 50.2 632.09 line
0.455353 textsize
50.3 632.09 0 0 0 3 (\(0\)) text
0.000 0.000 0.000 setrgbcolor
258.8 640.29 1.8 filledcircle
0.000 1.000 0.000 setrgbcolor
258.8 640.29 1.8 circle
259.7 640.29 259.7 640.29 line
0.546424 textsize
258.8 640.29 0 1 1 4 (init) text
260.1 640.29 259.7 640.29 line
0.455353 textsize
259.8 640.29 0 0 0 3 (\(1\)) text
0.000 0.000 0.000 setrgbcolor
66.6 627.99 1.8 filledcircle
0.000 1.000 0.000 setrgbcolor
66.6 627.99 1.8 circle
67.5 627.99 67.5 627.99 line
0.546424 textsize
66.6 627.99 0 1 1 4 (init) text
68 627.99 67.5 627.99 line
0.455353 textsize
67.6 627.99 0 0 0 3 (\(7\)) text
0.000 0.000 0.000 setrgbcolor
209.6 633.99 1.8 filledcircle
0.000 1.000 0.000 setrgbcolor
209.6 633.99 1.8 circle
210.5 633.99 210.5 633.99 line
208.7 634.49 208.8 634.39 line
208.7 633.49 208.8 633.59 line
0.546424 textsize
209.6 633.99 0 1 1 2 (<<) text
211 633.99 210.5 633.99 line
0.2 setlinewidth
1.000 0.000 0.000 setrgbcolor
208.2 634.39 208.7 634.39 line
0.455353 textsize
208.6 634.49 0 2 0 50 (data_in[255:0]=xxxxxxxxxxxxxxxxxxxxxxxxxxxxxxxx...) text
208.2 633.49 208.7 633.49 line
208.6 633.59 0 2 0 24 (current_len_reg[8:0]=xxx) text
0.000 0.000 0.000 setrgbcolor
209.6 637.59 1.8 filledcircle
1.000 0.000 0.000 setrgbcolor
0.1 setlinewidth
0.000 1.000 0.000 setrgbcolor
209.6 637.59 1.8 circle
210.5 637.59 210.5 637.59 line
208.7 638.09 208.8 637.99 line
208.7 637.09 208.8 637.19 line
0.546424 textsize
209.6 637.59 0 1 1 2 (<<) text
211 637.59 210.5 637.59 line
0.2 setlinewidth
1.000 0.000 0.000 setrgbcolor
208.2 637.99 208.7 637.99 line
0.455353 textsize
208.6 638.09 0 2 0 50 (data_in[255:0]=xxxxxxxxxxxxxxxxxxxxxxxxxxxxxxxx...) text
208.2 637.09 208.7 637.09 line
208.6 637.19 0 2 0 24 (current_len_reg[8:0]=xxx) text
0.1 setlinewidth
0.000 1.000 0.000 setrgbcolor
109.9 632.59 109.9 630.79 line
109.4 632.09 109.9 632.09 line
109.8 632.19 0 2 0 3 (\(0\)) text
110.3 632.09 109.9 632.09 line
0.2 setlinewidth
1.000 0.000 0.000 setrgbcolor
109.4 631.19 109.9 631.19 line
109.8 631.29 0 2 0 15 (len_sum[7:0]=xx) text
0.1 setlinewidth
0.000 1.000 0.000 setrgbcolor
109.9 630.29 109.9 628.49 line
109.4 629.89 109.9 629.89 line
109.8 629.89 0 2 0 3 (\(0\)) text
110.3 629.89 109.9 629.89 line
0.2 setlinewidth
1.000 0.000 0.000 setrgbcolor
109.4 628.89 109.9 628.89 line
109.8 628.99 0 2 0 15 (len_sum[7:0]=xx) text
0.1 setlinewidth
0.000 1.000 0.000 setrgbcolor
127.2 637.09 127.2 635.29 line
126.7 636.69 127.2 636.69 line
127.1 636.69 0 2 0 3 (\(0\)) text
127.6 636.69 127.2 636.69 line
0.2 setlinewidth
1.000 0.000 0.000 setrgbcolor
126.7 635.79 127.2 635.79 line
127.1 635.79 0 2 0 53 (data_tmp[511:256]=xxxxxxxxxxxxxxxxxxxxxxxxxxxxxxxx...) text
0.1 setlinewidth
0.000 1.000 0.000 setrgbcolor
127.2 639.89 127.2 638.09 line
126.7 639.39 127.2 639.39 line
127.1 639.49 0 2 0 3 (\(0\)) text
127.6 639.39 127.2 639.39 line
0.2 setlinewidth
1.000 0.000 0.000 setrgbcolor
126.7 638.49 127.2 638.49 line
127.1 638.59 0 2 0 53 (data_tmp[511:256]=xxxxxxxxxxxxxxxxxxxxxxxxxxxxxxxx...) text
0.1 setlinewidth
0.000 1.000 0.000 setrgbcolor
65.7 633.99 65.7 632.19 line
65.3 633.49 65.7 633.49 line
65.6 633.59 0 2 0 3 (\(0\)) text
66.2 633.49 65.7 633.49 line
0.2 setlinewidth
1.000 0.000 0.000 setrgbcolor
65.3 632.59 65.7 632.59 line
65.6 632.69 0 2 0 14 (len_in[7:0]=xx) text
0.1 setlinewidth
0.000 1.000 0.000 setrgbcolor
57.5 632.09 57.5 630.29 line
57.1 631.69 57.5 631.69 line
57.4 631.69 0 2 0 3 (\(0\)) text
58 631.69 57.5 631.69 line
0.2 setlinewidth
1.000 0.000 0.000 setrgbcolor
57.1 630.79 57.5 630.79 line
57.4 630.79 0 2 0 14 (len_in[7:0]=xx) text
0.000 0.000 0.000 setrgbcolor
127.2 633.09 newpath moveto
129 632.39 lineto
129 630.99 lineto
127.2 630.29 lineto
closepath
fill
1.000 0.000 0.000 setrgbcolor
0.1 setlinewidth
0.000 1.000 0.000 setrgbcolor
127.2 633.09 newpath moveto
129 632.39 lineto
129 630.99 lineto
127.2 630.29 lineto
closepath
stroke
1.000 0.000 0.000 setrgbcolor
128.1 632.99 128.1 632.69 line
128 633.09 0 2 0 12 (len_sum[8]=x) text
0.000 1.000 0.000 setrgbcolor
126.7 632.09 127.2 632.09 line
129.5 631.69 129 631.69 line
0.2 setlinewidth
1.000 0.000 0.000 setrgbcolor
126.7 631.19 127.2 631.19 line
127.1 631.29 0 2 0 16 (len_sum[8:0]=xxx) text
0.000 0.000 0.000 setrgbcolor
127.2 628.99 newpath moveto
129 628.29 lineto
129 626.89 lineto
127.2 626.19 lineto
closepath
fill
1.000 0.000 0.000 setrgbcolor
0.1 setlinewidth
0.000 1.000 0.000 setrgbcolor
127.2 628.99 newpath moveto
129 628.29 lineto
129 626.89 lineto
127.2 626.19 lineto
closepath
stroke
1.000 0.000 0.000 setrgbcolor
128.1 628.89 128.1 628.59 line
128 628.99 0 2 0 12 (len_sum[8]=x) text
0.000 1.000 0.000 setrgbcolor
126.7 627.99 127.2 627.99 line
129.5 627.59 129 627.59 line
0.2 setlinewidth
1.000 0.000 0.000 setrgbcolor
126.7 627.09 127.2 627.09 line
127.1 627.19 0 2 0 16 (len_sum[8:0]=xxx) text
0.000 0.000 0.000 setrgbcolor
148.1 629.39 newpath moveto
149.9 628.69 lineto
149.9 627.29 lineto
148.1 626.59 lineto
closepath
fill
1.000 0.000 0.000 setrgbcolor
0.1 setlinewidth
0.000 1.000 0.000 setrgbcolor
148.1 629.39 newpath moveto
149.9 628.69 lineto
149.9 627.29 lineto
148.1 626.59 lineto
closepath
stroke
1.000 0.000 0.000 setrgbcolor
149 629.39 149 628.99 line
148.9 629.39 0 2 0 6 (last=x) text
0.000 1.000 0.000 setrgbcolor
147.7 628.49 148.1 628.49 line
147.7 627.59 148.1 627.59 line
150.4 627.99 149.9 627.99 line
0.000 0.000 0.000 setrgbcolor
160.9 624.89 newpath moveto
162.7 624.19 lineto
162.7 622.79 lineto
160.9 622.09 lineto
closepath
fill
0.000 1.000 0.000 setrgbcolor
160.9 624.89 newpath moveto
162.7 624.19 lineto
162.7 622.79 lineto
160.9 622.09 lineto
closepath
stroke
1.000 0.000 0.000 setrgbcolor
161.8 624.79 161.8 624.49 line
161.7 624.89 0 2 0 8 (enable=x) text
0.000 1.000 0.000 setrgbcolor
160.4 623.89 160.9 623.89 line
163.2 623.49 162.7 623.49 line
0.2 setlinewidth
1.000 0.000 0.000 setrgbcolor
160.4 622.99 160.9 622.99 line
160.8 623.09 0 2 0 24 (current_len_reg[8:0]=xxx) text
0.000 0.000 0.000 setrgbcolor
148.1 638.09 newpath moveto
149.9 637.39 lineto
149.9 635.99 lineto
148.1 635.29 lineto
closepath
fill
1.000 0.000 0.000 setrgbcolor
0.1 setlinewidth
0.000 1.000 0.000 setrgbcolor
148.1 638.09 newpath moveto
149.9 637.39 lineto
149.9 635.99 lineto
148.1 635.29 lineto
closepath
stroke
1.000 0.000 0.000 setrgbcolor
149 637.99 149 637.69 line
148.9 638.09 0 2 0 12 (len_sum[8]=x) text
0.000 1.000 0.000 setrgbcolor
147.7 637.09 148.1 637.09 line
150.4 636.69 149.9 636.69 line
0.2 setlinewidth
1.000 0.000 0.000 setrgbcolor
147.7 636.19 148.1 636.19 line
148 636.29 0 2 0 51 (data_tmp[511:0]=xxxxxxxxxxxxxxxxxxxxxxxxxxxxxxxx...) text
0.000 0.000 0.000 setrgbcolor
148.1 643.09 newpath moveto
149.9 642.39 lineto
149.9 640.99 lineto
148.1 640.29 lineto
closepath
fill
1.000 0.000 0.000 setrgbcolor
0.1 setlinewidth
0.000 1.000 0.000 setrgbcolor
148.1 643.09 newpath moveto
149.9 642.39 lineto
149.9 640.99 lineto
148.1 640.29 lineto
closepath
stroke
1.000 0.000 0.000 setrgbcolor
149 643.09 149 642.69 line
148.9 643.09 0 2 0 12 (len_sum[8]=x) text
0.000 1.000 0.000 setrgbcolor
147.7 642.09 148.1 642.09 line
150.4 641.69 149.9 641.69 line
0.2 setlinewidth
1.000 0.000 0.000 setrgbcolor
147.7 641.19 148.1 641.19 line
148 641.29 0 2 0 51 (data_tmp[511:0]=xxxxxxxxxxxxxxxxxxxxxxxxxxxxxxxx...) text
0.000 0.000 0.000 setrgbcolor
160.9 629.39 newpath moveto
162.7 628.69 lineto
162.7 627.29 lineto
160.9 626.59 lineto
closepath
fill
1.000 0.000 0.000 setrgbcolor
0.1 setlinewidth
0.000 1.000 0.000 setrgbcolor
160.9 629.39 newpath moveto
162.7 628.69 lineto
162.7 627.29 lineto
160.9 626.59 lineto
closepath
stroke
1.000 0.000 0.000 setrgbcolor
161.8 629.39 161.8 628.99 line
161.7 629.39 0 2 0 6 (last=x) text
0.000 1.000 0.000 setrgbcolor
160.4 628.49 160.9 628.49 line
160.4 627.59 160.9 627.59 line
163.2 627.99 162.7 627.99 line
0.000 0.000 0.000 setrgbcolor
180.9 628.99 newpath moveto
182.7 628.29 lineto
182.7 626.89 lineto
180.9 626.19 lineto
closepath
fill
0.000 1.000 0.000 setrgbcolor
180.9 628.99 newpath moveto
182.7 628.29 lineto
182.7 626.89 lineto
180.9 626.19 lineto
closepath
stroke
1.000 0.000 0.000 setrgbcolor
181.8 628.89 181.8 628.59 line
181.7 628.99 0 2 0 8 (enable=x) text
0.000 1.000 0.000 setrgbcolor
180.5 627.99 180.9 627.99 line
183.2 627.59 182.7 627.59 line
0.2 setlinewidth
1.000 0.000 0.000 setrgbcolor
180.5 627.09 180.9 627.09 line
180.8 627.19 0 2 0 55 (data_out_reg[511:0]=xxxxxxxxxxxxxxxxxxxxxxxxxxxxxxxx...) text
0.000 0.000 0.000 setrgbcolor
293.4 642.19 newpath moveto
295.2 641.49 lineto
295.2 640.09 lineto
293.4 639.39 lineto
closepath
fill
1.000 0.000 0.000 setrgbcolor
0.1 setlinewidth
0.000 1.000 0.000 setrgbcolor
293.4 642.19 newpath moveto
295.2 641.49 lineto
295.2 640.09 lineto
293.4 639.39 lineto
closepath
stroke
1.000 0.000 0.000 setrgbcolor
294.3 642.09 294.3 641.79 line
294.2 642.19 0 2 0 12 (len_sum[8]=x) text
0.000 1.000 0.000 setrgbcolor
292.9 641.19 293.4 641.19 line
293.3 641.29 0 2 0 3 (\(0\)) text
292.9 640.29 293.4 640.29 line
293.3 640.39 0 2 0 3 (\(1\)) text
295.7 640.79 295.2 640.79 line
0.000 0.000 0.000 setrgbcolor
293.4 638.09 newpath moveto
295.2 637.39 lineto
295.2 635.99 lineto
293.4 635.29 lineto
closepath
fill
0.000 1.000 0.000 setrgbcolor
293.4 638.09 newpath moveto
295.2 637.39 lineto
295.2 635.99 lineto
293.4 635.29 lineto
closepath
stroke
1.000 0.000 0.000 setrgbcolor
294.3 637.99 294.3 637.69 line
294.2 638.09 0 2 0 12 (len_sum[8]=x) text
0.000 1.000 0.000 setrgbcolor
292.9 637.09 293.4 637.09 line
293.3 637.19 0 2 0 3 (\(0\)) text
292.9 636.19 293.4 636.19 line
293.3 636.29 0 2 0 3 (\(1\)) text
295.7 636.69 295.2 636.69 line
0.000 0.000 0.000 setrgbcolor
301.1 633.09 newpath moveto
302.9 632.39 lineto
302.9 630.99 lineto
301.1 630.29 lineto
closepath
fill
0.000 1.000 0.000 setrgbcolor
301.1 633.09 newpath moveto
302.9 632.39 lineto
302.9 630.99 lineto
301.1 630.29 lineto
closepath
stroke
1.000 0.000 0.000 setrgbcolor
302 632.99 302 632.69 line
301.9 633.09 0 2 0 6 (last=x) text
0.000 1.000 0.000 setrgbcolor
300.7 632.09 301.1 632.09 line
300.7 631.19 301.1 631.19 line
303.4 631.69 302.9 631.69 line
0.000 0.000 0.000 setrgbcolor
310.2 626.69 newpath moveto
312 625.99 lineto
312 624.59 lineto
310.2 623.89 lineto
closepath
fill
0.000 1.000 0.000 setrgbcolor
310.2 626.69 newpath moveto
312 625.99 lineto
312 624.59 lineto
310.2 623.89 lineto
closepath
stroke
1.000 0.000 0.000 setrgbcolor
311.1 626.69 311.1 626.29 line
311 626.69 0 2 0 8 (enable=x) text
0.000 1.000 0.000 setrgbcolor
309.8 625.79 310.2 625.79 line
310.1 625.79 0 2 0 3 (\(0\)) text
309.8 624.79 310.2 624.79 line
312.5 625.29 312 625.29 line
0.000 0.000 0.000 setrgbcolor
293.4 632.19 newpath moveto
295.2 631.49 lineto
295.2 630.09 lineto
293.4 629.39 lineto
closepath
fill
0.000 1.000 0.000 setrgbcolor
293.4 632.19 newpath moveto
295.2 631.49 lineto
295.2 630.09 lineto
293.4 629.39 lineto
closepath
stroke
1.000 0.000 0.000 setrgbcolor
294.3 632.09 294.3 631.79 line
294.2 632.19 0 2 0 12 (len_sum[8]=x) text
0.000 1.000 0.000 setrgbcolor
292.9 631.19 293.4 631.19 line
293.3 631.29 0 2 0 3 (\(0\)) text
295.7 630.79 295.2 630.79 line
0.2 setlinewidth
1.000 0.000 0.000 setrgbcolor
292.9 630.29 293.4 630.29 line
293.3 630.39 0 2 0 51 (data_tmp[255:0]=xxxxxxxxxxxxxxxxxxxxxxxxxxxxxxxx...) text
0.000 0.000 0.000 setrgbcolor
293.4 628.09 newpath moveto
295.2 627.39 lineto
295.2 625.99 lineto
293.4 625.29 lineto
closepath
fill
1.000 0.000 0.000 setrgbcolor
0.1 setlinewidth
0.000 1.000 0.000 setrgbcolor
293.4 628.09 newpath moveto
295.2 627.39 lineto
295.2 625.99 lineto
293.4 625.29 lineto
closepath
stroke
1.000 0.000 0.000 setrgbcolor
294.3 627.99 294.3 627.69 line
294.2 628.09 0 2 0 12 (len_sum[8]=x) text
0.000 1.000 0.000 setrgbcolor
292.9 627.09 293.4 627.09 line
293.3 627.19 0 2 0 3 (\(0\)) text
295.7 626.69 295.2 626.69 line
0.2 setlinewidth
1.000 0.000 0.000 setrgbcolor
292.9 626.19 293.4 626.19 line
293.3 626.29 0 2 0 51 (data_tmp[255:0]=xxxxxxxxxxxxxxxxxxxxxxxxxxxxxxxx...) text
0.000 0.000 0.000 setrgbcolor
301.1 628.49 newpath moveto
302.9 627.79 lineto
302.9 626.39 lineto
301.1 625.69 lineto
closepath
fill
1.000 0.000 0.000 setrgbcolor
0.1 setlinewidth
0.000 1.000 0.000 setrgbcolor
301.1 628.49 newpath moveto
302.9 627.79 lineto
302.9 626.39 lineto
301.1 625.69 lineto
closepath
stroke
1.000 0.000 0.000 setrgbcolor
302 628.49 302 628.09 line
301.9 628.49 0 2 0 6 (last=x) text
0.000 1.000 0.000 setrgbcolor
300.7 627.59 301.1 627.59 line
300.7 626.69 301.1 626.69 line
303.4 627.09 302.9 627.09 line
0.000 0.000 0.000 setrgbcolor
310.2 621.69 newpath moveto
312 620.99 lineto
312 619.59 lineto
310.2 618.89 lineto
closepath
fill
0.000 1.000 0.000 setrgbcolor
310.2 621.69 newpath moveto
312 620.99 lineto
312 619.59 lineto
310.2 618.89 lineto
closepath
stroke
1.000 0.000 0.000 setrgbcolor
311.1 621.69 311.1 621.29 line
311 621.69 0 2 0 8 (enable=x) text
0.000 1.000 0.000 setrgbcolor
309.8 620.69 310.2 620.69 line
310.1 620.79 0 2 0 3 (\(0\)) text
309.8 619.79 310.2 619.79 line
312.5 620.29 312 620.29 line
0.000 0.000 0.000 setrgbcolor
85.3 628.99 newpath moveto
87.1 628.29 lineto
87.1 626.89 lineto
85.3 626.19 lineto
closepath
fill
0.000 1.000 0.000 setrgbcolor
85.3 628.99 newpath moveto
87.1 628.29 lineto
87.1 626.89 lineto
85.3 626.19 lineto
closepath
stroke
1.000 0.000 0.000 setrgbcolor
86.2 628.89 86.2 628.59 line
86.1 628.99 0 2 0 6 (last=x) text
0.000 1.000 0.000 setrgbcolor
84.8 627.99 85.3 627.99 line
84.8 627.09 85.3 627.09 line
87.6 627.59 87.1 627.59 line
0.000 0.000 0.000 setrgbcolor
251.5 633.09 newpath moveto
253.3 632.39 lineto
253.3 630.99 lineto
251.5 630.29 lineto
closepath
fill
0.000 1.000 0.000 setrgbcolor
251.5 633.09 newpath moveto
253.3 632.39 lineto
253.3 630.99 lineto
251.5 630.29 lineto
closepath
stroke
1.000 0.000 0.000 setrgbcolor
252.4 632.99 252.4 632.69 line
252.3 633.09 0 2 0 6 (last=x) text
0.000 1.000 0.000 setrgbcolor
251 632.09 251.5 632.09 line
251 631.19 251.5 631.19 line
253.8 631.69 253.3 631.69 line
0.000 0.000 0.000 setrgbcolor
78.6 621.69 0.3 filledcircle
0.000 1.000 0.000 setrgbcolor
0.000 0.000 0.000 setrgbcolor
77.1 621.69 newpath moveto
77.1 622.19 lineto
78.5 621.69 lineto
77.1 621.19 lineto
closepath
fill
0.000 1.000 0.000 setrgbcolor
78.6 621.69 0.3 circle
77.1 621.69 newpath moveto
77.1 622.19 lineto
78.5 621.69 lineto
77.1 621.19 lineto
closepath
stroke
76.6 621.69 77.1 621.69 line
0.251 0.878 0.816 setrgbcolor
77 621.69 0 2 0 7 (reset=x) text
0.000 1.000 0.000 setrgbcolor
79.4 621.69 78.8 621.69 line
0.000 0.000 0.000 setrgbcolor
244.8 624.39 0.3 filledcircle
0.000 1.000 0.000 setrgbcolor
0.000 0.000 0.000 setrgbcolor
243.3 624.39 newpath moveto
243.3 624.89 lineto
244.7 624.39 lineto
243.3 623.89 lineto
closepath
fill
0.000 1.000 0.000 setrgbcolor
244.8 624.39 0.3 circle
243.3 624.39 newpath moveto
243.3 624.89 lineto
244.7 624.39 lineto
243.3 623.89 lineto
closepath
stroke
242.8 624.39 243.3 624.39 line
0.251 0.878 0.816 setrgbcolor
243.2 624.39 0 2 0 7 (reset=x) text
0.000 1.000 0.000 setrgbcolor
245.6 624.39 245 624.39 line
0.000 0.000 0.000 setrgbcolor
243.3 634.69 newpath moveto
243.5 634.39 lineto
243.6 634.19 lineto
243.6 633.79 lineto
243.5 633.59 lineto
243.3 633.29 lineto
243.3 633.29 lineto
244 633.29 lineto
244 633.29 lineto
244.3 633.39 lineto
244.5 633.49 lineto
244.7 633.59 lineto
245 633.79 lineto
245.1 633.99 lineto
245.1 633.99 lineto
245 634.19 lineto
244.7 634.39 lineto
244.5 634.49 lineto
244.3 634.59 lineto
244 634.69 lineto
244 634.69 lineto
closepath
fill
0.000 1.000 0.000 setrgbcolor
242.691 633.99 0.927934 49 -49 newpath arcn stroke
243.3 633.29 244 633.29 line
243.807 634.808 1.53052 -83 -32 newpath arc stroke
243.897 633.313 1.38066 29 86 newpath arc stroke
244 634.69 243.3 634.69 line
242.8 634.39 243.5 634.39 line
245.6 633.99 245.1 633.99 line
0.2 setlinewidth
1.000 0.000 0.000 setrgbcolor
242.8 633.49 243.5 633.49 line
243.3 633.59 0 2 0 55 (data_out_reg[511:0]=xxxxxxxxxxxxxxxxxxxxxxxxxxxxxxxx...) text
0.000 0.000 0.000 setrgbcolor
243.3 631.89 newpath moveto
243.5 631.59 lineto
243.6 631.39 lineto
243.6 630.99 lineto
243.5 630.79 lineto
243.3 630.49 lineto
243.3 630.49 lineto
244 630.49 lineto
244 630.49 lineto
244.3 630.59 lineto
244.5 630.69 lineto
244.7 630.79 lineto
245 630.99 lineto
245.1 631.19 lineto
245.1 631.19 lineto
245 631.39 lineto
244.7 631.59 lineto
244.5 631.69 lineto
244.3 631.79 lineto
244 631.89 lineto
244 631.89 lineto
closepath
fill
1.000 0.000 0.000 setrgbcolor
0.1 setlinewidth
0.000 1.000 0.000 setrgbcolor
242.691 631.19 0.927934 49 -49 newpath arcn stroke
243.3 630.49 244 630.49 line
243.807 632.008 1.53052 -83 -32 newpath arc stroke
243.897 630.513 1.38066 29 86 newpath arc stroke
244 631.89 243.3 631.89 line
242.8 631.69 243.5 631.69 line
245.6 631.19 245.1 631.19 line
0.2 setlinewidth
1.000 0.000 0.000 setrgbcolor
242.8 630.79 243.5 630.79 line
243.3 630.79 0 2 0 55 (data_out_reg[511:0]=xxxxxxxxxxxxxxxxxxxxxxxxxxxxxxxx...) text
0.000 0.000 0.000 setrgbcolor
502.8 635.79 newpath moveto
502.8 636.29 lineto
504.2 635.79 lineto
502.8 635.29 lineto
closepath
fill
1.000 0.000 0.000 setrgbcolor
0.1 setlinewidth
0.000 1.000 0.000 setrgbcolor
502.8 635.79 newpath moveto
502.8 636.29 lineto
504.2 635.79 lineto
502.8 635.29 lineto
closepath
stroke
1.000 0.000 0.000 setrgbcolor
502.4 635.79 502.8 635.79 line
502.7 635.79 0 2 0 15 (out_ready_reg=x) text
504.7 635.79 504.2 635.79 line
504.3 635.79 0 0 0 11 (out_ready=x) text
0.000 0.000 0.000 setrgbcolor
415.9 622.09 6.8 4.9 rectfill
1.000 0.000 0.000 setrgbcolor
0.000 1.000 1.000 setrgbcolor
415.9 622.09 6.8 4.9 rectstroke
0.546424 textsize
419.3 627.09 0 1 0 21 (shift_reg_512bits_UUT) text
419.3 622.09 0 1 2 17 (shift_reg_512bits) text
1.000 0.000 0.000 setrgbcolor
415.4 626.19 415.9 626.19 line
0.455353 textsize
415.8 626.29 0 2 0 5 (clk=x) text
415.4 624.39 415.9 624.39 line
415.8 624.49 0 2 0 5 (rst=x) text
415.4 622.59 415.9 622.59 line
415.8 622.59 0 2 0 26 (barrel_shifter_data_full=x) text
0.2 setlinewidth
415.4 625.29 415.9 625.29 line
415.8 625.39 0 2 0 12 (state[2:0]=x) text
415.4 623.49 415.9 623.49 line
415.8 623.59 0 2 0 71 (barrel_shifter_data_to_write[255:0]=xxxxxxxxxxxxxxxxxxxxxxxxxxxxxxxx...) text
423.2 624.39 422.7 624.39 line
422.8 624.49 0 0 0 55 (out_data_op2[511:0]=xxxxxxxxxxxxxxxxxxxxxxxxxxxxxxxx...) text
0.1 setlinewidth
0.000 1.000 1.000 setrgbcolor
416.3 626.19 415.9 626.19 line
416 626.29 0 0 0 3 (clk) text
416.3 624.39 415.9 624.39 line
416 624.49 0 0 0 5 (reset) text
416.3 622.59 415.9 622.59 line
416 622.59 0 0 0 6 (enable) text
0.2 setlinewidth
416.3 625.29 415.9 625.29 line
416 625.39 0 0 0 10 (state[2:0]) text
416.3 623.49 415.9 623.49 line
416 623.59 0 0 0 14 (data_in[255:0]) text
422.2 624.39 422.7 624.39 line
422.6 624.49 0 2 0 15 (data_out[511:0]) text
0.400 0.400 0.400 setrgbcolor
415.4 625.29 newpath moveto
398.1 625.29 lineto
398.1 627.99 lineto
442.3 627.99 lineto
stroke
442.1 627.79 0.4 0.4 rectfill
445 635.79 newpath moveto
442.3 635.79 lineto
442.3 626.19 lineto
495.6 626.19 lineto
495.6 629.39 lineto
493.7 629.39 lineto
stroke
495.6 627.09 502.4 627.09 line
495.4 626.89 0.4 0.4 rectfill
0.1 setlinewidth
415.4 625.29 newpath moveto
398.1 625.29 lineto
398.1 627.99 lineto
442.3 627.99 lineto
stroke
445 635.79 newpath moveto
442.3 635.79 lineto
442.3 626.19 lineto
495.6 626.19 lineto
495.6 629.39 lineto
493.7 629.39 lineto
stroke
495.6 627.09 502.4 627.09 line
415.4 622.59 newpath moveto
395.4 622.59 lineto
395.4 639.89 lineto
442.3 639.89 lineto
442.3 639.39 lineto
445 639.39 lineto
stroke
373.5 624.39 395.4 624.39 line
395.3 624.19 0.3 0.3 rectfill
0.2 setlinewidth
0.549 0.549 0.549 setrgbcolor
373.5 617.59 391.5 617.59 line
0.000 0.820 0.820 setrgbcolor
391.5 617.59 391.7 617.79 line
0.400 0.400 0.400 setrgbcolor
391.7 617.79 newpath moveto
391.7 641.69 lineto
441.4 641.69 lineto
441.4 632.09 lineto
445 632.09 lineto
stroke
0.000 0.820 0.820 setrgbcolor
441.4 637.79 441.6 637.59 line
0.549 0.549 0.549 setrgbcolor
441.6 637.59 445 637.59 line
0.1 setlinewidth
373.5 617.59 391.5 617.59 line
0.000 0.820 0.820 setrgbcolor
391.5 617.59 391.7 617.79 line
0.400 0.400 0.400 setrgbcolor
391.7 617.79 newpath moveto
391.7 641.69 lineto
441.4 641.69 lineto
441.4 632.09 lineto
445 632.09 lineto
stroke
0.000 0.820 0.820 setrgbcolor
441.4 637.79 441.6 637.59 line
0.549 0.549 0.549 setrgbcolor
441.6 637.59 445 637.59 line
0.2 setlinewidth
373.5 617.59 392.4 617.59 line
0.000 0.820 0.820 setrgbcolor
392.4 617.59 392.6 617.79 line
0.400 0.400 0.400 setrgbcolor
392.6 617.79 newpath moveto
392.6 640.79 lineto
443.2 640.79 lineto
443.2 637.79 lineto
stroke
0.000 0.820 0.820 setrgbcolor
443.2 637.79 443.4 637.59 line
0.549 0.549 0.549 setrgbcolor
443.4 637.59 445 637.59 line
0.1 setlinewidth
373.5 617.59 392.4 617.59 line
0.000 0.820 0.820 setrgbcolor
392.4 617.59 392.6 617.79 line
0.400 0.400 0.400 setrgbcolor
392.6 617.79 newpath moveto
392.6 640.79 lineto
443.2 640.79 lineto
443.2 637.79 lineto
stroke
0.000 0.820 0.820 setrgbcolor
443.2 637.79 443.4 637.59 line
0.549 0.549 0.549 setrgbcolor
443.4 637.59 445 637.59 line
0.2 setlinewidth
0.400 0.400 0.400 setrgbcolor
373.5 619.79 newpath moveto
394.5 619.79 lineto
394.5 634.39 lineto
440.5 634.39 lineto
440.5 634.89 lineto
445 634.89 lineto
stroke
394.5 623.49 415.4 623.49 line
394.5 632.59 415.4 632.59 line
394.3 623.29 0.4 0.4 rectfill
394.3 632.39 0.4 0.4 rectfill
0.1 setlinewidth
373.5 619.79 newpath moveto
394.5 619.79 lineto
394.5 634.39 lineto
440.5 634.39 lineto
440.5 634.89 lineto
445 634.89 lineto
stroke
394.5 623.49 415.4 623.49 line
394.5 632.59 415.4 632.59 line
0.2 setlinewidth
422.2 632.59 newpath moveto
440.5 632.59 lineto
440.5 632.99 lineto
445 632.99 lineto
stroke
0.1 setlinewidth
422.2 632.59 newpath moveto
440.5 632.59 lineto
440.5 632.99 lineto
445 632.99 lineto
stroke
57.1 631.69 newpath moveto
52 631.69 lineto
52 633.49 lineto
58.9 633.49 lineto
stroke
58.8 633.29 0.3 0.3 rectfill
50.7 632.09 52 632.09 line
51.9 631.89 0.3 0.3 rectfill
65.3 633.49 newpath moveto
58.9 633.49 lineto
58.9 634.39 lineto
103 634.39 lineto
103 629.89 lineto
109.4 629.89 lineto
stroke
103 634.39 newpath moveto
112.2 634.39 lineto
112.2 639.39 lineto
126.7 639.39 lineto
stroke
112.2 634.89 newpath moveto
192.3 634.89 lineto
192.3 635.29 lineto
277.4 635.29 lineto
stroke
277.4 631.19 292.9 631.19 line
277.4 627.09 292.9 627.09 line
277.3 636.89 0.3 0.3 rectfill
277.3 635.09 0.3 0.3 rectfill
277.3 630.99 0.3 0.3 rectfill
277.3 626.89 0.3 0.3 rectfill
103 632.09 109.4 632.09 line
102.9 634.19 0.3 0.3 rectfill
102.9 631.89 0.3 0.3 rectfill
112.2 636.69 126.7 636.69 line
112.1 634.69 0.3 0.3 rectfill
112.1 636.49 0.3 0.3 rectfill
292.9 641.19 newpath moveto
277.4 641.19 lineto
277.4 624.79 lineto
307 624.79 lineto
stroke
306.9 624.59 0.3 0.3 rectfill
277.4 637.09 292.9 637.09 line
309.8 625.79 newpath moveto
307 625.79 lineto
307 620.69 lineto
309.8 620.69 lineto
stroke
260.1 640.29 newpath moveto
280.2 640.29 lineto
280.2 636.19 lineto
292.9 636.19 lineto
stroke
280.2 640.29 292.9 640.29 line
280.1 640.09 0.3 0.3 rectfill
68 627.99 76.6 627.99 line
163.2 623.49 180.5 623.49 line
150.4 627.99 newpath moveto
152.2 627.99 lineto
152.2 623.89 lineto
160.4 623.89 lineto
stroke
129.5 631.69 newpath moveto
130.4 631.69 lineto
130.4 628.49 lineto
147.7 628.49 lineto
stroke
110.3 632.09 126.7 632.09 line
129.5 627.59 147.7 627.59 line
110.3 629.89 newpath moveto
111.2 629.89 lineto
111.2 628.89 lineto
122.2 628.89 lineto
122.2 627.99 lineto
126.7 627.99 lineto
stroke
183.2 627.59 newpath moveto
192.3 627.59 lineto
192.3 623.49 lineto
208.2 623.49 lineto
stroke
163.2 627.99 180.5 627.99 line
150.4 636.69 newpath moveto
153.1 636.69 lineto
153.1 628.49 lineto
160.4 628.49 lineto
stroke
127.6 636.69 newpath moveto
134 636.69 lineto
134 637.09 lineto
147.7 637.09 lineto
stroke
150.4 641.69 newpath moveto
154 641.69 lineto
154 627.59 lineto
160.4 627.59 lineto
stroke
127.6 639.39 newpath moveto
130.4 639.39 lineto
130.4 642.09 lineto
147.7 642.09 lineto
stroke
312.5 625.29 317.5 625.29 line
303.4 631.69 newpath moveto
308 631.69 lineto
308 624.79 lineto
309.8 624.79 lineto
stroke
295.7 640.79 newpath moveto
299.3 640.79 lineto
299.3 632.09 lineto
300.7 632.09 lineto
stroke
295.7 636.69 newpath moveto
297.5 636.69 lineto
297.5 631.19 lineto
300.7 631.19 lineto
stroke
312.5 620.29 newpath moveto
313.4 620.29 lineto
313.4 620.69 lineto
317.5 620.69 lineto
stroke
303.4 627.09 newpath moveto
304.3 627.09 lineto
304.3 619.79 lineto
309.8 619.79 lineto
stroke
295.7 630.79 newpath moveto
296.6 630.79 lineto
296.6 627.59 lineto
300.7 627.59 lineto
stroke
295.7 626.69 300.7 626.69 line
87.6 622.09 newpath moveto
89.4 622.09 lineto
89.4 627.99 lineto
93 627.99 lineto
stroke
79.4 621.69 84.8 621.69 line
87.6 627.59 newpath moveto
88.5 627.59 lineto
88.5 628.89 lineto
93 628.89 lineto
stroke
79.4 630.79 newpath moveto
82.1 630.79 lineto
82.1 627.99 lineto
84.8 627.99 lineto
stroke
66.2 633.49 newpath moveto
70.3 633.49 lineto
70.3 631.19 lineto
76.6 631.19 lineto
stroke
79.4 628.49 newpath moveto
81.2 628.49 lineto
81.2 627.09 lineto
84.8 627.09 lineto
stroke
68 630.79 newpath moveto
69.3 630.79 lineto
69.3 628.89 lineto
76.6 628.89 lineto
stroke
58 631.69 newpath moveto
58.9 631.69 lineto
58.9 631.19 lineto
65.3 631.19 lineto
stroke
253.8 624.79 newpath moveto
254.7 624.79 lineto
254.7 625.79 lineto
257.4 625.79 lineto
stroke
245.6 624.39 251 624.39 line
253.8 631.69 newpath moveto
254.7 631.69 lineto
254.7 626.69 lineto
257.4 626.69 lineto
stroke
245.6 633.99 newpath moveto
247.4 633.99 lineto
247.4 632.09 lineto
251 632.09 lineto
stroke
211 633.99 newpath moveto
227.4 633.99 lineto
227.4 634.39 lineto
242.8 634.39 lineto
stroke
245.6 631.19 251 631.19 line
211 637.59 newpath moveto
229.2 637.59 lineto
229.2 631.69 lineto
242.8 631.69 lineto
stroke
44.3 625.79 90.3 625.79 line
90.2 625.59 0.3 0.3 rectfill
93 627.09 newpath moveto
90.3 627.09 lineto
90.3 621.69 lineto
164.1 621.69 lineto
164.1 619.39 lineto
195.9 619.39 lineto
stroke
195.8 619.19 0.3 0.3 rectfill
164.1 621.69 180.5 621.69 line
164 621.49 0.3 0.3 rectfill
208.2 621.69 newpath moveto
195.9 621.69 lineto
195.9 619.39 lineto
255.6 619.39 lineto
255.6 624.79 lineto
257.4 624.79 lineto
stroke
255.6 622.59 newpath moveto
306.1 622.59 lineto
306.1 623.49 lineto
315.2 623.49 lineto
315.2 618.89 lineto
317.5 618.89 lineto
stroke
315.2 623.49 317.5 623.49 line
315.1 623.29 0.3 0.3 rectfill
255.5 622.39 0.3 0.3 rectfill
0.2 setlinewidth
354.4 634.89 372.6 634.89 line
0.1 setlinewidth
354.4 634.89 372.6 634.89 line
0.2 setlinewidth
65.3 630.29 newpath moveto
58.9 630.29 lineto
58.9 629.39 lineto
70.3 629.39 lineto
stroke
70.1 629.19 0.4 0.4 rectfill
76.6 630.29 newpath moveto
70.3 630.29 lineto
70.3 623.89 lineto
151.3 623.89 lineto
151.3 618.49 lineto
193.2 618.49 lineto
193.2 637.09 lineto
208.2 637.09 lineto
stroke
185.9 622.59 193.2 622.59 line
193.2 633.49 208.2 633.49 line
193.2 636.19 newpath moveto
278.4 636.19 lineto
278.4 634.89 lineto
352.1 634.89 lineto
stroke
151.3 622.99 160.4 622.99 line
151.1 622.79 0.4 0.4 rectfill
193 622.39 0.4 0.4 rectfill
193 633.29 0.4 0.4 rectfill
193 635.99 0.4 0.4 rectfill
0.1 setlinewidth
65.3 630.29 newpath moveto
58.9 630.29 lineto
58.9 629.39 lineto
70.3 629.39 lineto
stroke
76.6 630.29 newpath moveto
70.3 630.29 lineto
70.3 623.89 lineto
151.3 623.89 lineto
151.3 618.49 lineto
193.2 618.49 lineto
193.2 637.09 lineto
208.2 637.09 lineto
stroke
185.9 622.59 193.2 622.59 line
193.2 633.49 208.2 633.49 line
193.2 636.19 newpath moveto
278.4 636.19 lineto
278.4 634.89 lineto
352.1 634.89 lineto
stroke
151.3 622.99 160.4 622.99 line
354.4 624.39 372.6 624.39 line
323 624.39 352.1 624.39 line
0.2 setlinewidth
44.3 640.29 newpath moveto
132.2 640.29 lineto
132.2 639.89 lineto
195.9 639.89 lineto
195.9 634.39 lineto
208.2 634.39 lineto
stroke
195.9 637.99 208.2 637.99 line
195.7 637.79 0.4 0.4 rectfill
0.1 setlinewidth
44.3 640.29 newpath moveto
132.2 640.29 lineto
132.2 639.89 lineto
195.9 639.89 lineto
195.9 634.39 lineto
208.2 634.39 lineto
stroke
195.9 637.99 208.2 637.99 line
0.2 setlinewidth
354.4 617.59 372.6 617.59 line
0.1 setlinewidth
354.4 617.59 372.6 617.59 line
0.2 setlinewidth
180.5 627.09 newpath moveto
166.8 627.09 lineto
166.8 625.79 lineto
194.1 625.79 lineto
194.1 626.69 lineto
228.3 626.69 lineto
stroke
213.7 622.59 228.3 622.59 line
228.1 630.59 0.4 0.4 rectfill
228.1 626.49 0.4 0.4 rectfill
228.1 622.39 0.4 0.4 rectfill
242.8 633.49 newpath moveto
228.3 633.49 lineto
228.3 617.59 lineto
352.1 617.59 lineto
stroke
228.3 630.79 242.8 630.79 line
0.1 setlinewidth
180.5 627.09 newpath moveto
166.8 627.09 lineto
166.8 625.79 lineto
194.1 625.79 lineto
194.1 626.69 lineto
228.3 626.69 lineto
stroke
213.7 622.59 228.3 622.59 line
242.8 633.49 newpath moveto
228.3 633.49 lineto
228.3 617.59 lineto
352.1 617.59 lineto
stroke
228.3 630.79 242.8 630.79 line
0.2 setlinewidth
0.549 0.549 0.549 setrgbcolor
147.7 641.19 135.1 641.19 line
0.000 0.820 0.820 setrgbcolor
135.1 641.19 134.9 640.99 line
0.400 0.400 0.400 setrgbcolor
134.9 640.99 newpath moveto
134.9 632.59 lineto
246.5 632.59 lineto
246.5 630.29 lineto
250.1 630.29 lineto
250.1 629.89 lineto
276.5 629.89 lineto
stroke
276.3 625.99 0.4 0.4 rectfill
276.3 629.69 0.4 0.4 rectfill
0.000 0.820 0.820 setrgbcolor
134.9 636.49 135.1 636.19 line
0.549 0.549 0.549 setrgbcolor
135.1 636.19 147.7 636.19 line
262.9 625.79 276.3 625.79 line
0.000 0.820 0.820 setrgbcolor
276.3 625.79 276.5 625.99 line
0.400 0.400 0.400 setrgbcolor
276.5 625.99 newpath moveto
276.5 630.29 lineto
292.9 630.29 lineto
stroke
276.5 626.19 292.9 626.19 line
0.1 setlinewidth
0.549 0.549 0.549 setrgbcolor
147.7 641.19 135.1 641.19 line
0.000 0.820 0.820 setrgbcolor
135.1 641.19 134.9 640.99 line
0.400 0.400 0.400 setrgbcolor
134.9 640.99 newpath moveto
134.9 632.59 lineto
246.5 632.59 lineto
246.5 630.29 lineto
250.1 630.29 lineto
250.1 629.89 lineto
276.5 629.89 lineto
stroke
0.000 0.820 0.820 setrgbcolor
134.9 636.49 135.1 636.19 line
0.549 0.549 0.549 setrgbcolor
135.1 636.19 147.7 636.19 line
262.9 625.79 276.3 625.79 line
0.000 0.820 0.820 setrgbcolor
276.3 625.79 276.5 625.99 line
0.400 0.400 0.400 setrgbcolor
276.5 625.99 newpath moveto
276.5 630.29 lineto
292.9 630.29 lineto
stroke
276.5 626.19 292.9 626.19 line
0.2 setlinewidth
126.7 638.49 newpath moveto
113.1 638.49 lineto
113.1 635.79 lineto
126.7 635.79 lineto
stroke
113.1 637.59 133.1 637.59 line
0.000 0.820 0.820 setrgbcolor
133.1 636.49 133.3 636.19 line
0.549 0.549 0.549 setrgbcolor
133.3 636.19 147.7 636.19 line
0.400 0.400 0.400 setrgbcolor
132.9 637.39 0.4 0.4 rectfill
112.9 637.39 0.4 0.4 rectfill
0.549 0.549 0.549 setrgbcolor
147.7 641.19 133.3 641.19 line
0.000 0.820 0.820 setrgbcolor
133.3 641.19 133.1 640.99 line
0.400 0.400 0.400 setrgbcolor
133.1 640.99 newpath moveto
133.1 631.19 lineto
164.1 631.19 lineto
164.1 630.79 lineto
195.9 630.79 lineto
195.9 628.89 lineto
275.6 628.89 lineto
275.6 625.99 lineto
stroke
0.000 0.820 0.820 setrgbcolor
275.6 625.99 275.4 625.79 line
0.549 0.549 0.549 setrgbcolor
275.4 625.79 262.9 625.79 line
0.1 setlinewidth
0.400 0.400 0.400 setrgbcolor
126.7 638.49 newpath moveto
113.1 638.49 lineto
113.1 635.79 lineto
126.7 635.79 lineto
stroke
113.1 637.59 133.1 637.59 line
0.000 0.820 0.820 setrgbcolor
133.1 636.49 133.3 636.19 line
0.549 0.549 0.549 setrgbcolor
133.3 636.19 147.7 636.19 line
147.7 641.19 133.3 641.19 line
0.000 0.820 0.820 setrgbcolor
133.3 641.19 133.1 640.99 line
0.400 0.400 0.400 setrgbcolor
133.1 640.99 newpath moveto
133.1 631.19 lineto
164.1 631.19 lineto
164.1 630.79 lineto
195.9 630.79 lineto
195.9 628.89 lineto
275.6 628.89 lineto
275.6 625.99 lineto
stroke
0.000 0.820 0.820 setrgbcolor
275.6 625.99 275.4 625.79 line
0.549 0.549 0.549 setrgbcolor
275.4 625.79 262.9 625.79 line
0.2 setlinewidth
0.400 0.400 0.400 setrgbcolor
354.4 619.79 372.6 619.79 line
0.1 setlinewidth
354.4 619.79 372.6 619.79 line
0.2 setlinewidth
323 619.79 352.1 619.79 line
0.1 setlinewidth
323 619.79 352.1 619.79 line
44.3 622.99 81.2 622.99 line
81.1 622.79 0.3 0.3 rectfill
84.8 622.59 newpath moveto
81.2 622.59 lineto
81.2 624.79 lineto
153.1 624.79 lineto
153.1 625.79 lineto
165.9 625.79 lineto
165.9 629.89 lineto
195 629.89 lineto
195 625.79 lineto
247.4 625.79 lineto
247.4 623.49 lineto
305.2 623.49 lineto
stroke
305.1 623.29 0.3 0.3 rectfill
161.7 625.59 0.3 0.3 rectfill
161.8 625.79 161.8 624.79 line
181.7 629.69 0.3 0.3 rectfill
181.8 629.89 181.8 628.89 line
247.4 625.29 251 625.29 line
247.3 625.09 0.3 0.3 rectfill
311.1 626.69 newpath moveto
311.1 627.59 lineto
305.2 627.59 lineto
305.2 622.99 lineto
308.4 622.99 lineto
308.4 622.59 lineto
311.1 622.59 lineto
311.1 621.69 lineto
stroke
44.3 626.69 newpath moveto
80.3 626.69 lineto
80.3 629.89 lineto
91.2 629.89 lineto
91.2 625.79 lineto
133.1 625.79 lineto
133.1 630.29 lineto
165 630.29 lineto
165 631.69 lineto
227.4 631.69 lineto
227.4 629.89 lineto
248.3 629.89 lineto
248.3 633.99 lineto
298.4 633.99 lineto
298.4 629.39 lineto
302 629.39 lineto
302 628.49 lineto
stroke
298.4 633.99 newpath moveto
302 633.99 lineto
302 632.99 lineto
stroke
298.3 633.79 0.3 0.3 rectfill
86.1 629.69 0.3 0.3 rectfill
86.2 629.89 86.2 628.89 line
148.9 630.09 0.3 0.3 rectfill
149 630.29 149 629.39 line
161.7 630.09 0.3 0.3 rectfill
161.8 630.29 161.8 629.39 line
252.3 633.79 0.3 0.3 rectfill
252.4 633.99 252.4 632.99 line
0.2 setlinewidth
44.3 630.79 53 630.79 line
52.8 630.59 0.4 0.4 rectfill
57.1 630.79 newpath moveto
53 630.79 lineto
53 632.59 lineto
65.3 632.59 lineto
stroke
0.1 setlinewidth
44.3 630.79 53 630.79 line
57.1 630.79 newpath moveto
53 630.79 lineto
53 632.59 lineto
65.3 632.59 lineto
stroke
0.2 setlinewidth
109.4 631.19 newpath moveto
104 631.19 lineto
104 627.09 lineto
112.2 627.09 lineto
112.2 630.99 lineto
stroke
0.000 0.820 0.820 setrgbcolor
112.2 630.99 112.4 631.19 line
0.549 0.549 0.549 setrgbcolor
112.4 631.19 126.7 631.19 line
0.000 0.820 0.820 setrgbcolor
112.2 627.29 112.4 627.09 line
0.549 0.549 0.549 setrgbcolor
112.4 627.09 126.7 627.09 line
0.400 0.400 0.400 setrgbcolor
104 628.89 109.4 628.89 line
0.549 0.549 0.549 setrgbcolor
98.5 627.99 103.7 627.99 line
0.000 0.820 0.820 setrgbcolor
103.7 627.99 104 627.79 line
0.400 0.400 0.400 setrgbcolor
103.8 628.69 0.4 0.4 rectfill
0.1 setlinewidth
109.4 631.19 newpath moveto
104 631.19 lineto
104 627.09 lineto
112.2 627.09 lineto
112.2 630.99 lineto
stroke
0.000 0.820 0.820 setrgbcolor
112.2 630.99 112.4 631.19 line
0.549 0.549 0.549 setrgbcolor
112.4 631.19 126.7 631.19 line
0.000 0.820 0.820 setrgbcolor
112.2 627.29 112.4 627.09 line
0.549 0.549 0.549 setrgbcolor
112.4 627.09 126.7 627.09 line
0.400 0.400 0.400 setrgbcolor
104 628.89 109.4 628.89 line
0.549 0.549 0.549 setrgbcolor
98.5 627.99 103.7 627.99 line
0.000 0.820 0.820 setrgbcolor
103.7 627.99 104 627.79 line
0.2 setlinewidth
0.549 0.549 0.549 setrgbcolor
98.5 627.99 104.6 627.99 line
0.000 0.820 0.820 setrgbcolor
104.6 627.99 104.9 627.99 line
0.400 0.400 0.400 setrgbcolor
104.9 627.99 113.1 627.99 line
113.1 629.89 newpath moveto
128.1 629.89 lineto
128.1 628.89 lineto
stroke
0.000 0.820 0.820 setrgbcolor
113.1 631.39 113.3 631.19 line
0.549 0.549 0.549 setrgbcolor
113.3 631.19 126.7 631.19 line
0.400 0.400 0.400 setrgbcolor
112.9 627.79 0.4 0.4 rectfill
112.9 629.69 0.4 0.4 rectfill
0.549 0.549 0.549 setrgbcolor
126.7 627.09 113.3 627.09 line
0.000 0.820 0.820 setrgbcolor
113.3 627.09 113.1 627.29 line
0.400 0.400 0.400 setrgbcolor
113.1 627.29 newpath moveto
113.1 633.99 lineto
131.3 633.99 lineto
131.3 643.99 lineto
149 643.99 lineto
149 643.09 lineto
stroke
131.3 638.99 279.3 638.99 line
279.3 638.99 newpath moveto
294.3 638.99 lineto
294.3 637.99 lineto
stroke
279.3 632.99 newpath moveto
294.3 632.99 lineto
294.3 632.09 lineto
stroke
279.1 638.79 0.4 0.4 rectfill
279.1 632.79 0.4 0.4 rectfill
127.9 633.79 0.4 0.4 rectfill
128.1 633.99 128.1 632.99 line
148.8 638.79 0.4 0.4 rectfill
149 638.99 149 637.99 line
131.1 638.79 0.4 0.4 rectfill
294.3 642.09 newpath moveto
294.3 643.09 lineto
279.3 643.09 lineto
279.3 628.89 lineto
294.3 628.89 lineto
294.3 627.99 lineto
stroke
0.1 setlinewidth
0.549 0.549 0.549 setrgbcolor
98.5 627.99 104.6 627.99 line
0.000 0.820 0.820 setrgbcolor
104.6 627.99 104.9 627.99 line
0.400 0.400 0.400 setrgbcolor
104.9 627.99 113.1 627.99 line
113.1 629.89 newpath moveto
128.1 629.89 lineto
128.1 628.89 lineto
stroke
0.000 0.820 0.820 setrgbcolor
113.1 631.39 113.3 631.19 line
0.549 0.549 0.549 setrgbcolor
113.3 631.19 126.7 631.19 line
126.7 627.09 113.3 627.09 line
0.000 0.820 0.820 setrgbcolor
113.3 627.09 113.1 627.29 line
0.400 0.400 0.400 setrgbcolor
113.1 627.29 newpath moveto
113.1 633.99 lineto
131.3 633.99 lineto
131.3 643.99 lineto
149 643.99 lineto
149 643.09 lineto
stroke
131.3 638.99 279.3 638.99 line
279.3 638.99 newpath moveto
294.3 638.99 lineto
294.3 637.99 lineto
stroke
279.3 632.99 newpath moveto
294.3 632.99 lineto
294.3 632.09 lineto
stroke
128.1 633.99 128.1 632.99 line
149 638.99 149 637.99 line
294.3 642.09 newpath moveto
294.3 643.09 lineto
279.3 643.09 lineto
279.3 628.89 lineto
294.3 628.89 lineto
294.3 627.99 lineto
stroke
44.3 621.69 newpath moveto
70.3 621.69 lineto
70.3 617.59 lineto
165.9 617.59 lineto
165.9 622.59 lineto
180.5 622.59 lineto
stroke
165.9 620.29 195 620.29 line
194.9 620.09 0.3 0.3 rectfill
242.8 624.39 newpath moveto
229.2 624.39 lineto
229.2 618.49 lineto
314.3 618.49 lineto
314.3 624.39 lineto
317.5 624.39 lineto
stroke
314.3 619.79 317.5 619.79 line
314.2 619.59 0.3 0.3 rectfill
70.3 621.69 76.6 621.69 line
70.2 621.49 0.3 0.3 rectfill
165.8 620.09 0.3 0.3 rectfill
208.2 622.59 newpath moveto
195 622.59 lineto
195 620.29 lineto
229.2 620.29 lineto
stroke
229.1 620.09 0.3 0.3 rectfill
-64.5 645.29 newpath moveto
-19 645.29 lineto
-19 635.29 lineto
25.6 635.29 lineto
25.6 614.39 lineto
396.3 614.39 lineto
396.3 637.09 lineto
415.4 637.09 lineto
stroke
396.3 626.19 415.4 626.19 line
396.3 629.89 newpath moveto
479.6 629.89 lineto
479.6 630.29 lineto
484.2 630.29 lineto
stroke
25.6 625.79 43.4 625.79 line
396.3 631.69 415.4 631.69 line
396.2 625.99 0.3 0.3 rectfill
396.2 629.69 0.3 0.3 rectfill
396.2 631.49 0.3 0.3 rectfill
0.2 setlinewidth
478.7 633.49 newpath moveto
481.4 633.49 lineto
481.4 628.49 lineto
484.2 628.49 lineto
stroke
0.1 setlinewidth
478.7 633.49 newpath moveto
481.4 633.49 lineto
481.4 628.49 lineto
484.2 628.49 lineto
stroke
0.2 setlinewidth
530.6 626.19 535.2 626.19 line
0.1 setlinewidth
530.6 626.19 535.2 626.19 line
0.2 setlinewidth
478.7 635.29 newpath moveto
482.4 635.29 lineto
482.4 627.09 lineto
494.6 627.09 lineto
494.6 626.69 lineto
501.5 626.69 lineto
501.5 626.19 lineto
502.4 626.19 lineto
stroke
0.1 setlinewidth
478.7 635.29 newpath moveto
482.4 635.29 lineto
482.4 627.09 lineto
494.6 627.09 lineto
494.6 626.69 lineto
501.5 626.69 lineto
501.5 626.19 lineto
502.4 626.19 lineto
stroke
0.2 setlinewidth
0.549 0.549 0.549 setrgbcolor
423.2 624.39 443 624.39 line
0.000 0.820 0.820 setrgbcolor
443 624.39 443.2 624.59 line
0.400 0.400 0.400 setrgbcolor
443.2 624.59 443.2 633.69 line
0.000 0.820 0.820 setrgbcolor
443.2 633.69 443.4 633.99 line
0.549 0.549 0.549 setrgbcolor
443.4 633.99 445 633.99 line
0.400 0.400 0.400 setrgbcolor
443.2 625.29 494.6 625.29 line
0.000 0.820 0.820 setrgbcolor
494.6 625.29 494.9 625.29 line
0.549 0.549 0.549 setrgbcolor
494.9 625.29 502.4 625.29 line
0.400 0.400 0.400 setrgbcolor
443.2 631.19 445 631.19 line
443 625.09 0.4 0.4 rectfill
443 630.99 0.4 0.4 rectfill
0.1 setlinewidth
0.549 0.549 0.549 setrgbcolor
423.2 624.39 443 624.39 line
0.000 0.820 0.820 setrgbcolor
443 624.39 443.2 624.59 line
0.400 0.400 0.400 setrgbcolor
443.2 624.59 443.2 633.69 line
0.000 0.820 0.820 setrgbcolor
443.2 633.69 443.4 633.99 line
0.549 0.549 0.549 setrgbcolor
443.4 633.99 445 633.99 line
0.400 0.400 0.400 setrgbcolor
443.2 625.29 494.6 625.29 line
0.000 0.820 0.820 setrgbcolor
494.6 625.29 494.9 625.29 line
0.549 0.549 0.549 setrgbcolor
494.9 625.29 502.4 625.29 line
0.400 0.400 0.400 setrgbcolor
443.2 631.19 445 631.19 line
0.2 setlinewidth
0.549 0.549 0.549 setrgbcolor
445 633.99 444.3 633.99 line
0.000 0.820 0.820 setrgbcolor
444.3 633.99 444.1 633.69 line
0.400 0.400 0.400 setrgbcolor
444.1 633.69 newpath moveto
444.1 624.39 lineto
495.6 624.39 lineto
495.6 625.09 lineto
stroke
0.000 0.820 0.820 setrgbcolor
495.6 625.09 495.8 625.29 line
0.549 0.549 0.549 setrgbcolor
495.8 625.29 502.4 625.29 line
423.2 624.39 443.9 624.39 line
0.000 0.820 0.820 setrgbcolor
443.9 624.39 444.1 624.59 line
0.1 setlinewidth
0.549 0.549 0.549 setrgbcolor
445 633.99 444.3 633.99 line
0.000 0.820 0.820 setrgbcolor
444.3 633.99 444.1 633.69 line
0.400 0.400 0.400 setrgbcolor
444.1 633.69 newpath moveto
444.1 624.39 lineto
495.6 624.39 lineto
495.6 625.09 lineto
stroke
0.000 0.820 0.820 setrgbcolor
495.6 625.09 495.8 625.29 line
0.549 0.549 0.549 setrgbcolor
495.8 625.29 502.4 625.29 line
423.2 624.39 443.9 624.39 line
0.000 0.820 0.820 setrgbcolor
443.9 624.39 444.1 624.59 line
0.400 0.400 0.400 setrgbcolor
504.7 637.09 535.2 637.09 line
0.2 setlinewidth
504.7 634.39 535.2 634.39 line
0.1 setlinewidth
504.7 634.39 535.2 634.39 line
0.2 setlinewidth
478.7 634.39 502.4 634.39 line
0.1 setlinewidth
478.7 634.39 502.4 634.39 line
478.7 637.09 502.4 637.09 line
504.7 635.79 535.2 635.79 line
478.7 636.19 newpath moveto
483.3 636.19 lineto
483.3 635.79 lineto
502.4 635.79 lineto
stroke
0.2 setlinewidth
10.6 641.69 newpath moveto
29.3 641.69 lineto
29.3 640.29 lineto
43.4 640.29 lineto
stroke
0.1 setlinewidth
10.6 641.69 newpath moveto
29.3 641.69 lineto
29.3 640.29 lineto
43.4 640.29 lineto
stroke
10.6 638.99 newpath moveto
26.5 638.99 lineto
26.5 615.29 lineto
393.6 615.29 lineto
393.6 637.99 lineto
415.4 637.99 lineto
stroke
26.5 626.69 43.4 626.69 line
420.9 637.09 newpath moveto
440.5 637.09 lineto
440.5 638.49 lineto
445 638.49 lineto
stroke
0.2 setlinewidth
10.6 640.79 newpath moveto
28.4 640.79 lineto
28.4 630.79 lineto
43.4 630.79 lineto
stroke
0.1 setlinewidth
10.6 640.79 newpath moveto
28.4 640.79 lineto
28.4 630.79 lineto
43.4 630.79 lineto
stroke
10.6 639.89 newpath moveto
27.5 639.89 lineto
27.5 622.99 lineto
43.4 622.99 lineto
stroke
0.1 640.79 newpath moveto
-17.2 640.79 lineto
-17.2 634.39 lineto
24.7 634.39 lineto
24.7 613.49 lineto
397.2 613.49 lineto
397.2 636.19 lineto
415.4 636.19 lineto
stroke
397.2 624.39 415.4 624.39 line
397.2 628.89 newpath moveto
480.5 628.89 lineto
480.5 629.39 lineto
484.2 629.39 lineto
stroke
24.7 621.69 43.4 621.69 line
397.1 624.19 0.3 0.3 rectfill
397.1 628.69 0.3 0.3 rectfill
0.2 setlinewidth
373.5 634.89 newpath moveto
390.8 634.89 lineto
390.8 642.59 lineto
444.1 642.59 lineto
444.1 636.69 lineto
445 636.69 lineto
stroke
0.1 setlinewidth
373.5 634.89 newpath moveto
390.8 634.89 lineto
390.8 642.59 lineto
444.1 642.59 lineto
444.1 636.69 lineto
445 636.69 lineto
stroke
restore
showpage
%%Trailer
end
%%Pages: 1
%%EOF
