%!PS-Adobe-3.0
%%Creator: Nlview
%%For: jschoenbohm
%%Title: root
%%BoundingBox: 28 28 568 814
%%CreationDate: 2020-10-07 11:22
%%Pages: (atend)
%%DocumentData: Clean7Bit
%%DocumentNeededResources: font Helvetica
%%EndComments

%%BeginProlog
50 dict begin
/line {
    newpath moveto lineto stroke
} bind def
/circle {
    newpath 2 div 0 360 arc stroke
} bind def
/filledcircle {
    newpath 2 div 0 360 arc fill
} bind def
/text {                                 % stack: x y rot jx jy len (str)
    gsave
    7 -2 roll moveto                    % stack: rot jx jy len (str)
    dup stringwidth pop /wid exch def   % string width --> wid
    5 -1 roll                           % stack: jx jy len (str) rot
    rotate
    4 2 roll                            % stack: len (str) jx jy
    Fdescent exch
    2 div Fdescent Fascent add mul sub  % desc - jy/2 * (asc+desc)
                                        % stack: len (str) jx ymove
    exch
    2 div wid mul neg                   % -jx/2 * wid
                                        % stack: len (str) ymove xmove
    exch rmoveto                        % stack: len (str)
    exch 0 exch                         % stack: (str) 0 len
    getinterval                         % stack: substr(str,0,len)
    show                                % stack:
    grestore
} bind def
/initfontfac {
    currentdict /Ffac known not {
        % Here we compute Ffac. Ffac is used below to resize the font
        % in a way that the font's ascent+descent/2 fits the required
        % text size. We compute Ffac only once, because the font F will
        % never change.
        %
        dup F exch scalefont setfont % stack sz font
        gsave
        newpath 0 0 moveto (XTgq) false charpath
        pathbbox                        % stack: sz l b r t
        grestore
        3 2 roll neg 2 div add          % fheight = ascent + descent/2
        3 1 roll pop pop                % stack: sz fheight
        div
        /Ffac exch def                  % Ffac = sz/fheight
    } if
} bind def
/textsize {
    Ffac mul F exch scalefont setfont
    gsave
    newpath
    0 0 moveto (XTgq) false charpath pathbbox
    /Fascent exch def			% top -> ascent
    pop
    /Fdescent exch neg 2 div def	% -bottom/2 -> descent
    pop
    grestore
} bind def
/linestyle {
				% stack: [dashdef] offs gwid
    dup 3 1 roll		%        [dashdef] gwid offs gwid
    mul [			%        [dashdef] gwid moffs [
    4 -2 roll exch		%        moffs [ gwid [dashdef]
    {exch dup 3 -1 roll mul exch} forall
    				%	 moffs [ a1 a2 a3 .. gwid
    pop ]			%	 moffs [a1 a2 a3..]
    exch			%	 [a1 a2 a3..] moffs
    setdash			% stack:
} bind def

% Define the array ISOLatin1Encoding (which specifies how characters are
% encoded for ISO-8859-1 fonts), if it isn't already present (Postscript
% level 2 is supposed to define it, but level 1 doesn't).
systemdict /ISOLatin1Encoding known not {
    /ISOLatin1Encoding [
	/space /space /space /space /space /space /space /space
	/space /space /space /space /space /space /space /space
	/space /space /space /space /space /space /space /space
	/space /space /space /space /space /space /space /space
	/space /exclam /quotedbl /numbersign /dollar /percent /ampersand
	    /quoteright
	/parenleft /parenright /asterisk /plus /comma /minus /period /slash
	/zero /one /two /three /four /five /six /seven
	/eight /nine /colon /semicolon /less /equal /greater /question
	/at /A /B /C /D /E /F /G
	/H /I /J /K /L /M /N /O
	/P /Q /R /S /T /U /V /W
	/X /Y /Z /bracketleft /backslash /bracketright /asciicircum
	/underscore /quoteleft /a /b /c /d /e /f /g
	/h /i /j /k /l /m /n /o
	/p /q /r /s /t /u /v /w
	/x /y /z /braceleft /bar /braceright /asciitilde /space
	/space /space /space /space /space /space /space /space
	/space /space /space /space /space /space /space /space
	/dotlessi /grave /acute /circumflex /tilde /macron /breve /dotaccent
	/dieresis /space /ring /cedilla /space /hungarumlaut /ogonek /caron
	/space /exclamdown /cent /sterling /currency /yen /brokenbar /section
	/dieresis /copyright /ordfeminine /guillemotleft /logicalnot /hyphen
	    /registered /macron
	/degree /plusminus /twosuperior /threesuperior /acute /mu /paragraph
	    /periodcentered
	/cedillar /onesuperior /ordmasculine /guillemotright /onequarter
	    /onehalf /threequarters /questiondown
	/Agrave /Aacute /Acircumflex /Atilde /Adieresis /Aring /AE /Ccedilla
	/Egrave /Eacute /Ecircumflex /Edieresis /Igrave /Iacute /Icircumflex
	    /Idieresis
	/Eth /Ntilde /Ograve /Oacute /Ocircumflex /Otilde /Odieresis
	    /multiply
	/Oslash /Ugrave /Uacute /Ucircumflex /Udieresis /Yacute /Thorn
	    /germandbls
	/agrave /aacute /acircumflex /atilde /adieresis /aring /ae /ccedilla
	/egrave /eacute /ecircumflex /edieresis /igrave /iacute /icircumflex
	    /idieresis
	/eth /ntilde /ograve /oacute /ocircumflex /otilde /odieresis /divide
	/oslash /ugrave /uacute /ucircumflex /udieresis /yacute /thorn
	    /ydieresis
    ] def
} if

% font ISOEncode font
% This procedure changes the encoding of a font from the default
% Postscript encoding to ISOLatin1. The body of this procedure comes
% from Section 5.6.1 of the Postscript book.
/ISOEncode {
    dup length dict begin
	{1 index /FID ne {def} {pop pop} ifelse} forall
	/Encoding ISOLatin1Encoding def
	currentdict
    end
    /Fname exch definefont
} bind def
%%EndProlog

%%BeginSetup
%%IncludeResource: font Helvetica
<< /PageSize [595 841] /Policies << /PageSize 3 >> >> setpagedevice
%%EndSetup

/DiagonalCross <<      % pattern prototype dictionary: XX
   /PatternType 1      % Tiling pattern
   /PaintType 2        % uncolored tiling pattern
   /TilingType 1
   /BBox [0 0 8 8]
   /XStep 8
   /YStep 8
   /PaintProc
     { pop
       1 setlinewidth
       [] 0 setdash
       newpath -1 3 moveto
       5 9 lineto
       stroke newpath -1 5 moveto
       5 -1 lineto
       stroke newpath 3 -1 moveto
       9 5 lineto
       stroke newpath 3 9 moveto
       9 3 lineto
       stroke
    } bind
>> def
/Cross <<              % pattern prototype dictionary: ++
   /PatternType 1      % Tiling pattern
   /PaintType 2        % uncolored tiling pattern
   /TilingType 1
   /BBox [0 0 8 8]
   /XStep 8
   /YStep 8
   /PaintProc
     { pop
       1 setlinewidth
       [] 0 setdash
       0 4 moveto
       8 4 lineto
       4 0 moveto
       4 8 lineto
       stroke
    } bind
>> def
/BackwardDiagonal <<   % pattern prototype dictionary: //
   /PatternType 1      % Tiling pattern
   /PaintType 2        % uncolored tiling pattern
   /TilingType 1
   /BBox [0 0 8 8]
   /XStep 8
   /YStep 8
   /PaintProc
     { pop
       1 setlinewidth
       [] 0 setdash
       newpath -1 3 moveto
       6 6 rlineto
       stroke newpath 3 -1 moveto
       6 6 rlineto
       stroke
    } bind
>> def
/ForwardDiagonal <<    % pattern prototype dictionary: \\
   /PatternType 1      % Tiling pattern
   /PaintType 2        % uncolored tiling pattern
   /TilingType 1
   /BBox [0 0 8 8]
   /XStep 8
   /YStep 8
   /PaintProc
     { pop
       1 setlinewidth
       [] 0 setdash
       newpath -1 5 moveto
       6 -6 rlineto
       stroke newpath 3 9 moveto
       6 -6 rlineto
       stroke
    } bind
>> def
/Vertical <<           % pattern prototype dictionary: ||
   /PatternType 1      % Tiling pattern
   /PaintType 2        % uncolored tiling pattern
   /TilingType 1
   /BBox [0 0 8 8]
   /XStep 8
   /YStep 8
   /PaintProc
     { pop
       1 setlinewidth
       [] 0 setdash
       4 0 moveto
       4 8 lineto
       stroke
    } bind
>> def
/Horizontal <<         % pattern prototype dictionary: ==
   /PatternType 1      % Tiling pattern
   /PaintType 2        % uncolored tiling pattern
   /TilingType 1
   /BBox [0 0 8 8]
   /XStep 8
   /YStep 8
   /PaintProc
     { pop
       1 setlinewidth
       [] 0 setdash
       0 4 moveto
       8 4 lineto
       stroke
    } bind
>> def
%%Page: 1 1
%%PageOrientation: Landscape
save
90 rotate
0 -841.89 translate
27.8 274.39 786.3 539.7 rectclip
/F /Helvetica findfont ISOEncode def
12 initfontfac
0 setlinecap 		% Butt caps (flat)
0 setlinejoin		% Miter joins
[/Pattern /DeviceRGB] setcolorspace
0.000 0.000 0.000 setrgbcolor
28.9 272.79 784.2 540.3 rectfill
284 454.69 271.4 179.1 rectfill
1.4 setlinewidth
0.000 1.000 1.000 setrgbcolor
284 454.69 271.4 179.1 rectstroke
32.5661 textsize
419.7 639.19 0 1 0 19 (pack_out_last_s1_i0) text
419.7 449.19 0 1 2 26 (register_compression_reset) text
1.000 0.000 0.000 setrgbcolor
256.8 590.29 284 590.29 line
27.1384 textsize
278.6 593.09 0 2 0 15 (pack_out_last=x) text
256.8 536.09 284 536.09 line
278.6 538.79 0 2 0 5 (clk=x) text
256.8 481.79 284 481.79 line
278.6 484.49 0 2 0 5 (rst=x) text
582.5 536.09 555.4 536.09 line
560.8 538.79 0 0 0 18 (pack_out_last_s1=x) text
0.000 1.000 1.000 setrgbcolor
311.1 590.29 284 590.29 line
289.4 593.09 0 0 0 6 (d[0:0]) text
311.1 536.09 284 536.09 line
289.4 538.79 0 0 0 3 (clk) text
311.1 481.79 284 481.79 line
289.4 484.49 0 0 0 5 (reset) text
528.2 536.09 555.4 536.09 line
550 538.79 0 2 0 6 (q[0:0]) text
restore
showpage
%%Trailer
end
%%Pages: 1
%%EOF
