*******************************************************************************
 Revised: Jan 26, 2022            Tethys  / (Saturn)                        603
                          http://ssd.jpl.nasa.gov/?sat_phys_par
                            http://ssd.jpl.nasa.gov/?sat_elem

 SATELLITE PHYSICAL PROPERTIES:
  Mean Radius (km)       = 536.3  +- 1.5     Density (g/cm^3)  =  0.956+- 0.008
  Mass (10^19 kg)        =  61.76 +- 0.11    Geometric Albedo  =  0.80
  GM (km^3/s^2)          =  41.21 +- 0.007   V(1,0)            = +0.7

 SATELLITE ORBITAL DATA (mean values with respect to local Laplace plane):
  Semi-major axis, a (km)=  294.670(10^3)    Orbital period    =  1.888 d
  Eccentricity, e        =     0.0001        Rotational period = Synchronous
  Inclination, i  (deg)  =     1.091
*******************************************************************************


*******************************************************************************
Ephemeris / WWW_USER Mon Nov 28 03:01:51 2022 Pasadena, USA      / Horizons
*******************************************************************************
Target body name: Tethys (603)                    {source: sat441l}
Center body name: Saturn (699)                    {source: sat441l}
Center-site name: BODY CENTER
*******************************************************************************
Start time      : A.D. 2022-Nov-28 00:00:00.0000 TDB
Stop  time      : A.D. 2022-Dec-28 00:00:00.0000 TDB
Step-size       : 1440 minutes
*******************************************************************************
Center geodetic : 0.00000000,0.00000000,0.0000000 {W-lon(deg),Lat(deg),Alt(km)}
Center cylindric: 0.00000000,0.00000000,0.0000000 {W-lon(deg),Dxy(km),Dz(km)}
Center radii    : 60268.0 x 60268.0 x 54364.0 km  {Equator, meridian, pole}    
Output units    : KM-S
Output type     : GEOMETRIC cartesian states
Output format   : 3 (position, velocity, LT, range, range-rate)
Reference frame : Ecliptic of J2000.0
*******************************************************************************
JDTDB
   X     Y     Z
   VX    VY    VZ
   LT    RG    RR
*******************************************************************************
$$SOE
2459911.500000000 = A.D. 2022-Nov-28 00:00:00.0000 TDB 
 X = 2.736338967931043E+04 Y =-2.583656101498802E+05 Z = 1.389825768439401E+05
 VX= 1.126007562976311E+01 VY= 4.553114846840171E-01 VZ=-1.372033455417533E+00
 LT= 9.828413863426662E-01 RG= 2.946484350357955E+05 RR=-7.186103768628271E-04
2459912.500000000 = A.D. 2022-Nov-29 00:00:00.0000 TDB 
 X =-8.119559011299607E+04 Y = 2.517267711302994E+05 Z =-1.299681238115092E+05
 VX=-1.086608801561461E+01 VY=-2.294944837720232E+00 VZ= 2.342634713200997E+00
 LT= 9.830287500604343E-01 RG= 2.947046052652852E+05 RR= 3.784680445441258E-04
2459913.500000000 = A.D. 2022-Nov-30 00:00:00.0000 TDB 
 X = 1.321220595560120E+05 Y =-2.362396845183181E+05 Z = 1.163826143152742E+05
 VX= 1.009901801810125E+01 VY= 4.055548504040218E+00 VZ=-3.232545108900689E+00
 LT= 9.827997240193866E-01 RG= 2.946359449854934E+05 RR= 3.227792080735823E-05
2459914.500000000 = A.D. 2022-Dec-01 00:00:00.0000 TDB 
 X =-1.785164097295719E+05 Y = 2.126606917583330E+05 Z =-9.880415742983726E+04
 VX=-8.976291266242264E+00 VY=-5.672916748222084E+00 VZ= 4.008225560993883E+00
 LT= 9.830521539273792E-01 RG= 2.947116215680834E+05 RR=-6.942301931616376E-05
2459915.500000000 = A.D. 2022-Dec-02 00:00:00.0000 TDB 
 X = 2.186434863709403E+05 Y =-1.815582814069208E+05 Z = 7.771950639552456E+04
 VX= 7.545447978220190E+00 VY= 7.096767258999368E+00 VZ=-4.646765353667163E+00
 LT= 9.827904704377999E-01 RG= 2.946331708315244E+05 RR= 4.815326005502515E-04
2459916.500000000 = A.D. 2022-Dec-03 00:00:00.0000 TDB 
 X =-2.512240746295654E+05 Y = 1.442899311016422E+05 Z =-5.400252430659012E+04
 VX=-5.849580872561827E+00 VY=-8.269703053090636E+00 VZ= 5.120935224665202E+00
 LT= 9.830207599951273E-01 RG= 2.947022099039673E+05 RR=-7.559190813869825E-04
2459917.500000000 = A.D. 2022-Dec-04 00:00:00.0000 TDB 
 X = 2.750382649201271E+05 Y =-1.018340499118773E+05 Z = 2.831382126405227E+04
 VX= 3.950791384796924E+00 VY= 9.159776248367173E+00 VZ=-5.419375804112152E+00
 LT= 9.828424793448457E-01 RG= 2.946487627096055E+05 RR= 1.352315190656985E-03
2459918.500000000 = A.D. 2022-Dec-05 00:00:00.0000 TDB 
 X =-2.892937592263533E+05 Y = 5.610918259353842E+04 Z =-1.787206424907614E+03
 VX=-1.918625782938666E+00 VY=-9.726841568588828E+00 VZ= 5.526985569964130E+00
 LT= 9.829806971701618E-01 RG= 2.946901993711964E+05 RR=-2.024256177241693E-03
2459919.500000000 = A.D. 2022-Dec-06 00:00:00.0000 TDB 
 X = 2.934870555410000E+05 Y =-8.074273273905244E+03 Z =-2.499859280972753E+04
 VX=-1.876572905273481E-01 VY= 9.959809785278916E+00 VZ=-5.443613793705081E+00
 LT= 9.828814328597852E-01 RG= 2.946604406795970E+05 RR= 2.000516359641060E-03
2459920.500000000 = A.D. 2022-Dec-07 00:00:00.0000 TDB 
 X =-2.875259491523890E+05 Y =-3.987029750673452E+04 Z = 5.071567692650982E+04
 VX= 2.279310708798275E+00 VY=-9.845004171209942E+00 VZ= 5.170656498682280E+00
 LT= 9.829273731579349E-01 RG= 2.946742132345005E+05 RR=-2.051028515467823E-03
2459921.500000000 = A.D. 2022-Dec-08 00:00:00.0000 TDB 
 X = 2.714824442034882E+05 Y = 8.677725562144465E+04 Z =-7.484966102387600E+04
 VX=-4.299144526144835E+00 VY= 9.387306481129908E+00 VZ=-4.716545263463153E+00
 LT= 9.829420288188132E-01 RG= 2.946786068910988E+05 RR= 1.677231839821773E-03
2459922.500000000 = A.D. 2022-Dec-09 00:00:00.0000 TDB 
 X =-2.461142018876629E+05 Y =-1.303574277935273E+05 Z = 9.621877418282662E+04
 VX= 6.163524662593610E+00 VY=-8.606110578024877E+00 VZ= 4.100354086843144E+00
 LT= 9.828731495185056E-01 RG= 2.946579573963543E+05 RR=-1.796900189804845E-03
2459923.500000000 = A.D. 2022-Dec-10 00:00:00.0000 TDB 
 X = 2.120474309785481E+05 Y = 1.697006156234753E+05 Z =-1.143850335713835E+05
 VX=-7.817873562813380E+00 VY= 7.521364207719364E+00 VZ=-3.338544497774329E+00
 LT= 9.830035289057847E-01 RG= 2.946970441533392E+05 RR= 1.695490796563997E-03
2459924.500000000 = A.D. 2022-Dec-11 00:00:00.0000 TDB 
 X =-1.708382483804830E+05 Y =-2.028340262464166E+05 Z = 1.284216209422229E+05
 VX= 9.196627834435128E+00 VY=-6.182204290146263E+00 VZ= 2.464709972876297E+00
 LT= 9.828513585667490E-01 RG= 2.946514246333650E+05 RR=-2.213982591230445E-03
2459925.500000000 = A.D. 2022-Dec-12 00:00:00.0000 TDB 
 X = 1.233794412252126E+05 Y = 2.292369441533192E+05 Z =-1.381306715077609E+05
 VX=-1.025820840334558E+01 VY= 4.619843596614766E+00 VZ=-1.500265179506359E+00
 LT= 9.830363398732733E-01 RG= 2.947068806339320E+05 RR= 2.101900238237383E-03
2459926.500000000 = A.D. 2022-Dec-13 00:00:00.0000 TDB 
 X =-7.195517278644888E+04 Y =-2.473963597008994E+05 Z = 1.429119556383423E+05
 VX= 1.096430230635923E+01 VY=-2.905000740586856E+00 VZ= 4.879083473382079E-01
 LT= 9.827770398125500E-01 RG= 2.946291444313682E+05 RR=-1.777565820821215E-03
2459927.500000000 = A.D. 2022-Dec-14 00:00:00.0000 TDB 
 X = 1.772928518288075E+04 Y = 2.572043031916308E+05 Z =-1.428230741745484E+05
 VX=-1.128429174582556E+01 VY= 1.082158218296502E+00 VZ= 5.447936556328373E-01
 LT= 9.831193358470517E-01 RG= 2.947317622009152E+05 RR= 1.575057061177040E-03
2459928.500000000 = A.D. 2022-Dec-15 00:00:00.0000 TDB 
 X = 3.684129145098432E+04 Y =-2.578443447862216E+05 Z = 1.376641174269574E+05
 VX= 1.122019866473462E+01 VY= 7.732069814322191E-01 VZ=-1.556562989768681E+00
 LT= 9.826981449509757E-01 RG= 2.946054923468933E+05 RR=-9.616540744168821E-04
2459929.500000000 = A.D. 2022-Dec-16 00:00:00.0000 TDB 
 X =-9.037639532769352E+04 Y = 2.497403851523215E+05 Z =-1.278070437032466E+05
 VX=-1.075590802069911E+01 VY=-2.604510655934809E+00 VZ= 2.514666039895343E+00
 LT= 9.831531836665107E-01 RG= 2.947419095219087E+05 RR= 8.029688785595921E-04
2459930.500000000 = A.D. 2022-Dec-17 00:00:00.0000 TDB 
 X = 1.405070760193944E+05 Y =-2.327827030167063E+05 Z = 1.134318444789494E+05
 VX= 9.928584456867135E+00 VY= 4.343858993056291E+00 VZ=-3.385539458817099E+00
 LT= 9.827231244286212E-01 RG= 2.946129810058962E+05 RR=-5.663438534889980E-04
2459931.500000000 = A.D. 2022-Dec-18 00:00:00.0000 TDB 
 X =-1.860075327831953E+05 Y = 2.078700276274934E+05 Z =-9.515629717943758E+04
 VX=-8.746428510741413E+00 VY=-5.932145096259593E+00 VZ= 4.137512291342841E+00
 LT= 9.831004346851328E-01 RG= 2.947260957751244E+05 RR= 2.581166728094229E-04
2459932.500000000 = A.D. 2022-Dec-19 00:00:00.0000 TDB 
 X = 2.248495372964885E+05 Y =-1.756055504990450E+05 Z = 7.351796417497161E+04
 VX= 7.267464371476467E+00 VY= 7.317465367888928E+00 VZ=-4.747928952973290E+00
 LT= 9.827384446416073E-01 RG= 2.946175738902044E+05 RR= 1.371146630297343E-04
2459933.500000000 = A.D. 2022-Dec-20 00:00:00.0000 TDB 
 X =-2.560249416477958E+05 Y = 1.373868410453080E+05 Z =-4.938689323993442E+04
 VX=-5.531187803149170E+00 VY=-8.443028800444541E+00 VZ= 5.189597935349926E+00
 LT= 9.830976535168513E-01 RG= 2.947252620018492E+05 RR=-4.653160497525015E-04
2459934.500000000 = A.D. 2022-Dec-21 00:00:00.0000 TDB 
 X = 2.781575566988145E+05 Y =-9.422420245019924E+04 Z = 2.345850769842840E+04
 VX= 3.604861635349777E+00 VY= 9.281977207197484E+00 VZ=-5.454564527830360E+00
 LT= 9.827419171550478E-01 RG= 2.946186149235441E+05 RR= 5.996269089756980E-04
2459935.500000000 = A.D. 2022-Dec-22 00:00:00.0000 TDB 
 X =-2.907736351359283E+05 Y = 4.796431210627641E+04 Z = 3.204535346453744E+03
 VX=-1.553198450385639E+00 VY=-9.791247870178028E+00 VZ= 5.525753805641024E+00
 LT= 9.830816449879228E-01 RG= 2.947204627656128E+05 RR=-9.969985126746543E-04
2459936.500000000 = A.D. 2022-Dec-23 00:00:00.0000 TDB 
 X = 2.931278239608199E+05 Y = 1.113434983878069E+02 Z =-2.982243578129257E+04
 VX=-5.532800471215406E-01 VY= 9.966515420790504E+00 VZ=-5.407927895101528E+00
 LT= 9.828165425561117E-01 RG= 2.946409870559583E+05 RR= 6.975024201120962E-04
2459937.500000000 = A.D. 2022-Dec-24 00:00:00.0000 TDB 
 X =-2.854393064644641E+05 Y =-4.804998520568070E+04 Z = 5.534312082598846E+04
 VX= 2.638181442462956E+00 VY=-9.791051677884434E+00 VZ= 5.099701471751469E+00
 LT= 9.830086899809340E-01 RG= 2.946985914047442E+05 RR=-1.178825675327520E-03
2459938.500000000 = A.D. 2022-Dec-25 00:00:00.0000 TDB 
 X = 2.676764765590813E+05 Y = 9.448731703541984E+04 Z =-7.901398143331311E+04
 VX=-4.635947150399277E+00 VY= 9.277958887843761E+00 VZ=-4.614936929034803E+00
 LT= 9.828643568730563E-01 RG= 2.946553214275627E+05 RR= 1.221715491902826E-03
2459939.500000000 = A.D. 2022-Dec-26 00:00:00.0000 TDB 
 X =-2.407830395825697E+05 Y =-1.374535306739925E+05 Z = 9.984889504581114E+04
 VX= 6.466978948506014E+00 VY=-8.441712674608917E+00 VZ= 3.969707527579527E+00
 LT= 9.829661716676533E-01 RG= 2.946858447350957E+05 RR=-1.441283322950702E-03
2459940.500000000 = A.D. 2022-Dec-27 00:00:00.0000 TDB 
 X = 2.053247860367747E+05 Y = 1.758312410945355E+05 Z =-1.172913172640751E+05
 VX=-8.078280215083289E+00 VY= 7.310939457366914E+00 VZ=-3.185150741562195E+00
 LT= 9.829231523848032E-01 RG= 2.946729478785487E+05 RR= 1.394521669469267E-03
2459941.500000000 = A.D. 2022-Dec-28 00:00:00.0000 TDB 
 X =-1.629186323169660E+05 Y =-2.079274783051249E+05 Z = 1.305759523919330E+05
 VX= 9.405465394130511E+00 VY=-5.928732404949901E+00 VZ= 2.291512941555734E+00
 LT= 9.828906080908122E-01 RG= 2.946631913446593E+05 RR=-1.230880061574163E-03
$$EOE
*******************************************************************************
 
TIME

  Barycentric Dynamical Time ("TDB" or T_eph) output was requested. This
continuous relativistic coordinate time is equivalent to the relativistic
proper time of a clock at rest in a reference frame comoving with the
solar system barycenter but outside the system's gravity well. It is the
independent variable in the solar system relativistic equations of motion.

  TDB runs at a uniform rate of one SI second per second and is independent
of irregularities in Earth's rotation.

  Calendar dates prior to 1582-Oct-15 are in the Julian calendar system.
Later calendar dates are in the Gregorian system.

REFERENCE FRAME AND COORDINATES

  Ecliptic at the standard reference epoch

    Reference epoch: J2000.0
    X-Y plane: adopted Earth orbital plane at the reference epoch
               Note: IAU76 obliquity of 84381.448 arcseconds wrt ICRF X-Y plane
    X-axis   : ICRF
    Z-axis   : perpendicular to the X-Y plane in the directional (+ or -) sense
               of Earth's north pole at the reference epoch.

  Symbol meaning:

    JDTDB    Julian Day Number, Barycentric Dynamical Time
      X      X-component of position vector (km)
      Y      Y-component of position vector (km)
      Z      Z-component of position vector (km)
      VX     X-component of velocity vector (km/sec)                           
      VY     Y-component of velocity vector (km/sec)                           
      VZ     Z-component of velocity vector (km/sec)                           
      LT     One-way down-leg Newtonian light-time (sec)
      RG     Range; distance from coordinate center (km)
      RR     Range-rate; radial velocity wrt coord. center (km/sec)

ABERRATIONS AND CORRECTIONS

 Geometric state vectors have NO corrections or aberrations applied.

Computations by ...

    Solar System Dynamics Group, Horizons On-Line Ephemeris System
    4800 Oak Grove Drive, Jet Propulsion Laboratory
    Pasadena, CA  91109   USA

    General site: https://ssd.jpl.nasa.gov/
    Mailing list: https://ssd.jpl.nasa.gov/email_list.html
    System news : https://ssd.jpl.nasa.gov/horizons/news.html
    User Guide  : https://ssd.jpl.nasa.gov/horizons/manual.html
    Connect     : browser        https://ssd.jpl.nasa.gov/horizons/app.html#/x
                  API            https://ssd-api.jpl.nasa.gov/doc/horizons.html
                  command-line   telnet ssd.jpl.nasa.gov 6775
                  e-mail/batch   https://ssd.jpl.nasa.gov/ftp/ssd/hrzn_batch.txt
                  scripts        https://ssd.jpl.nasa.gov/ftp/ssd/SCRIPTS
    Author      : Jon.D.Giorgini@jpl.nasa.gov
*******************************************************************************
