118506 157780 383
539607 291963 470
801444 564606 509
905586 259850 525
799422 997337 525
176648 692239 509
883697 81630 525
397015 633272 509
405122 61749 443
611021 8437 470
852809 645790 525
133941 547446 470
231704 53286 443
900307 814597 525
824633 596238 509
16962 69770 340
263316 241695 407
814204 53636 509
998350 679035 525
667955 944468 525
705437 767710 424
888401 597788 525
778581 346775 509
343540 341627 353
298860 397610 441
114154 20680 354
917543 513812 525
258318 592223 470
971167 256211 525
275059 177542 443
904073 616854 525
585267 612748 403
358456 527575 470
171896 107104 383
627665 738775 504
474809 781424 509
566343 554365 421
678905 313727 509
101306 427598 449
529344 449335 470
77145 35909 351
375615 489388 449
539894 319455 470
91386 337434 443
656230 785984 504
368637 744695 509
860486 879317 432
428754 546134 470
32240 251845 443
689872 994148 525
534621 474731 470
402037 296161 441
608854 914306 525
415288 762044 509
697797 667399 442
243518 591374 470
102465 715714 509
538233 800022 509
989273 295986 525
331621 991263 525
704223 775642 504
650014 958370 525
506296 47864 449
585317 44567 470
331804 817765 509
406685 729479 509
426545 781145 509
717824 58515 509
752559 691908 504
413651 433524 418
843893 813015 525
238814 352247 441
720546 358305 509
11103 180001 383
773637 696401 504
540734 180214 470
983451 972172 427
758334 757684 318
437542 467988 444
935619 945106 507
234507 117484 443
532492 680390 509
84321 339384 443
966092 258085 525
538581 478687 470
675590 258297 509
557189 871094 525
220086 55771 386
676120 908909 525
235540 146960 443
959065 835404 525
712788 941430 525
328174 784529 509
720223 526415 509
623843 107690 470
811880 759265 468
670679 317197 509
683489 204312 509
16250 526543 470
897686 408799 525
235328 803126 509
696113 863820 525
516772 604913 452
874462 932459 476
113304 495977 449
117366 423236 449
218757 794568 509
382442 97691 443
603611 128748 470
279829 642089 509
145925 958561 525
923522 17929 525
890387 320381 525
918495 620044 525
33628 572855 470
833579 147833 509
45935 868596 525
379062 849144 525
672749 573961 509
333452 73470 443
965009 342832 525
103697 672062 509
236954 939008 525
944660 867062 507
156617 371593 443
789351 962254 525
751202 71547 509
153765 923255 525
602986 548648 434
54680 842700 525
67965 528629 470
80355 473863 449
850100 229285 525
244269 40392 443
95124 334596 443
168839 628398 509
371067 863764 525
344256 87309 443
700746 68521 509
777361 61262 509
824960 424316 509
233866 780139 509
630077 14464 509
602000 918941 525
632779 647139 416
843941 554986 525
297255 38767 443
935118 671569 525
15875 634429 509
336930 952927 525
409977 370354 436
703230 7727 509
910000 633997 525
477845 651537 509
643508 265123 509
927816 368852 525
445577 549180 470
678896 821479 504
597167 426048 470
51467 438090 449
924294 232704 525
403038 734591 509
483791 193012 449
653551 380684 509
630800 512872 509
258781 235565 368
37933 293418 443
65240 126713 354
150930 881159 525
855016 937646 476
422459 938268 525
286643 230515 443
7597 335617 443
563710 64122 470
332238 888770 525
485418 202861 449
519431 124683 470
342571 967773 525
400300 517820 470
580961 656232 509
464661 505299 426
901526 448489 525
36714 517597 470
320453 261463 407
727992 495474 509
326822 485790 449
540642 10770 470
336546 569200 470
187185 405366 443
130855 317782 443
863148 668177 525
679949 486428 509
709609 478144 509
364158 83479 443
478587 591929 470
378274 812754 509
714931 412133 509
296198 386647 441
690102 735575 504
208256 120520 383
457634 825617 509
153444 683672 509
914349 190496 525
236203 315784 407
857653 833858 525
812524 531914 509
943990 48582 525
104779 888477 525
635121 374189 509
755622 810250 468
69466 312980 443
34249 977664 525
36378 461824 449
939896 365335 525
999797 233735 525
121335 242505 443
629622 778155 504
295647 985799 525
560104 947716 525
289982 408227 441
623944 297569 470
610679 163161 470
7807 202999 383
104618 886454 525
500411 466422 426
183312 476684 449
406490 796434 509
300836 357517 441
514494 392384 470
190507 83589 383
154579 934127 525
810233 687026 504
850015 724774 525
857239 885520 432
616460 398929 470
354131 379379 423
131537 621808 470
123543 808010 509
627872 343291 509
809555 185266 509
466897 56497 449
128466 863889 525
49576 238768 443
906153 997093 507
443196 470652 444
615187 784703 509
867133 834543 525
872929 847221 432
852789 203643 525
296568 661721 509
