455641 595342 470
709917 78759 509
139769 51946 354
925752 433214 525
350172 7654 443
874003 322341 525
555071 602492 434
770368 560065 509
544429 841563 525
286511 905339 525
577809 552424 421
848554 987929 507
337222 289913 384
876960 57514 525
177775 707881 509
83517 813159 509
937632 885500 476
616376 769084 509
535899 99745 470
678438 429883 509
128523 435797 449
808309 311468 509
150001 616492 470
679407 554002 509
79122 496132 449
507107 693055 509
619509 425251 470
557411 745372 509
760010 964211 525
708783 851356 525
212592 771847 509
861318 847981 419
940475 262750 525
286421 784233 509
785058 65879 509
972289 962260 458
462321 684292 509
824537 955390 525
281524 151968 443
757884 800875 468
475706 146469 449
154757 236630 443
368593 883430 525
485050 378246 449
467795 684416 509
92848 159611 383
627973 652745 416
888461 37794 525
181049 829361 509
601417 501733 470
521943 637715 509
107955 471973 449
500886 604059 470
467436 191631 449
385267 498494 449
51482 878443 525
415268 760778 509
804760 807448 406
921722 9882 525
941684 48492 525
489619 791407 509
442053 265327 449
735292 151495 509
617896 209048 470
31693 875043 525
562187 477155 470
640806 452354 509
724226 615308 509
58924 544286 470
857827 204290 525
465436 990613 525
651465 713264 504
760859 64753 509
154593 277169 443
39027 700960 509
900408 856419 445
982897 217239 525
986809 413339 525
438171 567216 470
84056 344715 443
525355 217616 470
757449 142463 509
982520 881116 507
79808 672499 509
876328 323257 525
940775 906947 507
259596 255518 345
354760 832546 509
346824 631692 509
712572 930863 525
961256 154671 525
962170 591039 525
395083 15757 443
163684 703585 509
403505 737516 509
578753 523430 452
46084 968221 525
765071 822 509
237132 843018 525
653116 128634 509
384060 140478 443
372804 707701 509
229422 207608 386
542425 152117 470
293267 956605 525
778795 662392 504
805648 415178 509
795656 499855 509
736907 433787 509
287292 589535 470
941675 632331 525
791825 756284 468
605394 471494 470
67166 67556 237
720116 716422 349
152597 111856 375
744523 17528 509
633338 184587 509
534947 19132 470
74564 484138 449
505380 148215 449
578091 300354 470
48791 907588 525
194072 224872 386
429131 200438 449
906924 192008 525
393505 222857 443
547652 240622 470
651051 563856 509
908542 618902 525
875957 105999 525
753043 222637 509
532988 548199 452
158050 873528 525
446665 620437 470
997927 399804 525
925810 797062 525
917374 474052 525
793165 88393 509
552235 983071 525
570564 713074 509
687794 297748 509
420529 316837 449
19669 403762 443
461934 748568 509
97568 581031 470
133219 997931 525
407481 23596 443
248703 468756 449
255360 717128 509
582123 510145 470
804428 205015 509
658148 754544 504
293549 191374 443
752732 615197 509
634971 819767 504
445474 901609 525
244659 202177 443
585449 141514 470
275587 456362 449
297451 113012 443
565254 217715 470
347186 726178 509
2451 797088 509
722921 591587 509
944387 518818 525
510101 927096 525
398732 94504 443
349994 965152 525
291801 32289 443
303755 160437 443
330168 50498 443
601264 348878 470
633219 470893 509
766305 283134 509
459094 299684 449
901363 406007 525
33896 835758 509
474545 295732 449
775202 910615 525
750090 857697 525
243552 531263 470
346048 454437 449
818344 186539 509
140775 19962 354
925958 934818 476
510113 5661 449
423600 294496 449
766113 837420 468
545262 707628 509
763708 121956 509
764565 563161 509
307048 149632 443
69399 425277 449
897482 257660 525
903427 657231 525
872625 751529 525
724855 699107 504
202961 152263 383
49909 75831 340
248606 528486 470
224892 290024 443
578887 926639 525
840215 544473 525
654579 731981 504
742852 88552 509
198428 538908 470
140219 695113 509
638372 45621 509
113437 864674 525
851654 638117 525
270461 515110 470
227857 449347 449
4674 980252 525
155855 767576 509
882709 538010 525
978072 392971 525
817148 863733 525
413242 910477 525
889171 240080 525
869080 600584 525
307534 182110 443
856648 451645 525
105153 806148 509
303996 634412 509
691949 503434 509
46056 553684 470
698638 660976 442
393953 271079 441
337036 501564 449
791599 55559 509
336204 618921 470
887647 471523 525
383190 104747 443
712280 833028 468
631538 547865 509
48593 383268 443
266499 169070 443
74202 198740 383
494330 57224 449
636203 589208 509
893678 404603 525
724544 142826 509
988652 777235 525
508228 825654 509
965117 309881 525
850215 31669 525
467787 978956 525
182688 895940 525
836718 194375 509
