207676 854721 525
458008 67800 449
948387 635622 525
982078 165043 525
211526 507464 449
992486 225688 525
539572 210419 470
448597 593541 470
497787 548856 470
145509 251951 443
590595 795901 509
328403 931498 525
224935 421102 449
969880 701065 525
69928 249097 443
329570 340911 366
773744 476062 509
413191 228672 449
431780 396856 449
197844 753155 509
425059 598302 470
22189 125767 354
10950 733858 509
935283 842512 476
358875 298995 441
970236 504499 525
711850 387582 509
951323 518522 525
777174 688853 504
543202 354696 470
80980 648538 509
864426 533205 525
335082 186301 443
442666 802758 509
153844 710518 509
808923 35001 509
365907 398324 436
600856 34362 470
170106 968978 525
17002 94903 351
285285 13077 443
762907 62038 509
464610 639118 509
501776 603000 470
137040 920722 525
462037 603077 470
864708 331475 525
832629 663232 504
650818 378234 509
607888 43505 470
98802 651554 509
522642 318068 470
516753 357894 470
5943 273510 443
799660 61462 509
308657 81017 443
218239 966799 525
632570 543182 509
634094 126768 509
621811 853503 525
183108 385393 443
618734 598873 447
652229 184509 509
245376 201737 443
803380 699624 504
432180 541406 470
42282 731172 509
994410 85505 525
697936 845109 525
70335 948336 525
484264 421167 444
626360 956734 525
629877 145086 509
2466 647252 509
648019 409181 509
685630 326432 509
542212 986520 525
237046 211319 443
200661 374958 443
682119 644305 442
895724 989589 507
189269 689072 509
150353 6310 375
965632 18925 525
446520 123507 449
196056 624 383
915689 285228 525
322466 300351 384
745422 144566 509
854736 635229 525
330951 931367 525
535872 409022 470
391630 73118 443
932017 117729 525
156444 310842 443
301485 886421 525
739521 981946 525
404082 255750 441
453947 351793 449
996630 762813 525
32891 664163 509
619635 538869 452
87907 163159 383
243081 782389 509
161959 664193 509
720278 790108 468
3824 904228 525
115930 683949 509
249460 264397 407
332025 704784 509
498351 763396 509
194273 986416 525
60534 215102 383
693951 195885 509
605142 52954 470
467952 948595 525
52825 113905 354
710718 318206 509
964393 301025 525
955596 626906 525
329174 144860 443
24522 318237 443
603793 986447 525
44190 908471 525
598834 203099 470
979194 932872 507
867515 620764 525
408060 366774 436
104345 790784 509
404078 87841 443
588584 931256 525
57306 448075 449
7401 277143 443
362346 981456 525
293666 526243 470
982250 341832 525
117627 92463 354
529073 25996 470
861428 260312 525
915589 659168 525
461880 931043 525
526847 380749 470
771533 831041 468
652818 927494 525
377862 481663 449
604017 267944 470
178014 693069 509
709403 169191 509
639916 622620 509
949237 771015 525
513593 2756 470
117439 12279 354
497088 575952 470
238392 566567 470
409486 411091 449
529994 928782 525
781422 998630 525
4331 263416 443
660578 982210 525
683137 560980 509
547296 734227 509
943446 709622 525
125296 942305 525
448399 12205 449
367244 638403 509
153034 635168 509
546667 337168 470
595184 523568 452
443069 76830 449
896165 470093 525
688900 148942 509
3364 476151 449
708300 679938 504
881462 923474 476
769986 285534 509
662869 348495 509
354313 706834 509
516682 110011 470
402336 42467 443
232572 97101 443
711572 450392 509
255097 888604 525
657381 234492 509
816027 29480 509
336914 716377 509
375943 44703 443
600346 906681 525
154594 349797 443
433639 663215 509
395830 453660 449
282332 294026 389
475319 138197 449
203976 880983 525
857909 318158 525
25396 503495 449
983527 262520 525
622582 922222 525
231983 614578 470
587648 641743 509
826079 478519 509
193898 659547 509
492877 52690 449
475586 341979 449
39352 702464 509
609020 796919 509
945681 681253 525
222128 575138 470
748927 286888 509
772359 602713 509
552184 712304 509
863921 642593 525
34553 49589 324
7232 291648 443
832873 56410 509
474129 91741 449
768813 692188 504
462483 131009 449
969755 183664 525
339041 515603 470
10026 138636 354
766266 256327 509
383832 628848 509
369169 439044 449
906539 250591 525
24054 86178 351
454018 949820 525
687039 301045 509
643283 696941 442
745424 302601 509
363257 301134 441
136218 482708 449
973550 743 525
823030 798603 450
470791 62171 449
940823 628541 525
836363 795193 468
249732 635459 509
420784 946959 525
679997 160191 509
315747 227849 443
582145 868650 525
464828 54380 449
670356 605348 509
245240 642400 509
637301 447169 509
920772 821969 525
282060 821097 509
969932 391852 525
814249 81271 509
592325 765112 509
