{
    "decorado": ["Fase1.png", 2400],
    "llave": true,
    "coordenadas": {
        "suelos": [[0, 570, 960, 15],[1090, 570, 90, 15], [1330, 570, 170, 15],
                        [800, 470, 120, 10],[990, 410, 120, 10],[1190, 350, 120, 10],
                        [1410, 350, 380, 10],[1920, 350, 480, 10]],
        "pinchos": [[960, 570, 130, 15],[1180, 570, 150, 15], [1790, 570, 130, 15]],
        "fuego": [],
        "especiales": {
            "paredIzquierda": [[1760, 360, 30, 220]],
            "paredDerecha": [[1920, 360, 30, 220],[1500, 380, 30, 200]],
            "cargarFase": [[2370, 320, 30, 10]],
            "llave": [[1450, 535, 40, 30]],
            "itemsRecoger": [[40,520]]
        },
        "jugador": [[200, 571]],
        "enemigos": [[832, 571],[1700, 351],[2280, 351]]
    }
}