   241   363    45    41
   287   363    47    41
   335   363    50    41
   386   362    54    42
   441   361    57    43
   499   360    57    44
   499   360    57    44
   441   361    57    43
   386   362    54    42
   335   363    50    41
   287   363    47    41
   241   363    45    41

     1   420    38    40
    40   420    43    40
    84   420    43    40
   128   421    38    39
   167   420    42    40
   210   420    43    40

   241   363    45    41
   287   363    47    41
   335   363    50    41
   386   362    54    42
   441   361    57    43
   499   360    57    44
   499   360    57    44
   441   361    57    43
   386   362    54    42
   335   363    50    41
   287   363    47    41
   241   363    45    41

   417   467    40    50
   458   467    43    50
   502   467    42    50
   545   470    53    47
   599   464    62    53
   662   470    36    47
   699   468    38    49
   738   467    42    50

   241   363    45    41
  1300   700    50    40
   287   363    47    41
  1300   700    50    40
   335   363    50    41
  1300   700    50    40
   386   362    54    42
  1300   700    50    40
   441   361    57    43
  1300   700    50    40
   499   360    57    44