{
    "decorado": ["Fase2.png", 9600],
    "llave": false,
    "tiempoLimite": 120,
    "coordenadas": {
        "suelos": [[0, 350, 1390, 15],[1650, 350, 520, 15],[3265, 350, 3235, 15],
                   [6780, 350, 360, 15],[7420, 350, 2180, 15],[1470, 285, 100, 15],
                   [2210, 410, 125, 15],[2500, 410, 125, 15],[2820, 410, 125, 15],
                   [3105, 410, 125, 15],[6590, 285, 100, 15],[7230, 285, 100, 15]],
        "pinchos": [[1390, 350, 260, 15],[2170, 480, 1100, 15],[6500, 350, 280, 15],
                    [7140, 350, 280, 15]],
        "fuego": [],
        "especiales": {
            "paredIzquierda": [[2140, 365, 30, 125]],
            "paredDerecha": [[3265, 365, 30, 125]],
            "cargarFase": [[9545, 320, 30, 30]],
            "mensaje1" : [[4700, 390, 250, 180]],
            "desnaux": [[4800, 302, 50, 60]],
            "itemsRecoger": [[2400,440],[7270,315]]
        },
        "jugador": [[30, 351]],
        "enemigos": [[500, 351],[600, 351],[630, 351],[700, 351],[900, 351],[930, 351],
                     [3600, 351],[3630, 351],[3660, 351],[3690, 351],[5300, 351],
                     [5340, 351],[5360, 351],[5500, 351],[510, 351],
                     [5520, 351],[5700, 351],[5800, 351],[6000, 351],[6200, 351],
                     [6220, 351],[8800, 351],[8860, 351],[8700, 351],
                     [8720, 351],[8900, 351],[9000, 351],[9100, 351],[9200, 351],
                     [9210, 351],[9220, 351],[9230, 351],[9250, 351],
                     [9260, 351],[9500, 351],[9520, 351]]
    }
}