     1    22    35    48
    37    22    34    48
    72    22    34    48
   107    22    35    48
   143    22    35    48
   179    23    36    47
   143    22    35    48
   107    22    35    48
    72    22    34    48
    37    22    34    48


   334    20    43    50
   378    20    41    50
   420    20    40    50
   461    20    41    50
   503    20    43    50
   547    20    45    50


  1271    82    39    45
  1271    82    39    45
  1271    82    39    45
  1228    83    42    44
  1228    83    42    44
  1228    83    42    44
  1183    83    44    44
  1183    83    44    44
  1183    83    44    44


  1183    28    64    42
  1248    16    64    54
  1313    17    72    53
  1386    30    67    40