%YAML 1.1
%TAG !u! tag:unity3d.com,2011:
--- !u!1045 &1
EditorBuildSettings:
  m_ObjectHideFlags: 0
  serializedVersion: 2
  m_Scenes:
  - enabled: 1
    path: Assets/Scenes/Final.unity
    guid: 8bec3d4d357a97d4388332ba7456f1a0
  m_configObjects:
    Unity.XR.Oculus.Settings: {fileID: 11400000, guid: 53bf42b070a2f924ca35d23504e0a12a, type: 2}
    com.unity.xr.management.loader_settings: {fileID: 11400000, guid: 8aff48bd19776b046bc0af4b86dfe5d9, type: 2}
    com.unity.xr.openxr.settings4: {fileID: 11400000, guid: 6719f4a69c84d4040adb10861989243d, type: 2}
