%YAML 1.1
%TAG !u! tag:unity3d.com,2011:
--- !u!1 &1856967512509633520
GameObject:
  m_ObjectHideFlags: 0
  m_CorrespondingSourceObject: {fileID: 0}
  m_PrefabInstance: {fileID: 0}
  m_PrefabAsset: {fileID: 0}
  serializedVersion: 6
  m_Component:
  - component: {fileID: 1856967512509633534}
  - component: {fileID: 1856967512509633535}
  m_Layer: 0
  m_Name: DebugController
  m_TagString: Untagged
  m_Icon: {fileID: 0}
  m_NavMeshLayer: 0
  m_StaticEditorFlags: 0
  m_IsActive: 1
--- !u!4 &1856967512509633534
Transform:
  m_ObjectHideFlags: 0
  m_CorrespondingSourceObject: {fileID: 0}
  m_PrefabInstance: {fileID: 0}
  m_PrefabAsset: {fileID: 0}
  m_GameObject: {fileID: 1856967512509633520}
  m_LocalRotation: {x: 0, y: 0, z: 0, w: 1}
  m_LocalPosition: {x: 267.2625, y: 612.36646, z: -77.1777}
  m_LocalScale: {x: 1, y: 1, z: 1}
  m_Children: []
  m_Father: {fileID: 0}
  m_RootOrder: 0
  m_LocalEulerAnglesHint: {x: 0, y: 0, z: 0}
--- !u!114 &1856967512509633535
MonoBehaviour:
  m_ObjectHideFlags: 0
  m_CorrespondingSourceObject: {fileID: 0}
  m_PrefabInstance: {fileID: 0}
  m_PrefabAsset: {fileID: 0}
  m_GameObject: {fileID: 1856967512509633520}
  m_Enabled: 0
  m_EditorHideFlags: 0
  m_Script: {fileID: 11500000, guid: 02acb77b8745ddd49a10a9fdafc21886, type: 3}
  m_Name: 
  m_EditorClassIdentifier: 
  debugCanvasPrefab: {fileID: 4091860752016173299, guid: eb0c2950b7c3c224089a2b1bf81b6da5,
    type: 3}
  eventSystemPrefab: {fileID: 8871373993344100142, guid: cb747d2a548d5b547b956cf1b3722373,
    type: 3}
  _hookFireVar: 3
  _hookJump: 1
  _debugText: 0
  _usingController: 1
