{
  "name": "@use-gpu/inspect",
  "version": "0.8.1",
  "main": "./cjs/index.js",
  "author": "Steven Wittens <steven@acko.net>",
  "license": "MIT",
  "dependencies": {
    "@use-gpu/live": "*",
    "@use-gpu/react": "*",
    "@use-gpu/state": "*",
    "@use-gpu/core": "*",
    "@use-gpu/workbench": "*",
    "@use-gpu/layout": "*",
    "@use-gpu/webgpu": "*",
    "@radix-ui/react-slider": "^0.1.4",
    "@radix-ui/react-tabs": "^0.1.5",
    "@stitches/react": "^1.2.7"
  },
  "devDependencies": {
    "@babel/preset-react": "^7.16.0",
    "@types/react": "^17.0.34",
    "@types/react-dom": "^17.0.11"
  },
  "peerDependencies": {
    "react": "*",
    "react-dom": "*"
  },
  "keywords": [
    "use-gpu",
    "use-gpu-components"
  ],
  "module": "./mjs/index.js"
}