{
  "name": "@use-gpu/webgpu",
  "version": "0.8.1",
  "main": "./cjs/index.js",
  "author": "Steven Wittens <steven@acko.net>",
  "license": "MIT",
  "dependencies": {
    "@use-gpu/core": "*",
    "@use-gpu/live": "*",
    "@use-gpu/workbench": "*"
  },
  "keywords": [
    "use-gpu",
    "use-gpu-components"
  ],
  "module": "./mjs/index.js"
}