{
  "name": "@use-gpu/wgsl",
  "version": "0.8.1",
  "main": "./index.ts",
  "author": "Steven Wittens <steven@acko.net>",
  "license": "MIT",
  "scripts": {
    "test": "MODULE_ENV=cjs jest --watch",
    "lint": "eslint src --ext ts",
    "coverage": "echo 'jest --collect-coverage' disabled",
    "types": "tsc --noEmit",
    "types:watch": "yarn run types -- --watch",
    "build": "rm -rf ../../build/packages/wgsl; rm -rf ../../build/ts/wgsl; yarn run build:js && yarn run build:wgsl && yarn run build:types && yarn run build:pkg && echo '\\xE2\\x9C\\x85' ",
    "build:wgsl": "ts-node build",
    "build:types": "rm tsconfig.tsbuildinfo; tsc --emitDeclarationOnly",
    "build:js": "MODULE_ENV=cjs babel src/index.ts --out-dir ../../build/ts/wgsl/src --extensions \".ts\"; mkdir -p ../../build/packages/wgsl 2>/dev/null",
    "build:pkg": "cp README.md package.json ../../build/packages/wgsl && cp -r ../../build/ts/wgsl/* ../../build/packages/wgsl/ && cp -r ../../build/packages/wgsl/src/* ../../build/packages/wgsl && ts-node ../../scripts/src-to-root wgsl && rm -rf ../../build/packages/wgsl/src; NPM_PACKAGE=wgsl ts-node ../../scripts/package-json-ts-to-js wgsl"
  },
  "devDependencies": {
    "glob": "^7.2.0"
  },
  "types": "types/wgsl-files/index.d.ts",
  "keywords": [
    "use-gpu",
    "use-gpu-library"
  ],
  "exports": {
    ".": {
      "types": "./types/wgsl-files/index.d.ts",
      "default": "./index.ts"
    },
    "./app/fragment/mesh.wgsl": {
      "types": "./app/fragment/mesh.wgsl.d.ts",
      "import": "./app/fragment/mesh.wgsl",
      "require": "./app/fragment/mesh.wgsl"
    },
    "./app/vertex/mesh-pick.wgsl": {
      "types": "./app/vertex/mesh-pick.wgsl.d.ts",
      "import": "./app/vertex/mesh-pick.wgsl",
      "require": "./app/vertex/mesh-pick.wgsl"
    },
    "./app/vertex/mesh.wgsl": {
      "types": "./app/vertex/mesh.wgsl.d.ts",
      "import": "./app/vertex/mesh.wgsl",
      "require": "./app/vertex/mesh.wgsl"
    },
    "./codec/octahedral.wgsl": {
      "types": "./codec/octahedral.wgsl.d.ts",
      "import": "./codec/octahedral.wgsl",
      "require": "./codec/octahedral.wgsl"
    },
    "./contour/fit-linear.wgsl": {
      "types": "./contour/fit-linear.wgsl.d.ts",
      "import": "./contour/fit-linear.wgsl",
      "require": "./contour/fit-linear.wgsl"
    },
    "./contour/fit-quadratic.wgsl": {
      "types": "./contour/fit-quadratic.wgsl.d.ts",
      "import": "./contour/fit-quadratic.wgsl",
      "require": "./contour/fit-quadratic.wgsl"
    },
    "./contour/scan.wgsl": {
      "types": "./contour/scan.wgsl.d.ts",
      "import": "./contour/scan.wgsl",
      "require": "./contour/scan.wgsl"
    },
    "./contour/solve.wgsl": {
      "types": "./contour/solve.wgsl.d.ts",
      "import": "./contour/solve.wgsl",
      "require": "./contour/solve.wgsl"
    },
    "./contour/types.wgsl": {
      "types": "./contour/types.wgsl.d.ts",
      "import": "./contour/types.wgsl",
      "require": "./contour/types.wgsl"
    },
    "./fragment/aces.wgsl": {
      "types": "./fragment/aces.wgsl.d.ts",
      "import": "./fragment/aces.wgsl",
      "require": "./fragment/aces.wgsl"
    },
    "./fragment/gain.wgsl": {
      "types": "./fragment/gain.wgsl.d.ts",
      "import": "./fragment/gain.wgsl",
      "require": "./fragment/gain.wgsl"
    },
    "./fragment/lod-bias.wgsl": {
      "types": "./fragment/lod-bias.wgsl.d.ts",
      "import": "./fragment/lod-bias.wgsl",
      "require": "./fragment/lod-bias.wgsl"
    },
    "./fragment/pbr.wgsl": {
      "types": "./fragment/pbr.wgsl.d.ts",
      "import": "./fragment/pbr.wgsl",
      "require": "./fragment/pbr.wgsl"
    },
    "./fragment/sdf-2d.wgsl": {
      "types": "./fragment/sdf-2d.wgsl.d.ts",
      "import": "./fragment/sdf-2d.wgsl",
      "require": "./fragment/sdf-2d.wgsl"
    },
    "./geometry/anchor.wgsl": {
      "types": "./geometry/anchor.wgsl.d.ts",
      "import": "./geometry/anchor.wgsl",
      "require": "./geometry/anchor.wgsl"
    },
    "./geometry/arrow.wgsl": {
      "types": "./geometry/arrow.wgsl.d.ts",
      "import": "./geometry/arrow.wgsl",
      "require": "./geometry/arrow.wgsl"
    },
    "./geometry/face.wgsl": {
      "types": "./geometry/face.wgsl.d.ts",
      "import": "./geometry/face.wgsl",
      "require": "./geometry/face.wgsl"
    },
    "./geometry/line.wgsl": {
      "types": "./geometry/line.wgsl.d.ts",
      "import": "./geometry/line.wgsl",
      "require": "./geometry/line.wgsl"
    },
    "./geometry/normal.wgsl": {
      "types": "./geometry/normal.wgsl.d.ts",
      "import": "./geometry/normal.wgsl",
      "require": "./geometry/normal.wgsl"
    },
    "./geometry/quad.wgsl": {
      "types": "./geometry/quad.wgsl.d.ts",
      "import": "./geometry/quad.wgsl",
      "require": "./geometry/quad.wgsl"
    },
    "./geometry/segment.wgsl": {
      "types": "./geometry/segment.wgsl.d.ts",
      "import": "./geometry/segment.wgsl",
      "require": "./geometry/segment.wgsl"
    },
    "./geometry/strip.wgsl": {
      "types": "./geometry/strip.wgsl.d.ts",
      "import": "./geometry/strip.wgsl",
      "require": "./geometry/strip.wgsl"
    },
    "./geometry/trim.wgsl": {
      "types": "./geometry/trim.wgsl.d.ts",
      "import": "./geometry/trim.wgsl",
      "require": "./geometry/trim.wgsl"
    },
    "./instance/fragment/emissive.wgsl": {
      "types": "./instance/fragment/emissive.wgsl.d.ts",
      "import": "./instance/fragment/emissive.wgsl",
      "require": "./instance/fragment/emissive.wgsl"
    },
    "./instance/fragment/light.wgsl": {
      "types": "./instance/fragment/light.wgsl.d.ts",
      "import": "./instance/fragment/light.wgsl",
      "require": "./instance/fragment/light.wgsl"
    },
    "./instance/fragment/shaded.wgsl": {
      "types": "./instance/fragment/shaded.wgsl.d.ts",
      "import": "./instance/fragment/shaded.wgsl",
      "require": "./instance/fragment/shaded.wgsl"
    },
    "./instance/fragment/solid.wgsl": {
      "types": "./instance/fragment/solid.wgsl.d.ts",
      "import": "./instance/fragment/solid.wgsl",
      "require": "./instance/fragment/solid.wgsl"
    },
    "./instance/fragment/ui.wgsl": {
      "types": "./instance/fragment/ui.wgsl.d.ts",
      "import": "./instance/fragment/ui.wgsl",
      "require": "./instance/fragment/ui.wgsl"
    },
    "./instance/identity.wgsl": {
      "types": "./instance/identity.wgsl.d.ts",
      "import": "./instance/identity.wgsl",
      "require": "./instance/identity.wgsl"
    },
    "./instance/interleave.wgsl": {
      "types": "./instance/interleave.wgsl.d.ts",
      "import": "./instance/interleave.wgsl",
      "require": "./instance/interleave.wgsl"
    },
    "./instance/surface/material.wgsl": {
      "types": "./instance/surface/material.wgsl.d.ts",
      "import": "./instance/surface/material.wgsl",
      "require": "./instance/surface/material.wgsl"
    },
    "./instance/surface/normal-map.wgsl": {
      "types": "./instance/surface/normal-map.wgsl.d.ts",
      "import": "./instance/surface/normal-map.wgsl",
      "require": "./instance/surface/normal-map.wgsl"
    },
    "./instance/surface/solid.wgsl": {
      "types": "./instance/surface/solid.wgsl.d.ts",
      "import": "./instance/surface/solid.wgsl",
      "require": "./instance/surface/solid.wgsl"
    },
    "./instance/vertex/arrow.wgsl": {
      "types": "./instance/vertex/arrow.wgsl.d.ts",
      "import": "./instance/vertex/arrow.wgsl",
      "require": "./instance/vertex/arrow.wgsl"
    },
    "./instance/vertex/dual-contour.wgsl": {
      "types": "./instance/vertex/dual-contour.wgsl.d.ts",
      "import": "./instance/vertex/dual-contour.wgsl",
      "require": "./instance/vertex/dual-contour.wgsl"
    },
    "./instance/vertex/face.wgsl": {
      "types": "./instance/vertex/face.wgsl.d.ts",
      "import": "./instance/vertex/face.wgsl",
      "require": "./instance/vertex/face.wgsl"
    },
    "./instance/vertex/full-screen.wgsl": {
      "types": "./instance/vertex/full-screen.wgsl.d.ts",
      "import": "./instance/vertex/full-screen.wgsl",
      "require": "./instance/vertex/full-screen.wgsl"
    },
    "./instance/vertex/label.wgsl": {
      "types": "./instance/vertex/label.wgsl.d.ts",
      "import": "./instance/vertex/label.wgsl",
      "require": "./instance/vertex/label.wgsl"
    },
    "./instance/vertex/light.wgsl": {
      "types": "./instance/vertex/light.wgsl.d.ts",
      "import": "./instance/vertex/light.wgsl",
      "require": "./instance/vertex/light.wgsl"
    },
    "./instance/vertex/line.wgsl": {
      "types": "./instance/vertex/line.wgsl.d.ts",
      "import": "./instance/vertex/line.wgsl",
      "require": "./instance/vertex/line.wgsl"
    },
    "./instance/vertex/quad.wgsl": {
      "types": "./instance/vertex/quad.wgsl.d.ts",
      "import": "./instance/vertex/quad.wgsl",
      "require": "./instance/vertex/quad.wgsl"
    },
    "./instance/vertex/tick.wgsl": {
      "types": "./instance/vertex/tick.wgsl.d.ts",
      "import": "./instance/vertex/tick.wgsl",
      "require": "./instance/vertex/tick.wgsl"
    },
    "./instance/vertex/ui-rectangle.wgsl": {
      "types": "./instance/vertex/ui-rectangle.wgsl.d.ts",
      "import": "./instance/vertex/ui-rectangle.wgsl",
      "require": "./instance/vertex/ui-rectangle.wgsl"
    },
    "./layout/clip.wgsl": {
      "types": "./layout/clip.wgsl.d.ts",
      "import": "./layout/clip.wgsl",
      "require": "./layout/clip.wgsl"
    },
    "./layout/layout.wgsl": {
      "types": "./layout/layout.wgsl.d.ts",
      "import": "./layout/layout.wgsl",
      "require": "./layout/layout.wgsl"
    },
    "./layout/scroll.wgsl": {
      "types": "./layout/scroll.wgsl.d.ts",
      "import": "./layout/scroll.wgsl",
      "require": "./layout/scroll.wgsl"
    },
    "./layout/shift.wgsl": {
      "types": "./layout/shift.wgsl.d.ts",
      "import": "./layout/shift.wgsl",
      "require": "./layout/shift.wgsl"
    },
    "./mask/masked.wgsl": {
      "types": "./mask/masked.wgsl.d.ts",
      "import": "./mask/masked.wgsl",
      "require": "./mask/masked.wgsl"
    },
    "./mask/passthru.wgsl": {
      "types": "./mask/passthru.wgsl.d.ts",
      "import": "./mask/passthru.wgsl",
      "require": "./mask/passthru.wgsl"
    },
    "./mask/point.wgsl": {
      "types": "./mask/point.wgsl.d.ts",
      "import": "./mask/point.wgsl",
      "require": "./mask/point.wgsl"
    },
    "./mask/scissor.wgsl": {
      "types": "./mask/scissor.wgsl.d.ts",
      "import": "./mask/scissor.wgsl",
      "require": "./mask/scissor.wgsl"
    },
    "./mask/textured.wgsl": {
      "types": "./mask/textured.wgsl.d.ts",
      "import": "./mask/textured.wgsl",
      "require": "./mask/textured.wgsl"
    },
    "./material/basic-material.wgsl": {
      "types": "./material/basic-material.wgsl.d.ts",
      "import": "./material/basic-material.wgsl",
      "require": "./material/basic-material.wgsl"
    },
    "./material/light.wgsl": {
      "types": "./material/light.wgsl.d.ts",
      "import": "./material/light.wgsl",
      "require": "./material/light.wgsl"
    },
    "./material/lights-default.wgsl": {
      "types": "./material/lights-default.wgsl.d.ts",
      "import": "./material/lights-default.wgsl",
      "require": "./material/lights-default.wgsl"
    },
    "./material/lights.wgsl": {
      "types": "./material/lights.wgsl.d.ts",
      "import": "./material/lights.wgsl",
      "require": "./material/lights.wgsl"
    },
    "./material/pbr-apply.wgsl": {
      "types": "./material/pbr-apply.wgsl.d.ts",
      "import": "./material/pbr-apply.wgsl",
      "require": "./material/pbr-apply.wgsl"
    },
    "./material/pbr-default.wgsl": {
      "types": "./material/pbr-default.wgsl.d.ts",
      "import": "./material/pbr-default.wgsl",
      "require": "./material/pbr-default.wgsl"
    },
    "./material/pbr-material.wgsl": {
      "types": "./material/pbr-material.wgsl.d.ts",
      "import": "./material/pbr-material.wgsl",
      "require": "./material/pbr-material.wgsl"
    },
    "./plot/array.wgsl": {
      "types": "./plot/array.wgsl.d.ts",
      "import": "./plot/array.wgsl",
      "require": "./plot/array.wgsl"
    },
    "./plot/axis.wgsl": {
      "types": "./plot/axis.wgsl.d.ts",
      "import": "./plot/axis.wgsl",
      "require": "./plot/axis.wgsl"
    },
    "./plot/grid-auto.wgsl": {
      "types": "./plot/grid-auto.wgsl.d.ts",
      "import": "./plot/grid-auto.wgsl",
      "require": "./plot/grid-auto.wgsl"
    },
    "./plot/grid.wgsl": {
      "types": "./plot/grid.wgsl.d.ts",
      "import": "./plot/grid.wgsl",
      "require": "./plot/grid.wgsl"
    },
    "./plot/scale.wgsl": {
      "types": "./plot/scale.wgsl.d.ts",
      "import": "./plot/scale.wgsl",
      "require": "./plot/scale.wgsl"
    },
    "./plot/surface.wgsl": {
      "types": "./plot/surface.wgsl.d.ts",
      "import": "./plot/surface.wgsl",
      "require": "./plot/surface.wgsl"
    },
    "./plot/volume.wgsl": {
      "types": "./plot/volume.wgsl.d.ts",
      "import": "./plot/volume.wgsl",
      "require": "./plot/volume.wgsl"
    },
    "./render/fragment/deferred-light.wgsl": {
      "types": "./render/fragment/deferred-light.wgsl.d.ts",
      "import": "./render/fragment/deferred-light.wgsl",
      "require": "./render/fragment/deferred-light.wgsl"
    },
    "./render/fragment/deferred-shaded.wgsl": {
      "types": "./render/fragment/deferred-shaded.wgsl.d.ts",
      "import": "./render/fragment/deferred-shaded.wgsl",
      "require": "./render/fragment/deferred-shaded.wgsl"
    },
    "./render/fragment/deferred-solid.wgsl": {
      "types": "./render/fragment/deferred-solid.wgsl.d.ts",
      "import": "./render/fragment/deferred-solid.wgsl",
      "require": "./render/fragment/deferred-solid.wgsl"
    },
    "./render/fragment/depth.wgsl": {
      "types": "./render/fragment/depth.wgsl.d.ts",
      "import": "./render/fragment/depth.wgsl",
      "require": "./render/fragment/depth.wgsl"
    },
    "./render/fragment/frag-depth.wgsl": {
      "types": "./render/fragment/frag-depth.wgsl.d.ts",
      "import": "./render/fragment/frag-depth.wgsl",
      "require": "./render/fragment/frag-depth.wgsl"
    },
    "./render/fragment/pick.wgsl": {
      "types": "./render/fragment/pick.wgsl.d.ts",
      "import": "./render/fragment/pick.wgsl",
      "require": "./render/fragment/pick.wgsl"
    },
    "./render/fragment/shaded.wgsl": {
      "types": "./render/fragment/shaded.wgsl.d.ts",
      "import": "./render/fragment/shaded.wgsl",
      "require": "./render/fragment/shaded.wgsl"
    },
    "./render/fragment/solid.wgsl": {
      "types": "./render/fragment/solid.wgsl.d.ts",
      "import": "./render/fragment/solid.wgsl",
      "require": "./render/fragment/solid.wgsl"
    },
    "./render/fragment/ui.wgsl": {
      "types": "./render/fragment/ui.wgsl.d.ts",
      "import": "./render/fragment/ui.wgsl",
      "require": "./render/fragment/ui.wgsl"
    },
    "./render/pick.wgsl": {
      "types": "./render/pick.wgsl.d.ts",
      "import": "./render/pick.wgsl",
      "require": "./render/pick.wgsl"
    },
    "./render/sample/cube-to-omni.wgsl": {
      "types": "./render/sample/cube-to-omni.wgsl.d.ts",
      "import": "./render/sample/cube-to-omni.wgsl",
      "require": "./render/sample/cube-to-omni.wgsl"
    },
    "./render/vertex/virtual-depth.wgsl": {
      "types": "./render/vertex/virtual-depth.wgsl.d.ts",
      "import": "./render/vertex/virtual-depth.wgsl",
      "require": "./render/vertex/virtual-depth.wgsl"
    },
    "./render/vertex/virtual-light.wgsl": {
      "types": "./render/vertex/virtual-light.wgsl.d.ts",
      "import": "./render/vertex/virtual-light.wgsl",
      "require": "./render/vertex/virtual-light.wgsl"
    },
    "./render/vertex/virtual-pick.wgsl": {
      "types": "./render/vertex/virtual-pick.wgsl.d.ts",
      "import": "./render/vertex/virtual-pick.wgsl",
      "require": "./render/vertex/virtual-pick.wgsl"
    },
    "./render/vertex/virtual-shaded.wgsl": {
      "types": "./render/vertex/virtual-shaded.wgsl.d.ts",
      "import": "./render/vertex/virtual-shaded.wgsl",
      "require": "./render/vertex/virtual-shaded.wgsl"
    },
    "./render/vertex/virtual-solid.wgsl": {
      "types": "./render/vertex/virtual-solid.wgsl.d.ts",
      "import": "./render/vertex/virtual-solid.wgsl",
      "require": "./render/vertex/virtual-solid.wgsl"
    },
    "./render/vertex/virtual-ui.wgsl": {
      "types": "./render/vertex/virtual-ui.wgsl.d.ts",
      "import": "./render/vertex/virtual-ui.wgsl",
      "require": "./render/vertex/virtual-ui.wgsl"
    },
    "./render/wireframe/wireframe-indirect.wgsl": {
      "types": "./render/wireframe/wireframe-indirect.wgsl.d.ts",
      "import": "./render/wireframe/wireframe-indirect.wgsl",
      "require": "./render/wireframe/wireframe-indirect.wgsl"
    },
    "./render/wireframe/wireframe-list.wgsl": {
      "types": "./render/wireframe/wireframe-list.wgsl.d.ts",
      "import": "./render/wireframe/wireframe-list.wgsl",
      "require": "./render/wireframe/wireframe-list.wgsl"
    },
    "./render/wireframe/wireframe-strip.wgsl": {
      "types": "./render/wireframe/wireframe-strip.wgsl.d.ts",
      "import": "./render/wireframe/wireframe-strip.wgsl",
      "require": "./render/wireframe/wireframe-strip.wgsl"
    },
    "./shadow/directional.wgsl": {
      "types": "./shadow/directional.wgsl.d.ts",
      "import": "./shadow/directional.wgsl",
      "require": "./shadow/directional.wgsl"
    },
    "./shadow/point.wgsl": {
      "types": "./shadow/point.wgsl.d.ts",
      "import": "./shadow/point.wgsl",
      "require": "./shadow/point.wgsl"
    },
    "./transform/cartesian.wgsl": {
      "types": "./transform/cartesian.wgsl.d.ts",
      "import": "./transform/cartesian.wgsl",
      "require": "./transform/cartesian.wgsl"
    },
    "./transform/diff-chain.wgsl": {
      "types": "./transform/diff-chain.wgsl.d.ts",
      "import": "./transform/diff-chain.wgsl",
      "require": "./transform/diff-chain.wgsl"
    },
    "./transform/diff-epsilon.wgsl": {
      "types": "./transform/diff-epsilon.wgsl.d.ts",
      "import": "./transform/diff-epsilon.wgsl",
      "require": "./transform/diff-epsilon.wgsl"
    },
    "./transform/diff-matrix.wgsl": {
      "types": "./transform/diff-matrix.wgsl.d.ts",
      "import": "./transform/diff-matrix.wgsl",
      "require": "./transform/diff-matrix.wgsl"
    },
    "./transform/instance.wgsl": {
      "types": "./transform/instance.wgsl.d.ts",
      "import": "./transform/instance.wgsl",
      "require": "./transform/instance.wgsl"
    },
    "./transform/polar.wgsl": {
      "types": "./transform/polar.wgsl.d.ts",
      "import": "./transform/polar.wgsl",
      "require": "./transform/polar.wgsl"
    },
    "./transform/scissor.wgsl": {
      "types": "./transform/scissor.wgsl.d.ts",
      "import": "./transform/scissor.wgsl",
      "require": "./transform/scissor.wgsl"
    },
    "./transform/spherical.wgsl": {
      "types": "./transform/spherical.wgsl.d.ts",
      "import": "./transform/spherical.wgsl",
      "require": "./transform/spherical.wgsl"
    },
    "./transform/stereographic.wgsl": {
      "types": "./transform/stereographic.wgsl.d.ts",
      "import": "./transform/stereographic.wgsl",
      "require": "./transform/stereographic.wgsl"
    },
    "./transform/web-mercator.wgsl": {
      "types": "./transform/web-mercator.wgsl.d.ts",
      "import": "./transform/web-mercator.wgsl",
      "require": "./transform/web-mercator.wgsl"
    },
    "./use/array.wgsl": {
      "types": "./use/array.wgsl.d.ts",
      "import": "./use/array.wgsl",
      "require": "./use/array.wgsl"
    },
    "./use/color.wgsl": {
      "types": "./use/color.wgsl.d.ts",
      "import": "./use/color.wgsl",
      "require": "./use/color.wgsl"
    },
    "./use/gamma.wgsl": {
      "types": "./use/gamma.wgsl.d.ts",
      "import": "./use/gamma.wgsl",
      "require": "./use/gamma.wgsl"
    },
    "./use/light.wgsl": {
      "types": "./use/light.wgsl.d.ts",
      "import": "./use/light.wgsl",
      "require": "./use/light.wgsl"
    },
    "./use/shadow.wgsl": {
      "types": "./use/shadow.wgsl.d.ts",
      "import": "./use/shadow.wgsl",
      "require": "./use/shadow.wgsl"
    },
    "./use/types.wgsl": {
      "types": "./use/types.wgsl.d.ts",
      "import": "./use/types.wgsl",
      "require": "./use/types.wgsl"
    },
    "./use/view.wgsl": {
      "types": "./use/view.wgsl.d.ts",
      "import": "./use/view.wgsl",
      "require": "./use/view.wgsl"
    }
  }
}