{
  "name": "nodcam",
  "version": "1.0.0",
  "description": "Access and stream web camera in nodejs using ffmpeg, websockets and HTML5.",
  "main": "index.js",
  "scripts": {
    "test": "echo \"Error: no test specified\" && exit 1",
    "express-server": "node index.js",
    "streaming-server": "node stream.js 12345",
    "ok": "ffmpeg -f dshow -i video=\"AUKEY PC-LM1 USB Camera\":audio=\"Microphone (3- AUKEY PC-LM1 USB Microphone)\" -profile:v high -pix_fmt yuvj420p -level:v 4.1 -preset ultrafast -tune zerolatency -vcodec libx264 -r 10 -b:v 512k -s 640x360 -acodec aac -ac 2 -ab 32k -ar 44100 -f mpegts -flush_packets 0 http://localhost:8082/12345/640/480",
    "ffmpeg": "ffmpeg -f vfwcap -video_size 640x480 -framerate 24 -i video='AUKEY PC-LM1 USB Camera' abc.mp4 -movflags faststart -framerate 15 -vcodec mpeg1video -preset veryfast -maxrate 3000k -bufsize 4000k -c:a aac -b:a 160k -ar 44100 -b:a 128k -f mpeg1video http://localhost:8082/12345/640/480"
  },
  "repository": {
    "type": "git",
    "url": "git+https://github.com/tahaipek/Nodcam.git"
  },
  "keywords": [
    "nodejs",
    "webcam",
    "camera",
    "streaming"
  ],
  "author": "Taha İPEK",
  "license": "ISC",
  "bugs": {
    "url": "https://github.com/tahaipek/Nodcam/issues"
  },
  "homepage": "https://github.com/tahaipek/Nodcam#readme",
  "dependencies": {
    "express": "^4.14.0",
    "ws": "^1.1.1"
  }
}
