<?xml version="1.0" standalone="no"?>
<!DOCTYPE svg PUBLIC "-//W3C//DTD SVG 1.1//EN" "http://www.w3.org/Graphics/SVG/1.1/DTD/svg11.dtd" >
<svg xmlns="http://www.w3.org/2000/svg">
<defs>
  <font id="panicons" horiz-adv-x="150">
    <font-face font-family="panicons"
      units-per-em="120" ascent="90"
      descent="30" />
    <missing-glyph horiz-adv-x="0" />
    <glyph glyph-name="area"
      unicode="&#xEA01;"
      horiz-adv-x="150" d="M38.9904 76.071C39.5593 75.5026 39.5605 74.5815 38.9904 74.0106C38.7032 73.7244 38.3336 73.5831 37.9582 73.5831C37.5827 73.5831 37.2136 73.7244 36.9267 74.0113L29.4165 81.5215V8.5621L36.9287 16.072C37.4964 16.6403 38.4186 16.6419 38.9904 16.0707C39.5596 15.5021 39.5605 14.5805 38.9897 14.0096L28.99 4.01C28.7029 3.7239 28.3334 3.5828 27.9582 3.5828C27.5823 3.5828 27.2141 3.7243 26.9293 4.0096L16.9272 14.0116C16.3589 14.5794 16.3574 15.5015 16.9286 16.0734C17.497 16.6424 18.4188 16.6431 18.9896 16.0727L26.4998 8.5578V81.52017L18.9889 74.0093C18.4212 73.441 17.4991 73.4394 16.9272 74.0107C16.3581 74.5792 16.3571 75.5008 16.9279 76.0717L26.9287 86.072401C27.4972 86.641541 28.4189 86.642525 28.9897 86.071714L38.9904 76.071zM132.324 -19.324L122.325 -29.323C122.038 -29.609 121.668 -29.751 121.292 -29.751C120.916 -29.751 120.548 -29.609 120.263 -29.324L120.261 -29.322C119.692 -28.753 119.691 -27.832 120.262 -27.261L127.772 -19.751H54.8116L62.3238 -27.263C62.8925 -27.831 62.894 -28.752 62.3245 -29.323C62.0373 -29.609 61.6674 -29.751 61.2916 -29.751C60.9162 -29.751 60.547 -29.609 60.2601 -29.323L50.2594 -19.322C49.6902 -18.753 49.6893 -17.832 50.2601 -17.261L60.2608 -7.2601C60.8285 -6.6918 61.7507 -6.6902 62.3225 -7.2614C62.8916 -7.83 62.8926 -8.7516 62.3218 -9.3224L54.8116 -16.833H127.772L120.261 -9.3218C119.693 -8.754 119.691 -7.8319 120.262 -7.2601C120.831 -6.6909 121.753 -6.6899 122.323 -7.2608L132.324 -17.263C132.893 -17.831 132.894 -18.753 132.324 -19.324zM51.2917 86.499908H131.292C132.098 86.499908 132.75 85.84736 132.75 85.04156V5.0412C132.75 4.2353 132.098 3.5828 131.292 3.5828H51.2917C50.4859 3.5828 49.8333 4.2353 49.8333 5.0412V85.04156C49.8333 85.84736 50.4859 86.499908 51.2917 86.499908zM52.75 6.4995H129.834V83.58323H52.75V6.4995z" />
    <glyph glyph-name="bathrooms"
      unicode="&#xEA02;"
      horiz-adv-x="150" d="M123.001 -8.8125L128.819 20.502H128.862C132.247 20.502 135 23.253 135 26.634C135 30.006 132.262 32.7495 128.891 32.7645V73.2195C128.889 82.4715 121.357 90 112.098 90C103.314 90 96.0952 83.2215 95.3763 74.625H88.1744C85.1889 74.625 82.7602 72.198 82.7602 69.2145C82.7602 66.231 85.1889 63.804 88.1744 63.804H105.439C108.425 63.804 110.853 66.231 110.853 69.2145C110.853 72.198 108.425 74.625 105.439 74.625H98.3798C99.0868 81.5655 104.969 87 112.099 87C119.703 87 125.89 80.817 125.89 73.218V32.766H21.1376C17.7529 32.766 15 30.015 15 26.6325C15 23.3385 17.6178 20.6625 20.8825 20.526L26.6959 -8.766C27.4389 -13.265 30.3298 -16.906 34.222 -18.73L28.7883 -27.726C28.3605 -28.436 28.5887 -29.356 29.2986 -29.786C29.5403 -29.931 29.809 -30 30.0717 -30C30.5805 -30 31.0758 -29.742 31.358 -29.275L37.1444 -19.698C38.0496 -19.889 38.9817 -20 39.9408 -20H109.765C110.802 -20 111.809 -19.871 112.782 -19.648L118.598 -29.275C118.881 -29.742 119.376 -30 119.885 -30C120.149 -30 120.416 -29.931 120.659 -29.784C121.369 -29.356 121.597 -28.434 121.17 -27.725L115.679 -18.634C119.471 -16.786 122.277 -13.203 123.001 -8.8125zM105.438 71.625C106.769 71.625 107.85 70.5435 107.85 69.2145C107.85 67.8855 106.767 66.804 105.438 66.804H88.1729C86.8415 66.804 85.7608 67.8855 85.7608 69.2145C85.7608 70.5435 86.843 71.625 88.1729 71.625H105.438zM18.002 26.634C18.002 28.362 19.41 29.7675 21.1376 29.7675H128.862C130.59 29.7675 131.998 28.362 131.998 26.634C131.998 24.9075 130.59 23.502 128.862 23.502H21.1376C19.41 23.5005 18.002 24.906 18.002 26.634zM109.765 -17H39.9423C34.8179 -17 30.492 -13.332 29.6499 -8.2305L23.9475 20.5005H125.761L120.05 -8.2785C119.215 -13.33 114.889 -17 109.765 -17zM103.935 50.5725C104.765 50.5725 105.436 51.2445 105.436 52.0725V56.4375C105.436 57.2655 104.765 57.9375 103.935 57.9375C103.105 57.9375 102.434 57.2655 102.434 56.4375V52.0725C102.434 51.2445 103.106 50.5725 103.935 50.5725zM102.434 40.125C102.434 39.297 103.105 38.625 103.935 38.625C104.765 38.625 105.436 39.297 105.436 40.125V44.49C105.436 45.318 104.765 45.99 103.935 45.99C103.105 45.99 102.434 45.318 102.434 44.49V40.125zM96.8052 50.5725C97.6353 50.5725 98.3062 51.2445 98.3062 52.0725V56.4375C98.3062 57.2655 97.6353 57.9375 96.8052 57.9375C95.9752 57.9375 95.3042 57.2655 95.3042 56.4375V52.0725C95.3042 51.2445 95.9767 50.5725 96.8052 50.5725zM95.3042 40.125C95.3042 39.297 95.9752 38.625 96.8052 38.625C97.6353 38.625 98.3062 39.297 98.3062 40.125V44.49C98.3062 45.318 97.6353 45.99 96.8052 45.99C95.9752 45.99 95.3042 45.318 95.3042 44.49V40.125zM89.6754 50.5725C90.5055 50.5725 91.1764 51.2445 91.1764 52.0725V56.4375C91.1764 57.2655 90.5055 57.9375 89.6754 57.9375C88.8453 57.9375 88.1744 57.2655 88.1744 56.4375V52.0725C88.1744 51.2445 88.8468 50.5725 89.6754 50.5725zM88.1744 40.125C88.1744 39.297 88.8453 38.625 89.6754 38.625C90.5055 38.625 91.1764 39.297 91.1764 40.125V44.49C91.1764 45.318 90.5055 45.99 89.6754 45.99C88.8453 45.99 88.1744 45.318 88.1744 44.49V40.125z" />
    <glyph glyph-name="bed"
      unicode="&#xEA03;"
      horiz-adv-x="150" d="M127.172 74.0033C117.346 84.54429 99.8914 89.9250178 75.2888 90C75.2723 90 75.2558 90 75.2393 90H74.7637C74.7472 90 74.7307 90 74.7142 90C50.1116 89.9250178 32.6567 84.54279 22.8295 74.0033C14.4306 64.9949 14.9917 55.6117 15.0157 55.3222V-28.5C15.0157 -29.328 15.6879 -30 16.5161 -30C17.3443 -30 18.0164 -29.328 18.0164 -28.5L18.0149 -10.205H131.985V-28.5C131.985 -29.328 132.657 -30 133.485 -30C134.314 -30 134.986 -29.328 134.986 -28.5L134.983 55.2173C135.011 55.6117 135.571 64.9934 127.172 74.0033zM18.0134 33.282C19.9098 33.9478 31.6605 37.8814 50.1567 39.9164C68.6543 41.9514 97.8419 42.4328 131.987 33.2445V9.5651H18.0134V33.282zM101.278 42.3218C80.6585 44.9042 62.719 44.3074 48.7253 42.6937V61.6162C48.7253 64.752 51.2789 67.3029 54.4161 67.3029H95.5869C98.7241 67.3029 101.278 64.752 101.278 61.6162V42.3218zM25.0905 72.0298C34.2501 81.79245 51.504 86.96622 75.0007 87.00221C98.496 86.96772 115.751 81.79245 124.911 72.0298C132.447 63.9977 131.996 55.5082 131.987 55.3222V36.3412C122.35 38.8981 113.082 40.7112 104.278 41.9319V61.6162C104.278 66.4061 100.379 70.3022 95.5869 70.3022H54.4146C49.6225 70.3022 45.7232 66.4046 45.7232 61.6162V42.3293C31.2059 40.4353 21.4252 37.5545 18.0119 36.4447L18.0104 55.4242C18.0074 55.5082 17.5543 63.9977 25.0905 72.0298zM18.0149 -7.2054V6.5658H131.987V-7.2054H18.0149z" />
    <glyph glyph-name="floors"
      unicode="&#xEA04;"
      horiz-adv-x="150" d="M133.066 -3.2586C131.116 -4.0268 129.167 -4.7949 127.232 -5.563C122.579 -7.3946 117.926 -9.2263 113.287 -11.058C107.659 -13.2737 102.046 -15.4894 96.4183 -17.7051C91.5437 -19.6254 86.6544 -21.5457 81.7798 -23.466C80.1845 -24.1011 78.5892 -24.7215 76.9939 -25.3567C76.2405 -25.6521 75.3986 -25.8737 74.6895 -26.2578C74.66 -26.2725 74.6157 -26.2873 74.5861 -26.3021C74.852 -26.3021 75.1031 -26.3021 75.369 -26.3021C73.4192 -25.534 71.4694 -24.7659 69.5343 -23.9977C64.8813 -22.1661 60.2283 -20.3344 55.5901 -18.5028C49.9621 -16.287 44.349 -14.0713 38.7211 -11.8556C33.8465 -9.9353 28.9572 -8.015 24.0826 -6.0947C22.4873 -5.4596 20.892 -4.8392 19.2966 -4.204C18.5433 -3.9086 17.7752 -3.5393 16.9923 -3.303C16.9628 -3.2882 16.9184 -3.2734 16.8889 -3.2586C16.8889 -4.204 16.8889 -5.1642 16.8889 -6.1095C20.6113 -4.6472 24.3189 -3.1848 28.0413 -1.7224C33.9942 0.6262 39.9471 2.9601 45.9 5.3088C47.259 5.8406 48.6179 6.3871 49.9917 6.9189C49.7258 6.9189 49.4747 6.9189 49.2088 6.9189C52.0892 5.7815 54.9697 4.6441 57.8649 3.5067C62.4292 1.7046 67.0084 -0.0976 71.5728 -1.8997C72.5624 -2.2837 73.5521 -2.786 74.5714 -3.0814C75.4281 -3.3325 76.5212 -2.653 77.2893 -2.3428C81.6469 -0.6293 85.9897 1.0842 90.3472 2.7976C92.563 3.6692 94.7639 4.5407 96.9796 5.4122C98.1761 5.8849 99.4465 6.2985 100.628 6.845C100.687 6.8746 100.746 6.8893 100.805 6.9189C100.54 6.9189 100.288 6.9189 100.023 6.9189C103.745 5.4565 107.453 3.9941 111.175 2.5318C117.128 0.1831 123.081 -2.1508 129.034 -4.4994C130.393 -5.0312 131.752 -5.5778 133.125 -6.1095C133.864 -6.405 134.75 -5.7846 134.942 -5.0755C135.179 -4.2336 134.662 -3.5541 133.908 -3.2586C130.851 -2.0474 127.793 -0.8509 124.735 0.3604C119.255 2.517 113.775 4.6736 108.295 6.8303C106.345 7.5984 104.41 8.3665 102.46 9.1198C101.662 9.43 100.746 10.0061 99.8748 9.7107C98.3977 9.238 96.9649 8.5585 95.5173 7.9972C92.8732 6.9632 90.2291 5.9144 87.585 4.8804C84.8818 3.8169 82.1934 2.7533 79.4902 1.6898C77.954 1.0842 76.3587 0.5376 74.8372 -0.1419C74.7634 -0.1714 74.6895 -0.201 74.6157 -0.2305C74.8816 -0.2305 75.1327 -0.2305 75.3986 -0.2305C71.7796 1.1876 68.1606 2.6204 64.5416 4.0385C59.9329 5.8553 55.3094 7.6722 50.7007 9.4891C50.1985 9.6811 49.7849 9.9175 49.2088 9.755C48.9429 9.6811 48.6918 9.5482 48.4407 9.4448C46.7863 8.7949 45.1319 8.1449 43.4627 7.4802C38.0711 5.3531 32.6648 3.226 27.2732 1.0989C23.6099 -0.3487 19.9466 -1.7667 16.298 -3.2291C16.239 -3.2586 16.1799 -3.2734 16.1208 -3.303C14.7323 -3.8495 14.7175 -5.6073 16.1208 -6.1538C18.0706 -6.922 20.0204 -7.6901 21.9555 -8.4582C26.6233 -10.3046 31.3058 -12.1363 35.9736 -13.9827C41.6163 -16.2132 47.259 -18.4289 52.9164 -20.6594C57.791 -22.5797 62.6508 -24.5 67.5254 -26.4055C69.1207 -27.0407 70.716 -27.6611 72.3113 -28.296C73.0499 -28.592 73.7885 -28.946 74.5418 -29.183C75.1918 -29.389 75.694 -29.109 76.2701 -28.872C77.4961 -28.385 78.7074 -27.9122 79.9334 -27.4247C84.35 -25.6817 88.7815 -23.9386 93.1981 -22.1956C98.7965 -19.9947 104.395 -17.7937 109.978 -15.578C115.045 -13.5839 120.126 -11.5897 125.193 -9.5808C127.97 -8.4877 130.732 -7.3946 133.509 -6.3016C133.642 -6.2572 133.761 -6.1982 133.893 -6.1538C134.632 -5.8584 135.149 -5.1642 134.927 -4.337C134.691 -3.5836 133.82 -2.9632 133.066 -3.2586zM133.066 22.8129C130.023 21.6164 126.995 20.4199 123.952 19.2234C118.472 17.0668 112.992 14.9102 107.512 12.7536C104.941 11.7491 102.371 10.7299 99.8008 9.7254C95.6944 8.1006 91.5732 6.4905 87.4667 4.8656C84.7931 3.8168 82.1194 2.7533 79.431 1.7045C77.8948 1.0989 76.2995 0.5523 74.778 -0.1271C74.7042 -0.1567 74.6303 -0.1862 74.5565 -0.2158C74.8224 -0.2158 75.0735 -0.2158 75.3394 -0.2158C71.7499 1.2023 68.1457 2.6203 64.5562 4.0384C59.9327 5.8553 55.2945 7.6869 50.6711 9.5038C48.4849 10.3606 46.2839 11.2321 44.0978 12.0888C38.7062 14.2159 33.3294 16.3282 27.9378 18.4553C25.5596 19.3859 23.1814 20.3313 20.8032 21.2619C19.5476 21.7494 18.3068 22.3254 17.0365 22.7538C16.9774 22.7686 16.9183 22.7981 16.8592 22.8277C16.8592 21.8823 16.8592 20.9222 16.8592 19.9768C20.5816 21.4392 24.2893 22.9015 28.0117 24.3639C33.9646 26.7126 39.9174 29.0465 45.8703 31.3951C47.2293 31.9269 48.5883 32.4734 49.962 33.0052C49.6961 33.0052 49.445 33.0052 49.1791 33.0052C52.0596 31.8678 54.94 30.7304 57.8352 29.593C62.3996 27.7909 66.9787 25.9888 71.5431 24.1866C72.5328 23.8026 73.5225 23.3004 74.5417 23.0049C75.3984 22.7538 76.4915 23.4333 77.2596 23.7435C81.6172 25.457 85.96 27.1705 90.3176 28.884C92.5333 29.7555 94.7342 30.627 96.95 31.4985C98.1464 31.9712 99.4168 32.3848 100.599 32.9313C100.658 32.9609 100.717 32.9757 100.776 33.0052C100.51 33.0052 100.259 33.0052 99.9929 33.0052C103.715 31.5428 107.423 30.0805 111.145 28.6181C117.098 26.2694 123.051 23.9355 129.004 21.5869C130.363 21.0551 131.722 20.5086 133.096 19.9768C133.834 19.6814 134.721 20.3018 134.913 21.0108C135.149 21.8528 134.632 22.5322 133.879 22.8277C130.821 24.0389 127.763 25.2354 124.705 26.4467C119.225 28.6033 113.745 30.7599 108.265 32.9166C106.315 33.6847 104.38 34.4528 102.43 35.2061C101.633 35.5163 100.717 36.0924 99.8452 35.797C98.368 35.3243 96.9352 34.6448 95.4876 34.0835C92.8435 33.0495 90.1994 32.0007 87.5553 30.9667C84.8522 29.9032 82.1638 28.8397 79.4606 27.7761C77.9244 27.1705 76.329 26.6239 74.8076 25.9444C74.7337 25.9149 74.6599 25.8854 74.586 25.8558C74.8519 25.8558 75.103 25.8558 75.3689 25.8558C71.7499 27.2739 68.1309 28.7067 64.5119 30.1248C59.9032 31.9417 55.2797 33.7585 50.6711 35.5754C50.1688 35.7675 49.7552 36.0038 49.1791 35.8413C48.9132 35.7675 48.6621 35.6345 48.411 35.5311C46.7566 34.8812 45.1022 34.2312 43.433 33.5665C38.0415 31.4394 32.6351 29.3123 27.2436 27.1852C23.5802 25.7376 19.9169 24.3196 16.2684 22.8572C16.2093 22.8277 16.1502 22.8129 16.0911 22.7834C14.7026 22.2368 14.6878 20.479 16.0911 19.9325C19.134 18.736 22.1622 17.5395 25.2051 16.343C30.7001 14.1716 36.2098 12.015 41.7048 9.8436C44.2602 8.8391 46.8157 7.8347 49.3712 6.8302C53.5219 5.1906 57.6727 3.5657 61.8235 1.9261C64.4971 0.8773 67.156 -0.1715 69.8296 -1.2202C71.3511 -1.8259 72.8578 -2.4906 74.4088 -3.0223C75.3541 -3.3473 76.4029 -2.6974 77.2744 -2.3429C79.5197 -1.4566 81.7797 -0.5703 84.025 0.316C89.0325 2.2954 94.0548 4.26 99.0623 6.2394C101.042 7.0222 103.021 7.8051 105 8.5732C110.259 10.6412 115.532 12.724 120.791 14.792C124.927 16.4169 129.063 18.0565 133.199 19.6814C133.421 19.77 133.642 19.8586 133.864 19.9472C134.602 20.2427 135.119 20.9369 134.898 21.7641C134.691 22.4879 133.819 23.1083 133.066 22.8129zM133.066 48.8845C130.023 47.688 126.995 46.4915 123.952 45.2951C118.472 43.1384 112.992 40.9818 107.512 38.8252C104.941 37.8207 102.371 36.8015 99.801 35.797C95.6945 34.1722 91.5733 32.5621 87.4668 30.9372C84.7932 29.8884 82.1196 28.8249 79.4312 27.7761C77.8949 27.1705 76.2996 26.624 74.7782 25.9445C74.7043 25.9149 74.6305 25.8854 74.5566 25.8558C74.8225 25.8558 75.0736 25.8558 75.3395 25.8558C71.75 27.2739 68.1458 28.692 64.5563 30.11C59.9329 31.9269 55.2945 33.7585 50.6711 35.5754C48.4849 36.4322 46.2841 37.3037 44.0979 38.1605C38.7063 40.2875 33.3295 42.3999 27.9379 44.5269C25.5597 45.4575 23.1815 46.4029 20.8033 47.3335C19.5478 47.821 18.307 48.3971 17.0366 48.8254C16.9775 48.8402 16.9184 48.8697 16.8594 48.8993C16.8594 47.9539 16.8594 46.9938 16.8594 46.0484C18.8092 46.8165 20.759 47.5846 22.6941 48.3527C27.3471 50.1844 32.0001 52.0161 36.6383 53.8477C42.2662 56.0634 47.8794 58.2792 53.5073 60.4949C58.3819 62.41515 63.2712 64.33544 68.1458 66.25573C69.7411 66.8909 71.3364 67.5113 72.9317 68.14647C73.6851 68.4419 74.5271 68.66347 75.2361 69.04753C75.2656 69.0623 75.3099 69.07707 75.3395 69.09184C75.0736 69.09184 74.8225 69.09184 74.5566 69.09184C76.5064 68.32373 78.4563 67.55561 80.3913 66.7875C85.0443 64.95584 89.6973 63.12418 94.3355 61.2925C99.9635 59.0768 105.577 56.8611 111.205 54.6454C116.079 52.7251 120.968 50.8048 125.843 48.8845C127.438 48.2493 129.034 47.6289 130.629 46.9938C131.382 46.6983 132.15 46.3291 132.933 46.0927C132.963 46.0779 133.007 46.0632 133.037 46.0484C133.775 45.753 134.662 46.3734 134.854 47.0824C135.09 47.9244 134.573 48.6039 133.82 48.8993C131.87 49.6674 129.92 50.4355 127.985 51.2036C123.317 53.0501 118.635 54.8817 113.967 56.7282C108.324 58.9586 102.681 61.1744 97.0239 63.40484C92.1494 65.32513 87.2896 67.24541 82.415 69.15093C80.8197 69.7861 79.2244 70.4065 77.6291 71.041674C76.8905 71.337103 76.1519 71.691618 75.3986 71.9279606C74.7486 72.134761 74.2464 71.854103 73.6703 71.61776C72.4443 71.130302 71.233 70.65762 70.007 70.17016C65.5903 68.42713 61.1589 66.6841 56.7422 64.94107C51.1439 62.74013 45.5455 60.5392 39.9619 58.3235C34.8953 56.3293 29.8139 54.3352 24.7473 52.3263C21.9703 51.2332 19.208 50.1401 16.431 49.047C16.298 49.0027 16.1799 48.9436 16.0469 48.8993C14.6584 48.3527 14.6436 46.5949 16.0469 46.0484C19.0898 44.8519 22.118 43.6554 25.1609 42.4589C30.6559 40.2875 36.1656 38.1309 41.6606 35.9595C44.2161 34.9551 46.7715 33.9506 49.327 32.9461C53.4778 31.3065 57.6285 29.6816 61.7793 28.042C64.4529 26.9932 67.1118 25.9445 69.7854 24.8957C71.3069 24.2901 72.8136 23.6254 74.3646 23.0936C75.3099 22.7686 76.3587 23.4186 77.2302 23.7731C79.4755 24.6594 81.7355 25.5456 83.9808 26.4319C88.9883 28.4113 94.0106 30.3759 99.0181 32.3553C100.997 33.1382 102.977 33.921 104.956 34.6892C110.215 36.7572 115.488 38.8399 120.747 40.9079C124.883 42.5328 129.019 44.1724 133.155 45.7973C133.376 45.8859 133.598 45.9745 133.82 46.0632C134.558 46.3586 135.075 47.0529 134.854 47.8801C134.691 48.5595 133.82 49.1799 133.066 48.8845z" />
    <glyph glyph-name="home_search"
      unicode="&#xEA05;"
      horiz-adv-x="150" d="M75.9702 84.775C75.5202 85.075 74.7702 85.075 74.3202 84.775L17.1702 45.625C16.4202 45.175 16.2702 44.275 16.8702 43.525C17.1702 43.075 17.6202 42.925 18.0702 42.925C18.3702 42.925 18.6702 43.075 18.9702 43.225L30.2202 51.175V-27.725C30.2202 -28.625 30.8202 -29.225 31.7202 -29.225H118.57C119.47 -29.225 120.07 -28.625 120.07 -27.725V51.025L131.02 43.075C131.32 42.925 131.62 42.775 131.92 42.775C132.37 42.775 132.82 42.925 133.12 43.375C133.57 43.975 133.42 45.025 132.82 45.475L75.9702 84.775zM117.07 -26.225H33.2202V53.275L75.0702 81.775L116.92 53.275V-26.225H117.07zM67.7202 29.875C67.7202 25.525 69.2202 21.325 72.0702 18.025L47.4702 -6.575C46.8702 -7.175 46.8702 -8.075 47.4702 -8.675C47.7702 -8.975 48.2202 -9.125 48.5202 -9.125C48.8202 -9.125 49.2702 -8.975 49.5702 -8.675L74.1702 15.775C77.4702 12.925 81.6702 11.425 86.1702 11.425C91.1202 11.425 95.7702 13.375 99.2202 16.825C102.67 20.275 104.62 24.925 104.62 29.875C104.62 34.825 102.67 39.325 99.0702 42.925C95.6202 46.375 90.9702 48.325 86.0202 48.325C81.0702 48.325 76.4202 46.375 72.9702 42.925C69.5202 39.325 67.7202 34.825 67.7202 29.875zM86.1702 45.325C90.2202 45.325 94.1202 43.675 97.1202 40.825C99.9702 37.975 101.62 34.075 101.62 29.875C101.62 25.675 99.9702 21.925 97.1202 18.925C94.2702 16.075 90.3702 14.425 86.1702 14.425C81.9702 14.425 78.2202 16.075 75.2202 18.925C72.3702 21.775 70.7202 25.675 70.7202 29.875C70.7202 34.075 72.3702 37.825 75.2202 40.825C78.0702 43.675 81.9702 45.325 86.1702 45.325z" />
    <glyph glyph-name="neighborhood"
      unicode="&#xEA06;"
      horiz-adv-x="150" d="M75.4335 90C52.863 90 34.5 71.637 34.5 49.0665C34.5 22.248 72.624 -27.321 74.247 -29.418C74.529 -29.781 74.9595 -29.996 75.4155 -30C75.4215 -30 75.4275 -30 75.4335 -30C75.885 -30 76.314 -29.796 76.5975 -29.445C76.6965 -29.322 86.628 -17.04 96.4215 -1.371C109.656 19.803 116.367 36.7725 116.367 49.0665C116.367 71.6385 98.004 90 75.4335 90zM75.4605 -26.049C68.967 -17.383 37.5 25.8135 37.5 49.0665C37.5 69.9825 54.5175 87 75.4335 87C96.3495 87 113.367 69.9825 113.367 49.0665C113.367 23.7855 82.017 -17.659 75.4605 -26.049zM76.7175 72.642C76.155 73.1265 75.3195 73.1265 74.757 72.642L54.729 55.3665C54.102 54.825 54.0315 53.8785 54.573 53.25C55.1115 52.6245 56.0595 52.5555 56.688 53.094L58.6275 54.7665V35.256C58.6275 34.428 59.298 33.756 60.1275 33.756H91.3425C92.172 33.756 92.8425 34.428 92.8425 35.256V54.768L94.7835 53.094C95.067 52.8495 95.4165 52.7295 95.763 52.7295C96.183 52.7295 96.603 52.9065 96.8985 53.25C97.44 53.877 97.3695 54.825 96.7425 55.3665L76.7175 72.642zM89.844 36.756H61.629V57.3555L75.7365 69.525L89.8425 57.3555L89.844 36.756z" />
    <glyph glyph-name="offer_type"
      unicode="&#xEA07;"
      horiz-adv-x="150" d="M70.6294 36.476C70.9414 36.476 71.2535 36.632 71.5656 36.788L73.1261 37.8804V17.2822C73.1261 16.3459 73.7503 15.7217 74.6866 15.7217H99.8101C100.746 15.7217 101.371 16.3459 101.371 17.2822V37.7243L102.775 36.788C103.087 36.632 103.399 36.476 103.711 36.476C104.179 36.476 104.648 36.632 104.96 37.1001C105.428 37.7243 105.272 38.8167 104.648 39.2848L87.9506 50.6762C87.4824 50.9883 86.7022 50.9883 86.234 50.6762L69.6931 39.2848C68.9128 38.8167 68.7568 37.8804 69.381 37.1001C69.537 36.632 70.1612 36.476 70.6294 36.476zM76.091 40.065L87.0143 47.5553L97.9375 40.065V18.8427H76.091V40.065zM122.125 65.3446C123.061 65.3446 123.685 65.9688 123.685 66.9051V77.8283C123.685 78.7646 123.061 79.3888 122.125 79.3888H45.3498V88.43953C45.3498 89.375813 44.7256 90 43.7893 90H32.8661C31.9298 90 31.3056 89.375813 31.3056 88.43953V79.3888H27.5605C26.6242 79.3888 26 78.7646 26 77.8283V66.9051C26 65.9688 26.6242 65.3446 27.5605 65.3446H31.3056V-28.44C31.3056 -29.376 31.9298 -30 32.8661 -30H43.7893C44.7256 -30 45.3498 -29.376 45.3498 -28.44V65.3446H56.117V58.7906H52.2159C51.2796 58.7906 50.6554 58.1664 50.6554 57.2302V6.3589C50.6554 5.4226 51.2796 4.7984 52.2159 4.7984H121.969C122.905 4.7984 123.529 5.4226 123.529 6.3589V57.2302C123.529 58.1664 122.905 58.7906 121.969 58.7906H116.819V65.3446H122.125zM34.4265 86.87906H42.2289V79.3888H34.4265V86.87906zM29.1209 76.2679H120.408V68.4655H29.1209V76.2679zM42.2289 -26.879H34.4265V65.3446H42.2289V-26.879zM120.408 7.9194H53.7763V55.6697H120.408V7.9194zM113.698 58.7906H59.238V65.3446H113.542V58.7906H113.698z" />
    <glyph glyph-name="regulation"
      unicode="&#xEA08;"
      horiz-adv-x="150" d="M19.3001 -11.007C17.0411 -12.5693 15.5597 -14.9239 15.1274 -17.6358C14.6952 -20.3491 15.3706 -23.0475 17.0321 -25.236C18.6937 -27.424 21.1132 -28.8 23.8419 -29.112C24.2307 -29.157 24.6179 -29.178 25.0022 -29.178C27.3181 -29.178 29.5365 -28.38 31.3482 -26.876L87.5917 19.6651L93.9962 11.234C92.9831 10.3155 92.3121 9.1014 92.1245 7.7327C91.9129 6.19 92.3166 4.6562 93.2592 3.4166C94.4044 1.9084 96.147 1.116 97.9092 1.116C99.1384 1.116 100.378 1.5017 101.429 2.3016L132.694 26.0463C133.935 26.9872 134.733 28.3574 134.945 29.9002C135.157 31.4429 134.753 32.9752 133.81 34.2163C131.973 36.637 128.607 37.1863 126.082 35.6015L104.213 64.3812C106.418 66.39067 106.79 69.77934 104.952 72.19853C103.011 74.757297 99.3471 75.260046 96.782 73.31509L65.5142 49.5719C62.9551 47.6269 62.4553 43.9621 64.4005 41.4018C65.5457 39.8936 67.2883 39.1012 69.0505 39.1012C70.1176 39.1012 71.1833 39.4104 72.1349 40.0092L79.9999 29.657L19.3001 -11.007zM101.854 62.5263L123.658 33.8231L96.3557 13.0859L74.5499 41.7905L101.854 62.5263zM29.4315 -24.5677C27.953 -25.795 26.0798 -26.352 24.1826 -26.131C22.2749 -25.912 20.5849 -24.9504 19.4231 -23.4211C18.2614 -21.8919 17.7886 -20.0055 18.0903 -18.1085C18.3935 -16.2116 19.4307 -14.5668 20.9901 -13.4862L81.8175 27.2649L85.774 22.0573L29.4315 -24.5677zM129.162 33.5125C130.016 33.5125 130.862 33.1283 131.419 32.3959C131.876 31.7941 132.072 31.0512 131.969 30.3009C131.867 29.552 131.479 28.8887 130.876 28.4309L99.6112 4.6877C98.3714 3.7438 96.5928 3.9854 95.6472 5.2295C95.1894 5.8313 94.9943 6.5742 95.0979 7.3245C95.2 8.0734 95.5872 8.7367 96.1906 9.1945L127.457 32.9392C127.966 33.3249 128.566 33.5125 129.162 33.5125zM66.79 43.2177C65.8474 44.4603 66.0891 46.2387 67.3304 47.1812L98.5951 70.92591C99.1069 71.3131 99.7073 71.50069 100.305 71.50069C101.159 71.50069 102.005 71.1165 102.562 70.38414C103.018 69.78234 103.215 69.03948 103.111 68.29061C103.008 67.54174 102.621 66.87841 102.019 66.42068L70.7525 42.676C69.5127 41.7335 67.7356 41.9736 66.79 43.2177z" />
    <glyph glyph-name="rooms"
      unicode="&#xEA09;"
      horiz-adv-x="150" d="M30 -27.95C30 -28.85 30.6 -29.45 31.5 -29.45H118.2C119.1 -29.45 119.7 -28.85 119.7 -27.95V83.5C119.7 84.4 119.1 85 118.2 85H31.5C30.6 85 30 84.4 30 83.5V-27.95zM33 82H73.5V50.05H45.15C44.25 50.05 43.65 49.45 43.65 48.55C43.65 47.65 44.25 47.05 45.15 47.05H107.7C108.6 47.05 109.2 47.65 109.2 48.55C109.2 49.45 108.6 50.05 107.7 50.05H76.35V82H116.55V12.25H82.2C81.3 12.25 80.7 11.65 80.7 10.75V-0.35C80.7 -1.25 81.3 -1.85 82.2 -1.85C83.1 -1.85 83.7 -1.25 83.7 -0.35V9.25H116.55V-26.45H83.55C83.55 -24.2 83.55 -13.4 83.55 -13.4C83.55 -12.5 82.95 -11.9 82.05 -11.9C81.15 -11.9 80.55 -12.5 80.55 -13.4C80.55 -13.4 80.55 -25.7 80.55 -26.45H33V82z" />
  </font>
</defs>
</svg>
