{
    "wpp_settings": {
        "configuration": {
            "enable_comments": "false",
            "enable_revisions": "false",
            "exclude_from_regular_search_results": "false",
            "base_slug": "properties",
            "automatically_insert_overview": "true",
            "do_not_override_search_result_page": "false",
            "single_property": {
                "template": "property",
                "page_template": "default"
            },
            "property_overview": {
                "sort_stats_by_groups": "false",
                "show_true_as_image": "false",
                "thumbnail_size": "medium",
                "pagination_type": "loadmore",
                "show_children": "true",
                "fancybox_preview": "true",
                "add_sort_by_title": "false",
                "display_slideshow": "false"
            },
            "disable_widgets": {
                "wpp_sidebar_building": "false",
                "wpp_sidebar_parcel": "false",
                "wpp_sidebar_apartment": "false",
                "wpp_sidebar_office": "false",
                "wpp_sidebar_house": "false",
                "wpp_sidebar_villa": "false"
            },
            "address_attribute": "",
            "google_maps_localization": "en",
            "google_maps_api": "",
            "google_maps_api_server": "",
            "autoload_css": "true",
            "enable_legacy_features": "false",
            "allow_parent_deep_depth": "false",
            "disable_wordpress_postmeta_cache": "false",
            "developer_mode": "true",
            "auto_delete_attachments": "false",
            "automatically_regenerate_thumbnail": "true",
            "pre_release_update": "false",
            "using_fancybox": "false",
            "default_image": {
                "default": {
                    "url": "",
                    "id": ""
                },
                "types": {
                    "building": {
                        "url": "",
                        "id": ""
                    },
                    "parcel": {
                        "url": "",
                        "id": ""
                    },
                    "apartment": {
                        "url": "",
                        "id": ""
                    },
                    "office": {
                        "url": "",
                        "id": ""
                    },
                    "house": {
                        "url": "",
                        "id": ""
                    },
                    "villa": {
                        "url": "",
                        "id": ""
                    }
                }
            },
            "bottom_insert_pagenation": "false",
            "single_property_view": {
                "map_image_type": "medium",
                "gm_zoom_level": "13"
            },
            "gm_zoom_level": "",
            "google_maps": {
                "show_true_as_image": "false",
                "infobox_settings": {
                    "show_property_title": "true",
                    "show_direction_link": "true",
                    "do_not_show_child_properties": "false",
                    "show_child_property_attributes": "false",
                    "infowindow_styles": "default"
                },
                "infobox_attributes": []
            },
            "display_address_format": "[city], [state]",
            "area_dimensions": "m\u00b2",
            "currency_symbol": "BGN",
            "thousands_sep": ".",
            "currency_symbol_placement": "after",
            "show_aggregated_value_as_average": "false",
            "admin_ui": {
                "overview_table_thumbnail_size": "medium"
            },
            "completely_hide_hidden_attributes_in_admin_ui": "true"
        },
        "location_matters": [
            "building"
        ],
        "hidden_attributes": {
            "building": [
                "price",
                "area"
            ]
        },
        "descriptions": {
            "descriptions": {
                "property_type": "The Property type will determine the layout.",
                "custom_attribute_overview": "Customize what appears in search results in the attribute section.  For example: 1bed, 2baths, area varies slightly.",
                "tagline": "Will appear on overview pages and on top of every listing page."
            }
        },
        "image_sizes": {
            "map_thumb": {
                "width": "75",
                "height": "75"
            },
            "tiny_thumb": {
                "width": "100",
                "height": "100"
            },
            "sidebar_wide": {
                "width": "195",
                "height": "130"
            },
            "slideshow": {
                "width": "640",
                "height": "235"
            }
        },
        "search_conversions": {
            "bedrooms": {
                "Studio": "0.5"
            }
        },
        "searchable_attributes": [
            "area",
            "deposit",
            "bedrooms",
            "bathrooms",
            "city",
            "price",
            "offer_type",
            "offer_type"
        ],
        "searchable_property_types": [
            "floorplan",
            "single_family_home"
        ],
        "property_inheritance": {
            "floorplan": [
                "street_number",
                "route",
                "state",
                "postal_code",
                "location",
                "display_address",
                "address_is_formatted",
                "city"
            ]
        },
        "property_meta": [],
        "property_stats": {
            "price": "Price",
            "area": "Area",
            "floors": "Floors",
            "rooms": "Rooms",
            "bathrooms": "Bathrooms",
            "neighbourhood": "Neighbourhood",
            "regulation": "Regulation"
        },
        "property_types": {
            "building": "Building",
            "parcel": "Parcel",
            "apartment": "Apartment",
            "office": "Office",
            "house": "House",
            "villa": "Villa"
        },
        "taxonomies": {
            "offer_type": {
                "default": "",
                "readonly": "",
                "system": false,
                "meta": "",
                "hidden": "",
                "unique": true,
                "label": "Offer type",
                "labels": [],
                "public": true,
                "hierarchical": false,
                "show_in_menu": true,
                "add_native_mtbox": true,
                "show_in_nav_menus": true,
                "admin_searchable": true,
                "show_tagcloud": false,
                "rich_taxonomy": false,
                "capabilities": {
                    "manage_terms": "manage_wpp_categories",
                    "edit_terms": "manage_wpp_categories",
                    "delete_terms": "manage_wpp_categories",
                    "assign_terms": "manage_wpp_categories"
                },
                "rewrite": {
                    "slug": "offer_type"
                }
            }
        },
        "property_stats_groups": {
            "price": "",
            "area": "",
            "floors": "",
            "rooms": "",
            "bathrooms": "",
            "neighbourhood": "",
            "regulation": "",
            "offer_type": ""
        },
        "searchable_attr_fields": {
            "price": "range_input",
            "area": "range_input",
            "floors": "range_input",
            "rooms": "range_input",
            "bathrooms": "range_input",
            "neighbourhood": "range_input",
            "regulation": "checkbox",
            "offer_type": "dropdown"
        },
        "predefined_search_values": {
            "price": "",
            "area": "",
            "floors": "",
            "rooms": "",
            "bathrooms": "",
            "neighbourhood": "",
            "regulation": ""
        },
        "admin_attr_fields": {
            "price": "currency",
            "area": "number",
            "floors": "number",
            "rooms": "number",
            "bathrooms": "number",
            "neighbourhood": "input",
            "regulation": "radio"
        },
        "predefined_values": {
            "price": "",
            "area": "",
            "floors": "",
            "rooms": "",
            "bathrooms": "",
            "neighbourhood": "",
            "regulation": ""
        },
        "default_values": {
            "price": "",
            "area": "",
            "floors": "",
            "rooms": "",
            "bathrooms": "",
            "neighbourhood": ""
        },
        "property_groups": {
            "main": {
                "name": "Main",
                "color": "#bdd6ff"
            }
        },
        "name": "WP-Property",
        "version": "2.3.5",
        "domain": "wpp",
        "default_coords": {
            "latitude": "57.7973333",
            "longitude": "12.0502107"
        },
        "geo_type_attributes": [
            "formatted_address",
            "street_number",
            "route",
            "district",
            "city",
            "county",
            "state",
            "state_code",
            "country",
            "country_code",
            "postal_code"
        ],
        "images": {
            "map_icon_shadow": "http:\/\/local.panestates.com\/wp-content\/plugins\/wp-property\/static\/images\/map_icon_shadow.png"
        },
        "prop_std_att": {
            "pdf": {
                "price": {
                    "label": "Price",
                    "notice": ""
                },
                "address": {
                    "label": "Address",
                    "notice": "This attribute will be used for automatic geolocation."
                },
                "bedrooms": {
                    "label": "Bedrooms",
                    "notice": ""
                },
                "bathrooms": {
                    "label": "Bathrooms",
                    "notice": ""
                },
                "living_space_size": {
                    "label": "Living Space size Sq ft",
                    "notice": ""
                },
                "features": {
                    "label": "Features",
                    "notice": ""
                },
                "community_features": {
                    "label": "Community Features",
                    "notice": ""
                }
            },
            "importer": {
                "total_rooms": {
                    "label": "Total Rooms",
                    "notice": ""
                },
                "year_built": {
                    "label": "Year Built",
                    "notice": ""
                },
                "no_of_floors": {
                    "label": "No. of Floors",
                    "notice": ""
                },
                "lot_size_acres": {
                    "label": "Lot size, acres",
                    "notice": ""
                },
                "neighborhood": {
                    "label": "Neighborhood (term)",
                    "notice": ""
                },
                "fees": {
                    "label": "Fees",
                    "notice": ""
                },
                "status": {
                    "label": "Status",
                    "notice": ""
                }
            }
        },
        "prop_std_att_mapped": [],
        "prop_std_att_mapsto": [],
        "property_assistant": {
            "default_atts": {
                "tagline": "Tagline",
                "location": "Address",
                "city": "City",
                "price": "Price",
                "year_built": "Year Built",
                "fees": "Fees"
            },
            "residential": {
                "bedrooms": "Bedrooms",
                "bathrooms": "Bathrooms",
                "total_rooms": "Total Rooms",
                "living_space": "Living space"
            },
            "commercial": {
                "business_purpose": "Business Purpose"
            },
            "land": {
                "lot_size": "Lot Size"
            }
        },
        "numeric_attributes": [
            "price",
            "area",
            "floors",
            "rooms",
            "bathrooms"
        ],
        "currency_attributes": [
            "price"
        ]
    },
    "wpp_terms": {
        "name": "WP-Property: Terms",
        "version": "1.1.1",
        "domain": "wpp_terms",
        "types": {
            "multiple": {
                "label": "Multiple Terms",
                "desc": "Property can have multiple terms. It's a native WordPress functionality."
            },
            "unique": {
                "label": "Unique Term",
                "desc": "Property can have only one term. "
            }
        },
        "config": {
            "taxonomies": {
                "offer_type": {
                    "default": "",
                    "readonly": "",
                    "system": false,
                    "meta": "",
                    "hidden": "",
                    "unique": true,
                    "label": "Offer type",
                    "labels": [],
                    "public": true,
                    "hierarchical": false,
                    "show_in_menu": true,
                    "add_native_mtbox": true,
                    "show_in_nav_menus": true,
                    "admin_searchable": true,
                    "show_tagcloud": false,
                    "rich_taxonomy": false,
                    "capabilities": {
                        "manage_terms": "manage_wpp_categories",
                        "edit_terms": "manage_wpp_categories",
                        "delete_terms": "manage_wpp_categories",
                        "assign_terms": "manage_wpp_categories"
                    },
                    "rewrite": {
                        "slug": "offer_type"
                    }
                }
            },
            "types": {
                "offer_type": "unique"
            },
            "groups": {
                "offer_type": ""
            }
        }
    }
}