%YAML 1.1
%TAG !u! tag:unity3d.com,2011:
--- !u!1045 &1
EditorBuildSettings:
  m_ObjectHideFlags: 0
  serializedVersion: 2
  m_Scenes:
  - enabled: 1
    path: "Assets/Scenes/Men\xFA principal.unity"
    guid: f60598886b5bb634a91825fd4070fa9b
  - enabled: 1
    path: Assets/Scenes/Gameplay.unity
    guid: 296c05548ce04a74a814611860db6471
  - enabled: 1
    path: Assets/Scenes/creditos.unity
    guid: 34b7b46ca41bc3843a19fe9c792b098b
  - enabled: 1
    path: Assets/Scenes/Derrota.unity
    guid: 73a0911d1d757054f985e2df7a3b7af1
  m_configObjects: {}
