<?xml version="1.0" encoding="UTF-8" standalone="no"?>
<!-- Created with Inkscape (http://www.inkscape.org/) -->
<svg id="svg2" xmlns:rdf="http://www.w3.org/1999/02/22-rdf-syntax-ns#" xmlns="http://www.w3.org/2000/svg" height="81.689mm" viewBox="0 0 87.977775 289.44584" width="24.829mm" version="1.1" xmlns:cc="http://creativecommons.org/ns#" xmlns:dc="http://purl.org/dc/elements/1.1/">
 <defs id="defs8">
  <filter id="filter5475" style="color-interpolation-filters:sRGB" height="1.0147" width="1.0663" y="-.0073259" x="-.033152">
   <feGaussianBlur id="feGaussianBlur5477" stdDeviation="0.84490214"/>
  </filter>
 </defs>
 <metadata id="metadata7">
  <rdf:RDF>
   <cc:Work rdf:about="">
    <dc:format>image/svg+xml</dc:format>
    <dc:type rdf:resource="http://purl.org/dc/dcmitype/StillImage"/>
    <dc:title/>
   </cc:Work>
  </rdf:RDF>
 </metadata>
 <g id="g5481" transform="translate(.68586 -218.86)">
  <path id="rect3336" opacity=".4" style="color:#000000" fill-opacity=".6" d="m69.06 220.96c4.477 0 10.046 4.8967 8.0812 9.1363l-60 129.47 60 129.47c2.1282 4.5923-3.6042 9.1363-8.0812 9.1363s-6.9925-6.7611-8.0812-9.1363c-1.089-2.37-60-129.47-60-129.47l60-129.47c2.1282-4.5923 3.6042-9.1363 8.0812-9.1363z"/>
  <g>
   <path id="path4854" opacity="0.401" style="color:#000000" d="m69.06 220.96c-4.477 0-5.9538 4.5443-8.082 9.1366l-59.999 129.47s58.911 127.1 60 129.47c1.0887 2.3752 3.605 9.1366 8.082 9.1366s10.21-4.5443 8.082-9.1366l-60.003-129.47 60.002-129.47c1.9647-4.2396-3.605-9.1366-8.082-9.1366zm0 0.71092c1.9801 0 4.3702 1.141 5.9492 2.7637s2.3214 3.5697 1.4902 5.3632l-59.999 129.47a0.70896 0.70896 0 0 0 0 0.59766l59.999 129.47c0.92449 1.9949 0.17034 3.9119-1.4199 5.4863-1.5902 1.5743-4.0207 2.6406-6.0195 2.6406-1.8817 0-3.4546-1.4597-4.7226-3.3613s-2.1506-4.1282-2.7148-5.3593c-0.56684-1.2367-15.546-33.561-30.41-65.632-14.794-31.91-29.315-63.24-29.452-63.54l59.861-129.17c1.0753-2.3203 1.9786-4.5777 3.0996-6.1816 1.1209-1.6039 2.3411-2.543 4.3398-2.543z"/>
   <path id="path5433" opacity=".6" style="color:#000000" d="m77.445 227.39c0.17437 0.89983 0.11131 1.8214-0.30273 2.7148l-60.001 129.47 60.001 129.47c2.1282 4.5923-3.605 9.1366-8.082 9.1366-0.22695 0-0.44516-0.0292-0.6621-0.0625 1.3958 2.7934 3.5439 6.0624 6.6621 6.0624 4.477 0 10.21-4.5443 8.082-9.1366l-60.002-129.47 60.002-129.47c1.6236-3.5035-1.8991-7.448-5.6972-8.7148z"/>
   <path id="path5435" opacity="0.401" style="color:#000000" d="m77.445 227.39c0.05083 0.2623 0.07829 0.52612 0.08398 0.79101 1.2764 0.48337 2.5268 1.2816 3.4804 2.2617 1.579 1.6227 2.3214 3.5697 1.4902 5.3632l-60 129.46a0.70896 0.70896 0 0 0 0 0.59766l59.999 129.47c0.92449 1.995 0.17033 3.9119-1.4199 5.4863-1.5902 1.5743-4.0207 2.6406-6.0195 2.6406-1.8817 0-3.4546-1.4596-4.7226-3.3613-0.41936-0.6289-0.78167-1.2872-1.1191-1.9394-0.05231 0.001-0.10622 0.01-0.1582 0.01-0.22695 0-0.44516-0.0292-0.6621-0.0625 1.396 2.7934 3.544 6.0624 6.6621 6.0624 4.477 0 10.21-4.5443 8.082-9.1366l-60.002-129.47 60.002-129.47c1.6236-3.5035-1.8989-7.4479-5.6972-8.7148z" filter="url(#filter5475)"/>
  </g>
 </g>
</svg>
