......................
----------------------------------------------------------------------
Ran 22 tests in 0.076s

OK
Name             Stmts   Miss Branch BrPart  Cover   Missing
------------------------------------------------------------
Collatz.py          51      0     22      0   100%
TestCollatz.py      85      0      0      0   100%
------------------------------------------------------------
TOTAL              136      0     22      0   100%
