1 10 20
100 200 125
201 210 89
900 1000 174
1 999999 525
1 1 1
999999 999999 259
1 50 112
50 50 25
50 999999 525
716350 751698 424
970444 984390 458
360439 886560 525
404063 651973 509
869166 944671 507
820295 959846 525
633107 893564 525
309662 607871 470
700810 929681 525
345475 899141 525
318567 562769 470
698995 820846 504
29973 168390 383
873946 913432 476
574729 976611 525
877081 882760 401
748706 913470 525
8034 525550 470
297117 333941 384
941269 984779 458
236761 652902 509
457457 691701 509
163000 772388 509
303837 324416 384
599169 706208 509
208563 629555 509
421697 804471 509
543319 654501 509
72693 659027 509
350028 497128 449
177457 194115 365
226684 567334 470
181589 928936 525
490816 492286 320
125697 328567 443
341637 700032 509
265929 429945 449
301973 624330 470
126411 802307 509
42444 92021 351
783815 817696 468
885620 906715 445
704092 933240 525
667351 883962 525
234349 559713 470
412415 835329 509
393552 524848 470
250738 361743 441
307598 979466 525
693809 770018 504
913500 918133 383
476905 694878 509
96524 693523 509
857431 982337 507
946711 960039 414
330404 875392 525
424840 837666 509
925880 926193 326
926594 930777 476
802090 863710 525
232338 421625 449
481471 584028 470
640110 749817 504
890089 997908 507
478389 488240 413
259294 372536 441
15718 210780 383
345373 851363 525
748377 952689 525
458422 792928 509
608232 761970 509
560795 718162 509
759839 767595 380
844046 948683 507
926981 977876 507
802763 933834 525
138968 447023 449
529126 874176 525
298768 893277 525
488087 701470 509
449189 918230 525
457503 742857 509
275264 780383 509
20198 355161 443
710531 773453 468
501053 795802 509
190427 283972 443
14266 554841 470
867604 882928 432
479706 838014 525
412946 938510 525
793504 894293 525
830397 899048 525
762818 917451 525
918078 924763 445
617102 690384 509
964662 998554 458
84711 926630 525
752207 957052 525
