{
  "users": [
    {
      "id": 1,
      "name": "Chiquim da Silva",
      "email": "chiquim@email.com",
      "phone": "(85) 9 9999-1234",
      "password": "12345678",
      "created_at": "2021-09-25 19:45:12",
      "last_login": null
    },
    {
      "id": 2,
      "name": "Chiquim da Silva 2",
      "email": "chiquim@email.com",
      "phone": "(85) 9 9999-1234",
      "password": "12345678",
      "created_at": "2021-09-25 19:45:12",
      "last_login": null
    },
    {
      "id": 3,
      "name": "Chiquim da Silva 3",
      "email": "chiquim@email.com",
      "phone": "(85) 9 9999-1234",
      "password": "12345678",
      "created_at": "2021-09-25 19:45:12",
      "last_login": null
    },
    {
      "nome": "teste",
      "email": "teste@teste.com",
      "fone": "1234",
      "password": "1234",
      "id": 4
    },
    {
      "name": "opa",
      "email": "opa@opa.com",
      "phone": "1234",
      "password": "1234",
      "id": 5
    },
    {
      "name": "jkh",
      "email": "kjh",
      "phone": "kjh",
      "password": "kjh",
      "id": 6
    },
    {
      "name": "jhk",
      "email": "kjhlk",
      "phone": "lkjh",
      "password": "lkjh",
      "id": 7
    }
  ],
  "vehicles": [
    {
      "id": 1,
      "plate": "XXX-0800",
      "make": "Chevrolet",
      "model": "Celta"
    },
    {
      "id": 2,
      "plate": "XXA-0800",
      "make": "Chevrolet",
      "model": "Classic"
    },
    {
      "id": 3,
      "plate": "XXB-0800",
      "make": "Chevrolet",
      "model": "Kadett"
    },
    {
      "plate": "PNo7745",
      "make": "Chevrolet",
      "model": "Celta",
      "id": 4
    },
    {
      "plate": "ORT5515",
      "make": "Chevrolet",
      "model": "Classic",
      "id": 5
    },
    {
      "plate": "pow 5455",
      "make": "chevrolet",
      "model": "chevette",
      "id": 6
    }
  ],
  "zones": [
    {
      "id": 1,
      "head_office": "Fortaleza",
      "number": 33,
      "judge": "Chiquim da Silva",
      "clerk": "Zezim das Rapaduras",
      "phone": "85 9 9999-9999",
      "email": "zona-33@tre.ce.gov.br"
    },
    {
      "id": 2,
      "head_office": "Fortaleza",
      "number": 45,
      "judge": "Chiquim da Silva 2",
      "clerk": "Zezim das Rapaduras 2",
      "phone": "85 9 9999-9999",
      "email": "zona-33@tre.ce.gov.br"
    },
    {
      "id": 3,
      "head_office": "Fortaleza",
      "number": 49,
      "judge": "Chiquim da Silva 3",
      "clerk": "Zezim das Rapaduras 3",
      "phone": "85 9 9999-9999",
      "email": "zona-33@tre.ce.gov.br"
    },
    {
      "head_office": "sede1",
      "number": "1",
      "judge": "juiz1",
      "clerk": "cc1",
      "phone": "8590000000",
      "email": "sede1@tre.com",
      "id": 4
    },
    {
      "head_office": "s1",
      "number": "1",
      "judge": "j1",
      "clerk": "c1",
      "phone": "8590000000",
      "email": "z1@tre.com",
      "id": 5
    },
    {
      "head_office": "jhg",
      "number": "kjhk",
      "judge": "jhkj",
      "clerk": "hkjh",
      "phone": "kjhk",
      "email": "jjkh",
      "id": 6
    },
    {
      "head_office": "kllkj",
      "number": "lkj",
      "judge": "klj",
      "clerk": "kj",
      "phone": "k",
      "email": "jkl",
      "id": 7
    }
  ],
  "faqs": [
    {
      "id": 1,
      "question": "Pergunta bla bla bla 1?",
      "answer": "Resposta bla bla bla 1"
    },
    {
      "id": 2,
      "question": "Pergunta bla bla bla 2?",
      "answer": "Resposta bla bla bla 2"
    },
    {
      "id": 3,
      "question": "Pergunta bla bla bla 3?",
      "answer": "Resposta bla bla bla 3"
    }
  ]
}