%!PS-Adobe-2.0 EPSF-2.0
%%Title: bshminus.eps
%%Creator: gnuplot 4.2 patchlevel 3 
%%CreationDate: Thu Feb 23 00:59:50 2012
%%DocumentFonts: (atend)
%%BoundingBox: 50 50 410 302
%%EndComments
%%BeginProlog
/gnudict 256 dict def
gnudict begin
%
% The following 6 true/false flags may be edited by hand if required
% The unit line width may also be changed
%
/Color true def
/Blacktext false def
/Solid false def
/Dashlength 1 def
/Landscape false def
/Level1 false def
/Rounded false def
/TransparentPatterns false def
/gnulinewidth 7.500 def
/userlinewidth gnulinewidth def
%
/vshift -80 def
/dl1 {
  10.0 Dashlength mul mul
  Rounded { currentlinewidth 0.75 mul sub dup 0 le { pop 0.01 } if } if
} def
/dl2 {
  10.0 Dashlength mul mul
  Rounded { currentlinewidth 0.75 mul add } if
} def
/hpt_ 31.5 def
/vpt_ 31.5 def
/hpt hpt_ def
/vpt vpt_ def
Level1 {} {
/SDict 10 dict def
systemdict /pdfmark known not {
  userdict /pdfmark systemdict /cleartomark get put
} if
SDict begin [
  /Title (bshminus.eps)
  /Subject (gnuplot plot)
  /Creator (gnuplot 4.2 patchlevel 3 )
  /Author (ddu)
%  /Producer (gnuplot)
%  /Keywords ()
  /CreationDate (Thu Feb 23 00:59:50 2012)
  /DOCINFO pdfmark
end
} ifelse
%
% Gnuplot Prolog Version 4.2 (August 2006)
%
/M {moveto} bind def
/L {lineto} bind def
/R {rmoveto} bind def
/V {rlineto} bind def
/N {newpath moveto} bind def
/Z {closepath} bind def
/C {setrgbcolor} bind def
/f {rlineto fill} bind def
/vpt2 vpt 2 mul def
/hpt2 hpt 2 mul def
/Lshow {currentpoint stroke M 0 vshift R 
	Blacktext {gsave 0 setgray show grestore} {show} ifelse} def
/Rshow {currentpoint stroke M dup stringwidth pop neg vshift R
	Blacktext {gsave 0 setgray show grestore} {show} ifelse} def
/Cshow {currentpoint stroke M dup stringwidth pop -2 div vshift R 
	Blacktext {gsave 0 setgray show grestore} {show} ifelse} def
/UP {dup vpt_ mul /vpt exch def hpt_ mul /hpt exch def
  /hpt2 hpt 2 mul def /vpt2 vpt 2 mul def} def
/DL {Color {setrgbcolor Solid {pop []} if 0 setdash}
 {pop pop pop 0 setgray Solid {pop []} if 0 setdash} ifelse} def
/BL {stroke userlinewidth 2 mul setlinewidth
	Rounded {1 setlinejoin 1 setlinecap} if} def
/AL {stroke userlinewidth 2 div setlinewidth
	Rounded {1 setlinejoin 1 setlinecap} if} def
/UL {dup gnulinewidth mul /userlinewidth exch def
	dup 1 lt {pop 1} if 10 mul /udl exch def} def
/PL {stroke userlinewidth setlinewidth
	Rounded {1 setlinejoin 1 setlinecap} if} def
% Default Line colors
/LCw {1 1 1} def
/LCb {0 0 0} def
/LCa {0 0 0} def
/LC0 {1 0 0} def
/LC1 {0 1 0} def
/LC2 {0 0 1} def
/LC3 {1 0 1} def
/LC4 {0 1 1} def
/LC5 {1 1 0} def
/LC6 {0 0 0} def
/LC7 {1 0.3 0} def
/LC8 {0.5 0.5 0.5} def
% Default Line Types
/LTw {PL [] 1 setgray} def
/LTb {BL [] LCb DL} def
/LTa {AL [1 udl mul 2 udl mul] 0 setdash LCa setrgbcolor} def
/LT0 {PL [] LC0 DL} def
/LT1 {PL [4 dl1 2 dl2] LC1 DL} def
/LT2 {PL [2 dl1 3 dl2] LC2 DL} def
/LT3 {PL [1 dl1 1.5 dl2] LC3 DL} def
/LT4 {PL [6 dl1 2 dl2 1 dl1 2 dl2] LC4 DL} def
/LT5 {PL [3 dl1 3 dl2 1 dl1 3 dl2] LC5 DL} def
/LT6 {PL [2 dl1 2 dl2 2 dl1 6 dl2] LC6 DL} def
/LT7 {PL [1 dl1 2 dl2 6 dl1 2 dl2 1 dl1 2 dl2] LC7 DL} def
/LT8 {PL [2 dl1 2 dl2 2 dl1 2 dl2 2 dl1 2 dl2 2 dl1 4 dl2] LC8 DL} def
/Pnt {stroke [] 0 setdash gsave 1 setlinecap M 0 0 V stroke grestore} def
/Dia {stroke [] 0 setdash 2 copy vpt add M
  hpt neg vpt neg V hpt vpt neg V
  hpt vpt V hpt neg vpt V closepath stroke
  Pnt} def
/Pls {stroke [] 0 setdash vpt sub M 0 vpt2 V
  currentpoint stroke M
  hpt neg vpt neg R hpt2 0 V stroke
 } def
/Box {stroke [] 0 setdash 2 copy exch hpt sub exch vpt add M
  0 vpt2 neg V hpt2 0 V 0 vpt2 V
  hpt2 neg 0 V closepath stroke
  Pnt} def
/Crs {stroke [] 0 setdash exch hpt sub exch vpt add M
  hpt2 vpt2 neg V currentpoint stroke M
  hpt2 neg 0 R hpt2 vpt2 V stroke} def
/TriU {stroke [] 0 setdash 2 copy vpt 1.12 mul add M
  hpt neg vpt -1.62 mul V
  hpt 2 mul 0 V
  hpt neg vpt 1.62 mul V closepath stroke
  Pnt} def
/Star {2 copy Pls Crs} def
/BoxF {stroke [] 0 setdash exch hpt sub exch vpt add M
  0 vpt2 neg V hpt2 0 V 0 vpt2 V
  hpt2 neg 0 V closepath fill} def
/TriUF {stroke [] 0 setdash vpt 1.12 mul add M
  hpt neg vpt -1.62 mul V
  hpt 2 mul 0 V
  hpt neg vpt 1.62 mul V closepath fill} def
/TriD {stroke [] 0 setdash 2 copy vpt 1.12 mul sub M
  hpt neg vpt 1.62 mul V
  hpt 2 mul 0 V
  hpt neg vpt -1.62 mul V closepath stroke
  Pnt} def
/TriDF {stroke [] 0 setdash vpt 1.12 mul sub M
  hpt neg vpt 1.62 mul V
  hpt 2 mul 0 V
  hpt neg vpt -1.62 mul V closepath fill} def
/DiaF {stroke [] 0 setdash vpt add M
  hpt neg vpt neg V hpt vpt neg V
  hpt vpt V hpt neg vpt V closepath fill} def
/Pent {stroke [] 0 setdash 2 copy gsave
  translate 0 hpt M 4 {72 rotate 0 hpt L} repeat
  closepath stroke grestore Pnt} def
/PentF {stroke [] 0 setdash gsave
  translate 0 hpt M 4 {72 rotate 0 hpt L} repeat
  closepath fill grestore} def
/Circle {stroke [] 0 setdash 2 copy
  hpt 0 360 arc stroke Pnt} def
/CircleF {stroke [] 0 setdash hpt 0 360 arc fill} def
/C0 {BL [] 0 setdash 2 copy moveto vpt 90 450 arc} bind def
/C1 {BL [] 0 setdash 2 copy moveto
	2 copy vpt 0 90 arc closepath fill
	vpt 0 360 arc closepath} bind def
/C2 {BL [] 0 setdash 2 copy moveto
	2 copy vpt 90 180 arc closepath fill
	vpt 0 360 arc closepath} bind def
/C3 {BL [] 0 setdash 2 copy moveto
	2 copy vpt 0 180 arc closepath fill
	vpt 0 360 arc closepath} bind def
/C4 {BL [] 0 setdash 2 copy moveto
	2 copy vpt 180 270 arc closepath fill
	vpt 0 360 arc closepath} bind def
/C5 {BL [] 0 setdash 2 copy moveto
	2 copy vpt 0 90 arc
	2 copy moveto
	2 copy vpt 180 270 arc closepath fill
	vpt 0 360 arc} bind def
/C6 {BL [] 0 setdash 2 copy moveto
	2 copy vpt 90 270 arc closepath fill
	vpt 0 360 arc closepath} bind def
/C7 {BL [] 0 setdash 2 copy moveto
	2 copy vpt 0 270 arc closepath fill
	vpt 0 360 arc closepath} bind def
/C8 {BL [] 0 setdash 2 copy moveto
	2 copy vpt 270 360 arc closepath fill
	vpt 0 360 arc closepath} bind def
/C9 {BL [] 0 setdash 2 copy moveto
	2 copy vpt 270 450 arc closepath fill
	vpt 0 360 arc closepath} bind def
/C10 {BL [] 0 setdash 2 copy 2 copy moveto vpt 270 360 arc closepath fill
	2 copy moveto
	2 copy vpt 90 180 arc closepath fill
	vpt 0 360 arc closepath} bind def
/C11 {BL [] 0 setdash 2 copy moveto
	2 copy vpt 0 180 arc closepath fill
	2 copy moveto
	2 copy vpt 270 360 arc closepath fill
	vpt 0 360 arc closepath} bind def
/C12 {BL [] 0 setdash 2 copy moveto
	2 copy vpt 180 360 arc closepath fill
	vpt 0 360 arc closepath} bind def
/C13 {BL [] 0 setdash 2 copy moveto
	2 copy vpt 0 90 arc closepath fill
	2 copy moveto
	2 copy vpt 180 360 arc closepath fill
	vpt 0 360 arc closepath} bind def
/C14 {BL [] 0 setdash 2 copy moveto
	2 copy vpt 90 360 arc closepath fill
	vpt 0 360 arc} bind def
/C15 {BL [] 0 setdash 2 copy vpt 0 360 arc closepath fill
	vpt 0 360 arc closepath} bind def
/Rec {newpath 4 2 roll moveto 1 index 0 rlineto 0 exch rlineto
	neg 0 rlineto closepath} bind def
/Square {dup Rec} bind def
/Bsquare {vpt sub exch vpt sub exch vpt2 Square} bind def
/S0 {BL [] 0 setdash 2 copy moveto 0 vpt rlineto BL Bsquare} bind def
/S1 {BL [] 0 setdash 2 copy vpt Square fill Bsquare} bind def
/S2 {BL [] 0 setdash 2 copy exch vpt sub exch vpt Square fill Bsquare} bind def
/S3 {BL [] 0 setdash 2 copy exch vpt sub exch vpt2 vpt Rec fill Bsquare} bind def
/S4 {BL [] 0 setdash 2 copy exch vpt sub exch vpt sub vpt Square fill Bsquare} bind def
/S5 {BL [] 0 setdash 2 copy 2 copy vpt Square fill
	exch vpt sub exch vpt sub vpt Square fill Bsquare} bind def
/S6 {BL [] 0 setdash 2 copy exch vpt sub exch vpt sub vpt vpt2 Rec fill Bsquare} bind def
/S7 {BL [] 0 setdash 2 copy exch vpt sub exch vpt sub vpt vpt2 Rec fill
	2 copy vpt Square fill Bsquare} bind def
/S8 {BL [] 0 setdash 2 copy vpt sub vpt Square fill Bsquare} bind def
/S9 {BL [] 0 setdash 2 copy vpt sub vpt vpt2 Rec fill Bsquare} bind def
/S10 {BL [] 0 setdash 2 copy vpt sub vpt Square fill 2 copy exch vpt sub exch vpt Square fill
	Bsquare} bind def
/S11 {BL [] 0 setdash 2 copy vpt sub vpt Square fill 2 copy exch vpt sub exch vpt2 vpt Rec fill
	Bsquare} bind def
/S12 {BL [] 0 setdash 2 copy exch vpt sub exch vpt sub vpt2 vpt Rec fill Bsquare} bind def
/S13 {BL [] 0 setdash 2 copy exch vpt sub exch vpt sub vpt2 vpt Rec fill
	2 copy vpt Square fill Bsquare} bind def
/S14 {BL [] 0 setdash 2 copy exch vpt sub exch vpt sub vpt2 vpt Rec fill
	2 copy exch vpt sub exch vpt Square fill Bsquare} bind def
/S15 {BL [] 0 setdash 2 copy Bsquare fill Bsquare} bind def
/D0 {gsave translate 45 rotate 0 0 S0 stroke grestore} bind def
/D1 {gsave translate 45 rotate 0 0 S1 stroke grestore} bind def
/D2 {gsave translate 45 rotate 0 0 S2 stroke grestore} bind def
/D3 {gsave translate 45 rotate 0 0 S3 stroke grestore} bind def
/D4 {gsave translate 45 rotate 0 0 S4 stroke grestore} bind def
/D5 {gsave translate 45 rotate 0 0 S5 stroke grestore} bind def
/D6 {gsave translate 45 rotate 0 0 S6 stroke grestore} bind def
/D7 {gsave translate 45 rotate 0 0 S7 stroke grestore} bind def
/D8 {gsave translate 45 rotate 0 0 S8 stroke grestore} bind def
/D9 {gsave translate 45 rotate 0 0 S9 stroke grestore} bind def
/D10 {gsave translate 45 rotate 0 0 S10 stroke grestore} bind def
/D11 {gsave translate 45 rotate 0 0 S11 stroke grestore} bind def
/D12 {gsave translate 45 rotate 0 0 S12 stroke grestore} bind def
/D13 {gsave translate 45 rotate 0 0 S13 stroke grestore} bind def
/D14 {gsave translate 45 rotate 0 0 S14 stroke grestore} bind def
/D15 {gsave translate 45 rotate 0 0 S15 stroke grestore} bind def
/DiaE {stroke [] 0 setdash vpt add M
  hpt neg vpt neg V hpt vpt neg V
  hpt vpt V hpt neg vpt V closepath stroke} def
/BoxE {stroke [] 0 setdash exch hpt sub exch vpt add M
  0 vpt2 neg V hpt2 0 V 0 vpt2 V
  hpt2 neg 0 V closepath stroke} def
/TriUE {stroke [] 0 setdash vpt 1.12 mul add M
  hpt neg vpt -1.62 mul V
  hpt 2 mul 0 V
  hpt neg vpt 1.62 mul V closepath stroke} def
/TriDE {stroke [] 0 setdash vpt 1.12 mul sub M
  hpt neg vpt 1.62 mul V
  hpt 2 mul 0 V
  hpt neg vpt -1.62 mul V closepath stroke} def
/PentE {stroke [] 0 setdash gsave
  translate 0 hpt M 4 {72 rotate 0 hpt L} repeat
  closepath stroke grestore} def
/CircE {stroke [] 0 setdash 
  hpt 0 360 arc stroke} def
/Opaque {gsave closepath 1 setgray fill grestore 0 setgray closepath} def
/DiaW {stroke [] 0 setdash vpt add M
  hpt neg vpt neg V hpt vpt neg V
  hpt vpt V hpt neg vpt V Opaque stroke} def
/BoxW {stroke [] 0 setdash exch hpt sub exch vpt add M
  0 vpt2 neg V hpt2 0 V 0 vpt2 V
  hpt2 neg 0 V Opaque stroke} def
/TriUW {stroke [] 0 setdash vpt 1.12 mul add M
  hpt neg vpt -1.62 mul V
  hpt 2 mul 0 V
  hpt neg vpt 1.62 mul V Opaque stroke} def
/TriDW {stroke [] 0 setdash vpt 1.12 mul sub M
  hpt neg vpt 1.62 mul V
  hpt 2 mul 0 V
  hpt neg vpt -1.62 mul V Opaque stroke} def
/PentW {stroke [] 0 setdash gsave
  translate 0 hpt M 4 {72 rotate 0 hpt L} repeat
  Opaque stroke grestore} def
/CircW {stroke [] 0 setdash 
  hpt 0 360 arc Opaque stroke} def
/BoxFill {gsave Rec 1 setgray fill grestore} def
/Density {
  /Fillden exch def
  currentrgbcolor
  /ColB exch def /ColG exch def /ColR exch def
  /ColR ColR Fillden mul Fillden sub 1 add def
  /ColG ColG Fillden mul Fillden sub 1 add def
  /ColB ColB Fillden mul Fillden sub 1 add def
  ColR ColG ColB setrgbcolor} def
/BoxColFill {gsave Rec PolyFill} def
/PolyFill {gsave Density fill grestore grestore} def
/h {rlineto rlineto rlineto gsave closepath fill grestore} bind def
%
% PostScript Level 1 Pattern Fill routine for rectangles
% Usage: x y w h s a XX PatternFill
%	x,y = lower left corner of box to be filled
%	w,h = width and height of box
%	  a = angle in degrees between lines and x-axis
%	 XX = 0/1 for no/yes cross-hatch
%
/PatternFill {gsave /PFa [ 9 2 roll ] def
  PFa 0 get PFa 2 get 2 div add PFa 1 get PFa 3 get 2 div add translate
  PFa 2 get -2 div PFa 3 get -2 div PFa 2 get PFa 3 get Rec
  gsave 1 setgray fill grestore clip
  currentlinewidth 0.5 mul setlinewidth
  /PFs PFa 2 get dup mul PFa 3 get dup mul add sqrt def
  0 0 M PFa 5 get rotate PFs -2 div dup translate
  0 1 PFs PFa 4 get div 1 add floor cvi
	{PFa 4 get mul 0 M 0 PFs V} for
  0 PFa 6 get ne {
	0 1 PFs PFa 4 get div 1 add floor cvi
	{PFa 4 get mul 0 2 1 roll M PFs 0 V} for
 } if
  stroke grestore} def
%
/languagelevel where
 {pop languagelevel} {1} ifelse
 2 lt
	{/InterpretLevel1 true def}
	{/InterpretLevel1 Level1 def}
 ifelse
%
% PostScript level 2 pattern fill definitions
%
/Level2PatternFill {
/Tile8x8 {/PaintType 2 /PatternType 1 /TilingType 1 /BBox [0 0 8 8] /XStep 8 /YStep 8}
	bind def
/KeepColor {currentrgbcolor [/Pattern /DeviceRGB] setcolorspace} bind def
<< Tile8x8
 /PaintProc {0.5 setlinewidth pop 0 0 M 8 8 L 0 8 M 8 0 L stroke} 
>> matrix makepattern
/Pat1 exch def
<< Tile8x8
 /PaintProc {0.5 setlinewidth pop 0 0 M 8 8 L 0 8 M 8 0 L stroke
	0 4 M 4 8 L 8 4 L 4 0 L 0 4 L stroke}
>> matrix makepattern
/Pat2 exch def
<< Tile8x8
 /PaintProc {0.5 setlinewidth pop 0 0 M 0 8 L
	8 8 L 8 0 L 0 0 L fill}
>> matrix makepattern
/Pat3 exch def
<< Tile8x8
 /PaintProc {0.5 setlinewidth pop -4 8 M 8 -4 L
	0 12 M 12 0 L stroke}
>> matrix makepattern
/Pat4 exch def
<< Tile8x8
 /PaintProc {0.5 setlinewidth pop -4 0 M 8 12 L
	0 -4 M 12 8 L stroke}
>> matrix makepattern
/Pat5 exch def
<< Tile8x8
 /PaintProc {0.5 setlinewidth pop -2 8 M 4 -4 L
	0 12 M 8 -4 L 4 12 M 10 0 L stroke}
>> matrix makepattern
/Pat6 exch def
<< Tile8x8
 /PaintProc {0.5 setlinewidth pop -2 0 M 4 12 L
	0 -4 M 8 12 L 4 -4 M 10 8 L stroke}
>> matrix makepattern
/Pat7 exch def
<< Tile8x8
 /PaintProc {0.5 setlinewidth pop 8 -2 M -4 4 L
	12 0 M -4 8 L 12 4 M 0 10 L stroke}
>> matrix makepattern
/Pat8 exch def
<< Tile8x8
 /PaintProc {0.5 setlinewidth pop 0 -2 M 12 4 L
	-4 0 M 12 8 L -4 4 M 8 10 L stroke}
>> matrix makepattern
/Pat9 exch def
/Pattern1 {PatternBgnd KeepColor Pat1 setpattern} bind def
/Pattern2 {PatternBgnd KeepColor Pat2 setpattern} bind def
/Pattern3 {PatternBgnd KeepColor Pat3 setpattern} bind def
/Pattern4 {PatternBgnd KeepColor Landscape {Pat5} {Pat4} ifelse setpattern} bind def
/Pattern5 {PatternBgnd KeepColor Landscape {Pat4} {Pat5} ifelse setpattern} bind def
/Pattern6 {PatternBgnd KeepColor Landscape {Pat9} {Pat6} ifelse setpattern} bind def
/Pattern7 {PatternBgnd KeepColor Landscape {Pat8} {Pat7} ifelse setpattern} bind def
} def
%
%
%End of PostScript Level 2 code
%
/PatternBgnd {
  TransparentPatterns {} {gsave 1 setgray fill grestore} ifelse
} def
%
% Substitute for Level 2 pattern fill codes with
% grayscale if Level 2 support is not selected.
%
/Level1PatternFill {
/Pattern1 {0.250 Density} bind def
/Pattern2 {0.500 Density} bind def
/Pattern3 {0.750 Density} bind def
/Pattern4 {0.125 Density} bind def
/Pattern5 {0.375 Density} bind def
/Pattern6 {0.625 Density} bind def
/Pattern7 {0.875 Density} bind def
} def
%
% Now test for support of Level 2 code
%
Level1 {Level1PatternFill} {Level2PatternFill} ifelse
%
/Symbol-Oblique /Symbol findfont [1 0 .167 1 0 0] makefont
dup length dict begin {1 index /FID eq {pop pop} {def} ifelse} forall
currentdict end definefont pop
/MFshow {
   { dup 5 get 3 ge
     { 5 get 3 eq {gsave} {grestore} ifelse }
     {dup dup 0 get findfont exch 1 get scalefont setfont
     [ currentpoint ] exch dup 2 get 0 exch R dup 5 get 2 ne {dup dup 6
     get exch 4 get {show} {stringwidth pop 0 R} ifelse }if dup 5 get 0 eq
     {dup 3 get {2 get neg 0 exch R pop} {pop aload pop M} ifelse} {dup 5
     get 1 eq {dup 2 get exch dup 3 get exch 6 get stringwidth pop -2 div
     dup 0 R} {dup 6 get stringwidth pop -2 div 0 R 6 get
     show 2 index {aload pop M neg 3 -1 roll neg R pop pop} {pop pop pop
     pop aload pop M} ifelse }ifelse }ifelse }
     ifelse }
   forall} bind def
/MFwidth {0 exch { dup 5 get 3 ge { 5 get 3 eq { 0 } { pop } ifelse }
 {dup 3 get{dup dup 0 get findfont exch 1 get scalefont setfont
     6 get stringwidth pop add} {pop} ifelse} ifelse} forall} bind def
/MLshow { currentpoint stroke M
  0 exch R
  Blacktext {gsave 0 setgray MFshow grestore} {MFshow} ifelse } bind def
/MRshow { currentpoint stroke M
  exch dup MFwidth neg 3 -1 roll R
  Blacktext {gsave 0 setgray MFshow grestore} {MFshow} ifelse } bind def
/MCshow { currentpoint stroke M
  exch dup MFwidth -2 div 3 -1 roll R
  Blacktext {gsave 0 setgray MFshow grestore} {MFshow} ifelse } bind def
/XYsave    { [( ) 1 2 true false 3 ()] } bind def
/XYrestore { [( ) 1 2 true false 4 ()] } bind def
end
%%EndProlog
gnudict begin
gsave
50 50 translate
0.050 0.050 scale
0 setgray
newpath
(Roman) findfont 240 scalefont setfont
gsave % colour palette begin
/maxcolors 0 def
/HSV2RGB {  exch dup 0.0 eq {pop exch pop dup dup} % achromatic gray
  { /HSVs exch def /HSVv exch def 6.0 mul dup floor dup 3 1 roll sub
     /HSVf exch def /HSVi exch cvi def /HSVp HSVv 1.0 HSVs sub mul def
	 /HSVq HSVv 1.0 HSVs HSVf mul sub mul def 
	 /HSVt HSVv 1.0 HSVs 1.0 HSVf sub mul sub mul def
	 /HSVi HSVi 6 mod def 0 HSVi eq {HSVv HSVt HSVp}
	 {1 HSVi eq {HSVq HSVv HSVp}{2 HSVi eq {HSVp HSVv HSVt}
	 {3 HSVi eq {HSVp HSVq HSVv}{4 HSVi eq {HSVt HSVp HSVv}
	 {HSVv HSVp HSVq} ifelse} ifelse} ifelse} ifelse} ifelse
  } ifelse} def
/Constrain {
  dup 0 lt {0 exch pop}{dup 1 gt {1 exch pop} if} ifelse} def
/YIQ2RGB {
  3 copy -1.702 mul exch -1.105 mul add add Constrain 4 1 roll
  3 copy -0.647 mul exch -0.272 mul add add Constrain 5 1 roll
  0.621 mul exch -0.956 mul add add Constrain 3 1 roll } def
/CMY2RGB {  1 exch sub exch 1 exch sub 3 2 roll 1 exch sub 3 1 roll exch } def
/XYZ2RGB {  3 copy -0.9017 mul exch -0.1187 mul add exch 0.0585 mul exch add
  Constrain 4 1 roll 3 copy -0.0279 mul exch 1.999 mul add exch
  -0.9844 mul add Constrain 5 1 roll -0.2891 mul exch -0.5338 mul add
  exch 1.91 mul exch add Constrain 3 1 roll} def
/SelectSpace {ColorSpace (HSV) eq {HSV2RGB}{ColorSpace (XYZ) eq {
  XYZ2RGB}{ColorSpace (CMY) eq {CMY2RGB}{ColorSpace (YIQ) eq {YIQ2RGB}
  if} ifelse} ifelse} ifelse} def
/InterpolatedColor false def
/cF7 {sqrt} bind def	% sqrt(x)
/cF5 {dup dup mul mul} bind def	% x^3
/cF15 {360 mul sin} bind def	% sin(360x)
/pm3dround {maxcolors 0 gt {dup 1 ge
	{pop 1} {maxcolors mul floor maxcolors 1 sub div} ifelse} if} def
/pm3dGamma 1.0 1.5 div def
/ColorSpace (RGB) def
Color true and { % COLOUR vs. GRAY map
  InterpolatedColor { %% Interpolation vs. RGB-Formula
    /g {stroke pm3dround /grayv exch def interpolate
        SelectSpace setrgbcolor} bind def
  }{
  /g {stroke pm3dround dup cF7 Constrain exch dup cF5 Constrain exch cF15 Constrain 
       SelectSpace setrgbcolor} bind def
  } ifelse
}{
  /g {stroke pm3dround pm3dGamma exp setgray} bind def
} ifelse
1.000 UL
LTb
1962 720 M
157 0 V
4078 0 R
-157 0 V
stroke
1818 720 M
[ [(Roman) 280.0 0.0 true true 0 (-0.16)]
] -93.3 MRshow
1.000 UL
LTb
1962 810 M
78 0 V
4157 0 R
-78 0 V
1962 900 M
78 0 V
4157 0 R
-78 0 V
1962 990 M
78 0 V
4157 0 R
-78 0 V
-4157 90 R
78 0 V
4157 0 R
-78 0 V
-4157 90 R
157 0 V
4078 0 R
-157 0 V
stroke
1818 1170 M
[ [(Roman) 280.0 0.0 true true 0 (-0.14)]
] -93.3 MRshow
1.000 UL
LTb
1962 1260 M
78 0 V
4157 0 R
-78 0 V
-4157 90 R
78 0 V
4157 0 R
-78 0 V
-4157 90 R
78 0 V
4157 0 R
-78 0 V
-4157 90 R
78 0 V
4157 0 R
-78 0 V
-4157 90 R
157 0 V
4078 0 R
-157 0 V
stroke
1818 1620 M
[ [(Roman) 280.0 0.0 true true 0 (-0.12)]
] -93.3 MRshow
1.000 UL
LTb
1962 1710 M
78 0 V
4157 0 R
-78 0 V
-4157 90 R
78 0 V
4157 0 R
-78 0 V
-4157 90 R
78 0 V
4157 0 R
-78 0 V
-4157 90 R
78 0 V
4157 0 R
-78 0 V
-4157 90 R
157 0 V
4078 0 R
-157 0 V
stroke
1818 2070 M
[ [(Roman) 280.0 0.0 true true 0 (-0.1)]
] -93.3 MRshow
1.000 UL
LTb
1962 2160 M
78 0 V
4157 0 R
-78 0 V
-4157 90 R
78 0 V
4157 0 R
-78 0 V
-4157 90 R
78 0 V
4157 0 R
-78 0 V
-4157 90 R
78 0 V
4157 0 R
-78 0 V
-4157 90 R
157 0 V
4078 0 R
-157 0 V
stroke
1818 2520 M
[ [(Roman) 280.0 0.0 true true 0 (-0.08)]
] -93.3 MRshow
1.000 UL
LTb
1962 2610 M
78 0 V
4157 0 R
-78 0 V
-4157 90 R
78 0 V
4157 0 R
-78 0 V
-4157 90 R
78 0 V
4157 0 R
-78 0 V
-4157 90 R
78 0 V
4157 0 R
-78 0 V
-4157 90 R
157 0 V
4078 0 R
-157 0 V
stroke
1818 2970 M
[ [(Roman) 280.0 0.0 true true 0 (-0.06)]
] -93.3 MRshow
1.000 UL
LTb
1962 3060 M
78 0 V
4157 0 R
-78 0 V
-4157 90 R
78 0 V
4157 0 R
-78 0 V
-4157 90 R
78 0 V
4157 0 R
-78 0 V
-4157 90 R
78 0 V
4157 0 R
-78 0 V
-4157 90 R
157 0 V
4078 0 R
-157 0 V
stroke
1818 3420 M
[ [(Roman) 280.0 0.0 true true 0 (-0.04)]
] -93.3 MRshow
1.000 UL
LTb
1962 3510 M
78 0 V
4157 0 R
-78 0 V
-4157 90 R
78 0 V
4157 0 R
-78 0 V
-4157 90 R
78 0 V
4157 0 R
-78 0 V
-4157 90 R
78 0 V
4157 0 R
-78 0 V
-4157 90 R
157 0 V
4078 0 R
-157 0 V
stroke
1818 3870 M
[ [(Roman) 280.0 0.0 true true 0 (-0.02)]
] -93.3 MRshow
1.000 UL
LTb
1962 3960 M
78 0 V
4157 0 R
-78 0 V
-4157 90 R
78 0 V
4157 0 R
-78 0 V
-4157 90 R
78 0 V
4157 0 R
-78 0 V
-4157 90 R
78 0 V
4157 0 R
-78 0 V
-4157 90 R
157 0 V
4078 0 R
-157 0 V
stroke
1818 4320 M
[ [(Roman) 280.0 0.0 true true 0 ( 0)]
] -93.3 MRshow
1.000 UL
LTb
1962 720 M
0 157 V
0 3443 R
0 -157 V
stroke
1962 480 M
[ [(Roman) 280.0 0.0 true true 0 ( 1)]
] -93.3 MCshow
1.000 UL
LTb
2174 720 M
0 78 V
0 3522 R
0 -78 V
2386 720 M
0 78 V
0 3522 R
0 -78 V
2597 720 M
0 78 V
0 3522 R
0 -78 V
2809 720 M
0 78 V
0 3522 R
0 -78 V
3021 720 M
0 78 V
0 3522 R
0 -78 V
0 -3522 R
0 157 V
0 3443 R
0 -157 V
stroke
3021 480 M
[ [(Roman) 280.0 0.0 true true 0 ( 1.05)]
] -93.3 MCshow
1.000 UL
LTb
3233 720 M
0 78 V
0 3522 R
0 -78 V
3444 720 M
0 78 V
0 3522 R
0 -78 V
3656 720 M
0 78 V
0 3522 R
0 -78 V
3868 720 M
0 78 V
0 3522 R
0 -78 V
4080 720 M
0 78 V
0 3522 R
0 -78 V
0 -3522 R
0 157 V
0 3443 R
0 -157 V
stroke
4080 480 M
[ [(Roman) 280.0 0.0 true true 0 ( 1.1)]
] -93.3 MCshow
1.000 UL
LTb
4291 720 M
0 78 V
0 3522 R
0 -78 V
4503 720 M
0 78 V
0 3522 R
0 -78 V
4715 720 M
0 78 V
0 3522 R
0 -78 V
4927 720 M
0 78 V
0 3522 R
0 -78 V
5138 720 M
0 78 V
0 3522 R
0 -78 V
0 -3522 R
0 157 V
0 3443 R
0 -157 V
stroke
5138 480 M
[ [(Roman) 280.0 0.0 true true 0 ( 1.15)]
] -93.3 MCshow
1.000 UL
LTb
5350 720 M
0 78 V
0 3522 R
0 -78 V
5562 720 M
0 78 V
0 3522 R
0 -78 V
5774 720 M
0 78 V
0 3522 R
0 -78 V
5985 720 M
0 78 V
0 3522 R
0 -78 V
6197 720 M
0 78 V
0 3522 R
0 -78 V
0 -3522 R
0 157 V
0 3443 R
0 -157 V
stroke
6197 480 M
[ [(Roman) 280.0 0.0 true true 0 ( 1.2)]
] -93.3 MCshow
1.000 UL
LTb
1.000 UL
LTb
1962 4320 N
0 -3600 V
4235 0 V
0 3600 V
-4235 0 V
Z stroke
LCb setrgbcolor
834 2520 M
currentpoint gsave translate 90 rotate 0 0 moveto
[ [(Roman) 280.0 0.0 true true 0 (h)]
[(Roman) 224.0 -84.0 true true 0 (-)]
] -65.3 MCshow
grestore
LTb
LCb setrgbcolor
4079 120 M
[ [(Roman) 280.0 0.0 true true 0 (w)]
] -93.3 MCshow
LTb
4079 4680 M
[ [(Roman) 280.0 0.0 true true 0 (B)]
[(Roman) 224.0 -84.0 true true 0 (s)]
[(Roman) 280.0 0.0 true true 0 (->D)]
[(Roman) 224.0 -84.0 true true 0 (s)]
[(Roman) 280.0 0.0 true true 0 (:  )]
[(Symbol) 280.0 0.0 true true 0 (c)]
[(Roman) 224.0 140.0 true true 0 (2)]
[(Roman) 280.0 0.0 true true 0 (/dof=17.6/11, p-value=0.09 )]
] -93.3 MCshow
1.800 UP
1.000 UL
LTb
1.000 UL
LT0
0.00 1.00 1.00 C 1962 1446 N 0 -397 212 43 0 398 h
2174 1490 N 0 -397 212 45 0 397 h
2386 1535 N 0 -398 211 47 0 397 h
2597 1581 N 0 -400 212 48 0 398 h
2809 1627 N 0 -401 212 49 0 400 h
3021 1675 N 0 -402 212 50 0 401 h
3233 1724 N 0 -403 211 51 0 402 h
3444 1774 N 0 -405 212 53 0 403 h
3656 1825 N 0 -407 212 54 0 405 h
3868 1877 N 0 -407 212 54 0 407 h
4080 1931 N 0 -409 211 56 0 407 h
4291 1985 N 0 -411 212 58 0 409 h
4503 2041 N 0 -412 212 58 0 411 h
4715 2098 N 0 -414 211 60 0 412 h
4926 2156 N 0 -417 212 62 0 414 h
5138 2215 N 0 -421 212 63 0 417 h
5350 2274 N 0 -425 212 64 0 421 h
5562 2334 N 0 -431 211 67 0 425 h
5773 2395 N 0 -438 212 68 0 431 h
5985 2456 N 0 -446 212 70 0 438 h
6197 2518 N 0 -446 0 0 0 446 h
1.000 UL
LT1
0.00 0.00 0.00 C 1962 1106 M
212 44 V
212 45 V
211 46 V
212 47 V
212 48 V
212 50 V
211 51 V
212 52 V
212 53 V
212 54 V
211 55 V
212 57 V
212 58 V
211 58 V
212 60 V
212 62 V
212 62 V
211 63 V
212 65 V
212 66 V
stroke
LT2
0.00 1.00 0.44 C 1962 998 M
212 44 V
212 45 V
211 46 V
212 48 V
212 48 V
212 50 V
211 50 V
212 52 V
212 53 V
212 55 V
211 55 V
212 56 V
212 58 V
211 59 V
212 60 V
212 61 V
212 62 V
211 64 V
212 64 V
212 66 V
stroke
LT3
0.00 0.00 1.00 C 1962 1327 M
212 44 V
212 45 V
211 46 V
212 47 V
212 49 V
212 49 V
211 51 V
212 52 V
212 53 V
212 54 V
211 56 V
212 56 V
212 58 V
211 59 V
212 60 V
212 61 V
212 62 V
211 64 V
212 64 V
212 66 V
stroke
LT4
0.86 0.08 0.24 C 1962 1250 M
212 44 V
212 45 V
211 46 V
212 47 V
212 48 V
212 50 V
211 51 V
212 52 V
212 53 V
212 54 V
211 55 V
212 57 V
212 58 V
211 58 V
212 60 V
212 61 V
212 63 V
211 63 V
212 65 V
212 65 V
stroke
3.000 UL
LT0
1.00 0.00 0.00 C LTb
3749 3750 M
[ [(Roman) 240.0 0.0 true true 0 (Physical)]
] -80.0 MRshow
LT0
1.00 0.00 0.00 C 3893 3750 M
689 0 V
1962 1645 M
212 44 V
212 45 V
211 46 V
212 47 V
212 48 V
212 50 V
211 50 V
212 52 V
212 53 V
212 55 V
211 55 V
212 56 V
212 58 V
211 59 V
212 60 V
212 61 V
212 63 V
211 63 V
212 65 V
212 66 V
1.800 UP
stroke
1.000 UL
LT0
0.00 0.00 0.00 C LTb
3749 3510 M
[ [(Roman) 240.0 0.0 true true 0 (007/050)]
] -80.0 MRshow
LT0
0.00 0.00 0.00 C 3893 3510 M
689 0 V
-689 31 R
0 -62 V
689 62 R
0 -62 V
2870 1257 M
0 188 V
-31 -188 R
62 0 V
-62 188 R
62 0 V
821 -2 R
0 214 V
-31 -214 R
62 0 V
-62 214 R
62 0 V
769 -43 R
0 240 V
-31 -240 R
62 0 V
-62 240 R
62 0 V
625 147 R
0 305 V
-31 -305 R
62 0 V
-62 305 R
62 0 V
2861 1351 M
17 0 V
-17 -31 R
0 62 V
17 -62 R
0 62 V
824 168 R
40 0 V
-40 -31 R
0 62 V
40 -62 R
0 62 V
746 153 R
68 0 V
-68 -31 R
0 62 V
68 -62 R
0 62 V
570 388 R
104 0 V
-104 -31 R
0 62 V
104 -62 R
0 62 V
2870 1351 Box
3722 1550 Box
4522 1734 Box
5178 2153 Box
4237 3510 Box
1.800 UP
1.000 UL
LT0
0.00 1.00 0.44 C LTb
3749 3270 M
[ [(Roman) 240.0 0.0 true true 0 (020/050)]
] -80.0 MRshow
LT0
0.00 1.00 0.44 C 3893 3270 M
689 0 V
-689 31 R
0 -62 V
689 62 R
0 -62 V
2913 1168 M
0 177 V
-31 -177 R
62 0 V
-62 177 R
62 0 V
851 5 R
0 200 V
-31 -200 R
62 0 V
-62 200 R
62 0 V
788 -71 R
0 239 V
-31 -239 R
62 0 V
-62 239 R
62 0 V
684 63 R
0 293 V
-31 -293 R
62 0 V
-62 293 R
62 0 V
2904 1256 M
19 0 V
-19 -31 R
0 62 V
19 -62 R
0 62 V
850 163 R
43 0 V
-43 -31 R
0 62 V
43 -62 R
0 62 V
761 118 R
74 0 V
-74 -31 R
0 62 V
74 -62 R
0 62 V
618 298 R
120 0 V
-120 -31 R
0 62 V
120 -62 R
0 62 V
2913 1256 Circle
3795 1450 Circle
4614 1599 Circle
5329 1928 Circle
4237 3270 Circle
1.800 UP
1.000 UL
LT0
0.00 0.00 1.00 C LTb
3749 3030 M
[ [(Roman) 240.0 0.0 true true 0 (0062/031)]
] -80.0 MRshow
LT0
0.00 0.00 1.00 C 3893 3030 M
689 0 V
-689 31 R
0 -62 V
689 62 R
0 -62 V
2789 1428 M
0 227 V
-31 -227 R
62 0 V
-62 227 R
62 0 V
753 -122 R
0 264 V
-31 -264 R
62 0 V
-62 264 R
62 0 V
720 -186 R
0 315 V
-31 -315 R
62 0 V
-62 315 R
62 0 V
647 -148 R
0 384 V
-31 -384 R
62 0 V
-62 384 R
62 0 V
2779 1541 M
20 0 V
-20 -31 R
0 62 V
20 -62 R
0 62 V
751 93 R
46 0 V
-46 -31 R
0 62 V
46 -62 R
0 62 V
687 73 R
81 0 V
-81 -31 R
0 62 V
81 -62 R
0 62 V
570 170 R
136 0 V
-136 -31 R
0 62 V
136 -62 R
0 62 V
2789 1541 TriU
3573 1665 TriU
4324 1769 TriU
5002 1970 TriU
4237 3030 TriU
1.800 UP
1.000 UL
LT0
0.86 0.08 0.24 C LTb
3749 2790 M
[ [(Roman) 240.0 0.0 true true 0 (0124/031)]
] -80.0 MRshow
LT0
0.86 0.08 0.24 C 3893 2790 M
689 0 V
-689 31 R
0 -62 V
689 62 R
0 -62 V
2778 1230 M
0 218 V
-31 -218 R
62 0 V
-62 218 R
62 0 V
747 -62 R
0 261 V
-31 -261 R
62 0 V
-62 261 R
62 0 V
701 -123 R
0 317 V
-31 -317 R
62 0 V
-62 317 R
62 0 V
673 -112 R
0 383 V
-31 -383 R
62 0 V
-62 383 R
62 0 V
2769 1339 M
19 0 V
-19 -31 R
0 62 V
19 -62 R
0 62 V
745 147 R
45 0 V
-45 -31 R
0 62 V
45 -62 R
0 62 V
671 134 R
78 0 V
-78 -31 R
0 62 V
78 -62 R
0 62 V
601 208 R
128 0 V
-128 -31 R
0 62 V
128 -62 R
0 62 V
2778 1339 Dia
3556 1517 Dia
4288 1682 Dia
4992 1921 Dia
4237 2790 Dia
1.000 UL
LTb
1962 4320 N
0 -3600 V
4235 0 V
0 3600 V
-4235 0 V
Z stroke
1.800 UP
1.000 UL
LTb
grestore % colour palette end
stroke
grestore
end
showpage
%%Trailer
%%DocumentFonts: Symbol Roman
