%!PS-Adobe-2.0 EPSF-2.0
%%Title: bszfit1.eps
%%Creator: gnuplot 4.2 patchlevel 3 
%%CreationDate: Fri Apr 13 16:36:45 2012
%%DocumentFonts: (atend)
%%BoundingBox: 50 50 410 302
%%EndComments
%%BeginProlog
/gnudict 256 dict def
gnudict begin
%
% The following 6 true/false flags may be edited by hand if required
% The unit line width may also be changed
%
/Color true def
/Blacktext false def
/Solid false def
/Dashlength 1 def
/Landscape false def
/Level1 false def
/Rounded false def
/TransparentPatterns false def
/gnulinewidth 7.500 def
/userlinewidth gnulinewidth def
%
/vshift -80 def
/dl1 {
  10.0 Dashlength mul mul
  Rounded { currentlinewidth 0.75 mul sub dup 0 le { pop 0.01 } if } if
} def
/dl2 {
  10.0 Dashlength mul mul
  Rounded { currentlinewidth 0.75 mul add } if
} def
/hpt_ 31.5 def
/vpt_ 31.5 def
/hpt hpt_ def
/vpt vpt_ def
Level1 {} {
/SDict 10 dict def
systemdict /pdfmark known not {
  userdict /pdfmark systemdict /cleartomark get put
} if
SDict begin [
  /Title (bszfit1.eps)
  /Subject (gnuplot plot)
  /Creator (gnuplot 4.2 patchlevel 3 )
  /Author (ddu)
%  /Producer (gnuplot)
%  /Keywords ()
  /CreationDate (Fri Apr 13 16:36:45 2012)
  /DOCINFO pdfmark
end
} ifelse
%
% Gnuplot Prolog Version 4.2 (August 2006)
%
/M {moveto} bind def
/L {lineto} bind def
/R {rmoveto} bind def
/V {rlineto} bind def
/N {newpath moveto} bind def
/Z {closepath} bind def
/C {setrgbcolor} bind def
/f {rlineto fill} bind def
/vpt2 vpt 2 mul def
/hpt2 hpt 2 mul def
/Lshow {currentpoint stroke M 0 vshift R 
	Blacktext {gsave 0 setgray show grestore} {show} ifelse} def
/Rshow {currentpoint stroke M dup stringwidth pop neg vshift R
	Blacktext {gsave 0 setgray show grestore} {show} ifelse} def
/Cshow {currentpoint stroke M dup stringwidth pop -2 div vshift R 
	Blacktext {gsave 0 setgray show grestore} {show} ifelse} def
/UP {dup vpt_ mul /vpt exch def hpt_ mul /hpt exch def
  /hpt2 hpt 2 mul def /vpt2 vpt 2 mul def} def
/DL {Color {setrgbcolor Solid {pop []} if 0 setdash}
 {pop pop pop 0 setgray Solid {pop []} if 0 setdash} ifelse} def
/BL {stroke userlinewidth 2 mul setlinewidth
	Rounded {1 setlinejoin 1 setlinecap} if} def
/AL {stroke userlinewidth 2 div setlinewidth
	Rounded {1 setlinejoin 1 setlinecap} if} def
/UL {dup gnulinewidth mul /userlinewidth exch def
	dup 1 lt {pop 1} if 10 mul /udl exch def} def
/PL {stroke userlinewidth setlinewidth
	Rounded {1 setlinejoin 1 setlinecap} if} def
% Default Line colors
/LCw {1 1 1} def
/LCb {0 0 0} def
/LCa {0 0 0} def
/LC0 {1 0 0} def
/LC1 {0 1 0} def
/LC2 {0 0 1} def
/LC3 {1 0 1} def
/LC4 {0 1 1} def
/LC5 {1 1 0} def
/LC6 {0 0 0} def
/LC7 {1 0.3 0} def
/LC8 {0.5 0.5 0.5} def
% Default Line Types
/LTw {PL [] 1 setgray} def
/LTb {BL [] LCb DL} def
/LTa {AL [1 udl mul 2 udl mul] 0 setdash LCa setrgbcolor} def
/LT0 {PL [] LC0 DL} def
/LT1 {PL [4 dl1 2 dl2] LC1 DL} def
/LT2 {PL [2 dl1 3 dl2] LC2 DL} def
/LT3 {PL [1 dl1 1.5 dl2] LC3 DL} def
/LT4 {PL [6 dl1 2 dl2 1 dl1 2 dl2] LC4 DL} def
/LT5 {PL [3 dl1 3 dl2 1 dl1 3 dl2] LC5 DL} def
/LT6 {PL [2 dl1 2 dl2 2 dl1 6 dl2] LC6 DL} def
/LT7 {PL [1 dl1 2 dl2 6 dl1 2 dl2 1 dl1 2 dl2] LC7 DL} def
/LT8 {PL [2 dl1 2 dl2 2 dl1 2 dl2 2 dl1 2 dl2 2 dl1 4 dl2] LC8 DL} def
/Pnt {stroke [] 0 setdash gsave 1 setlinecap M 0 0 V stroke grestore} def
/Dia {stroke [] 0 setdash 2 copy vpt add M
  hpt neg vpt neg V hpt vpt neg V
  hpt vpt V hpt neg vpt V closepath stroke
  Pnt} def
/Pls {stroke [] 0 setdash vpt sub M 0 vpt2 V
  currentpoint stroke M
  hpt neg vpt neg R hpt2 0 V stroke
 } def
/Box {stroke [] 0 setdash 2 copy exch hpt sub exch vpt add M
  0 vpt2 neg V hpt2 0 V 0 vpt2 V
  hpt2 neg 0 V closepath stroke
  Pnt} def
/Crs {stroke [] 0 setdash exch hpt sub exch vpt add M
  hpt2 vpt2 neg V currentpoint stroke M
  hpt2 neg 0 R hpt2 vpt2 V stroke} def
/TriU {stroke [] 0 setdash 2 copy vpt 1.12 mul add M
  hpt neg vpt -1.62 mul V
  hpt 2 mul 0 V
  hpt neg vpt 1.62 mul V closepath stroke
  Pnt} def
/Star {2 copy Pls Crs} def
/BoxF {stroke [] 0 setdash exch hpt sub exch vpt add M
  0 vpt2 neg V hpt2 0 V 0 vpt2 V
  hpt2 neg 0 V closepath fill} def
/TriUF {stroke [] 0 setdash vpt 1.12 mul add M
  hpt neg vpt -1.62 mul V
  hpt 2 mul 0 V
  hpt neg vpt 1.62 mul V closepath fill} def
/TriD {stroke [] 0 setdash 2 copy vpt 1.12 mul sub M
  hpt neg vpt 1.62 mul V
  hpt 2 mul 0 V
  hpt neg vpt -1.62 mul V closepath stroke
  Pnt} def
/TriDF {stroke [] 0 setdash vpt 1.12 mul sub M
  hpt neg vpt 1.62 mul V
  hpt 2 mul 0 V
  hpt neg vpt -1.62 mul V closepath fill} def
/DiaF {stroke [] 0 setdash vpt add M
  hpt neg vpt neg V hpt vpt neg V
  hpt vpt V hpt neg vpt V closepath fill} def
/Pent {stroke [] 0 setdash 2 copy gsave
  translate 0 hpt M 4 {72 rotate 0 hpt L} repeat
  closepath stroke grestore Pnt} def
/PentF {stroke [] 0 setdash gsave
  translate 0 hpt M 4 {72 rotate 0 hpt L} repeat
  closepath fill grestore} def
/Circle {stroke [] 0 setdash 2 copy
  hpt 0 360 arc stroke Pnt} def
/CircleF {stroke [] 0 setdash hpt 0 360 arc fill} def
/C0 {BL [] 0 setdash 2 copy moveto vpt 90 450 arc} bind def
/C1 {BL [] 0 setdash 2 copy moveto
	2 copy vpt 0 90 arc closepath fill
	vpt 0 360 arc closepath} bind def
/C2 {BL [] 0 setdash 2 copy moveto
	2 copy vpt 90 180 arc closepath fill
	vpt 0 360 arc closepath} bind def
/C3 {BL [] 0 setdash 2 copy moveto
	2 copy vpt 0 180 arc closepath fill
	vpt 0 360 arc closepath} bind def
/C4 {BL [] 0 setdash 2 copy moveto
	2 copy vpt 180 270 arc closepath fill
	vpt 0 360 arc closepath} bind def
/C5 {BL [] 0 setdash 2 copy moveto
	2 copy vpt 0 90 arc
	2 copy moveto
	2 copy vpt 180 270 arc closepath fill
	vpt 0 360 arc} bind def
/C6 {BL [] 0 setdash 2 copy moveto
	2 copy vpt 90 270 arc closepath fill
	vpt 0 360 arc closepath} bind def
/C7 {BL [] 0 setdash 2 copy moveto
	2 copy vpt 0 270 arc closepath fill
	vpt 0 360 arc closepath} bind def
/C8 {BL [] 0 setdash 2 copy moveto
	2 copy vpt 270 360 arc closepath fill
	vpt 0 360 arc closepath} bind def
/C9 {BL [] 0 setdash 2 copy moveto
	2 copy vpt 270 450 arc closepath fill
	vpt 0 360 arc closepath} bind def
/C10 {BL [] 0 setdash 2 copy 2 copy moveto vpt 270 360 arc closepath fill
	2 copy moveto
	2 copy vpt 90 180 arc closepath fill
	vpt 0 360 arc closepath} bind def
/C11 {BL [] 0 setdash 2 copy moveto
	2 copy vpt 0 180 arc closepath fill
	2 copy moveto
	2 copy vpt 270 360 arc closepath fill
	vpt 0 360 arc closepath} bind def
/C12 {BL [] 0 setdash 2 copy moveto
	2 copy vpt 180 360 arc closepath fill
	vpt 0 360 arc closepath} bind def
/C13 {BL [] 0 setdash 2 copy moveto
	2 copy vpt 0 90 arc closepath fill
	2 copy moveto
	2 copy vpt 180 360 arc closepath fill
	vpt 0 360 arc closepath} bind def
/C14 {BL [] 0 setdash 2 copy moveto
	2 copy vpt 90 360 arc closepath fill
	vpt 0 360 arc} bind def
/C15 {BL [] 0 setdash 2 copy vpt 0 360 arc closepath fill
	vpt 0 360 arc closepath} bind def
/Rec {newpath 4 2 roll moveto 1 index 0 rlineto 0 exch rlineto
	neg 0 rlineto closepath} bind def
/Square {dup Rec} bind def
/Bsquare {vpt sub exch vpt sub exch vpt2 Square} bind def
/S0 {BL [] 0 setdash 2 copy moveto 0 vpt rlineto BL Bsquare} bind def
/S1 {BL [] 0 setdash 2 copy vpt Square fill Bsquare} bind def
/S2 {BL [] 0 setdash 2 copy exch vpt sub exch vpt Square fill Bsquare} bind def
/S3 {BL [] 0 setdash 2 copy exch vpt sub exch vpt2 vpt Rec fill Bsquare} bind def
/S4 {BL [] 0 setdash 2 copy exch vpt sub exch vpt sub vpt Square fill Bsquare} bind def
/S5 {BL [] 0 setdash 2 copy 2 copy vpt Square fill
	exch vpt sub exch vpt sub vpt Square fill Bsquare} bind def
/S6 {BL [] 0 setdash 2 copy exch vpt sub exch vpt sub vpt vpt2 Rec fill Bsquare} bind def
/S7 {BL [] 0 setdash 2 copy exch vpt sub exch vpt sub vpt vpt2 Rec fill
	2 copy vpt Square fill Bsquare} bind def
/S8 {BL [] 0 setdash 2 copy vpt sub vpt Square fill Bsquare} bind def
/S9 {BL [] 0 setdash 2 copy vpt sub vpt vpt2 Rec fill Bsquare} bind def
/S10 {BL [] 0 setdash 2 copy vpt sub vpt Square fill 2 copy exch vpt sub exch vpt Square fill
	Bsquare} bind def
/S11 {BL [] 0 setdash 2 copy vpt sub vpt Square fill 2 copy exch vpt sub exch vpt2 vpt Rec fill
	Bsquare} bind def
/S12 {BL [] 0 setdash 2 copy exch vpt sub exch vpt sub vpt2 vpt Rec fill Bsquare} bind def
/S13 {BL [] 0 setdash 2 copy exch vpt sub exch vpt sub vpt2 vpt Rec fill
	2 copy vpt Square fill Bsquare} bind def
/S14 {BL [] 0 setdash 2 copy exch vpt sub exch vpt sub vpt2 vpt Rec fill
	2 copy exch vpt sub exch vpt Square fill Bsquare} bind def
/S15 {BL [] 0 setdash 2 copy Bsquare fill Bsquare} bind def
/D0 {gsave translate 45 rotate 0 0 S0 stroke grestore} bind def
/D1 {gsave translate 45 rotate 0 0 S1 stroke grestore} bind def
/D2 {gsave translate 45 rotate 0 0 S2 stroke grestore} bind def
/D3 {gsave translate 45 rotate 0 0 S3 stroke grestore} bind def
/D4 {gsave translate 45 rotate 0 0 S4 stroke grestore} bind def
/D5 {gsave translate 45 rotate 0 0 S5 stroke grestore} bind def
/D6 {gsave translate 45 rotate 0 0 S6 stroke grestore} bind def
/D7 {gsave translate 45 rotate 0 0 S7 stroke grestore} bind def
/D8 {gsave translate 45 rotate 0 0 S8 stroke grestore} bind def
/D9 {gsave translate 45 rotate 0 0 S9 stroke grestore} bind def
/D10 {gsave translate 45 rotate 0 0 S10 stroke grestore} bind def
/D11 {gsave translate 45 rotate 0 0 S11 stroke grestore} bind def
/D12 {gsave translate 45 rotate 0 0 S12 stroke grestore} bind def
/D13 {gsave translate 45 rotate 0 0 S13 stroke grestore} bind def
/D14 {gsave translate 45 rotate 0 0 S14 stroke grestore} bind def
/D15 {gsave translate 45 rotate 0 0 S15 stroke grestore} bind def
/DiaE {stroke [] 0 setdash vpt add M
  hpt neg vpt neg V hpt vpt neg V
  hpt vpt V hpt neg vpt V closepath stroke} def
/BoxE {stroke [] 0 setdash exch hpt sub exch vpt add M
  0 vpt2 neg V hpt2 0 V 0 vpt2 V
  hpt2 neg 0 V closepath stroke} def
/TriUE {stroke [] 0 setdash vpt 1.12 mul add M
  hpt neg vpt -1.62 mul V
  hpt 2 mul 0 V
  hpt neg vpt 1.62 mul V closepath stroke} def
/TriDE {stroke [] 0 setdash vpt 1.12 mul sub M
  hpt neg vpt 1.62 mul V
  hpt 2 mul 0 V
  hpt neg vpt -1.62 mul V closepath stroke} def
/PentE {stroke [] 0 setdash gsave
  translate 0 hpt M 4 {72 rotate 0 hpt L} repeat
  closepath stroke grestore} def
/CircE {stroke [] 0 setdash 
  hpt 0 360 arc stroke} def
/Opaque {gsave closepath 1 setgray fill grestore 0 setgray closepath} def
/DiaW {stroke [] 0 setdash vpt add M
  hpt neg vpt neg V hpt vpt neg V
  hpt vpt V hpt neg vpt V Opaque stroke} def
/BoxW {stroke [] 0 setdash exch hpt sub exch vpt add M
  0 vpt2 neg V hpt2 0 V 0 vpt2 V
  hpt2 neg 0 V Opaque stroke} def
/TriUW {stroke [] 0 setdash vpt 1.12 mul add M
  hpt neg vpt -1.62 mul V
  hpt 2 mul 0 V
  hpt neg vpt 1.62 mul V Opaque stroke} def
/TriDW {stroke [] 0 setdash vpt 1.12 mul sub M
  hpt neg vpt 1.62 mul V
  hpt 2 mul 0 V
  hpt neg vpt -1.62 mul V Opaque stroke} def
/PentW {stroke [] 0 setdash gsave
  translate 0 hpt M 4 {72 rotate 0 hpt L} repeat
  Opaque stroke grestore} def
/CircW {stroke [] 0 setdash 
  hpt 0 360 arc Opaque stroke} def
/BoxFill {gsave Rec 1 setgray fill grestore} def
/Density {
  /Fillden exch def
  currentrgbcolor
  /ColB exch def /ColG exch def /ColR exch def
  /ColR ColR Fillden mul Fillden sub 1 add def
  /ColG ColG Fillden mul Fillden sub 1 add def
  /ColB ColB Fillden mul Fillden sub 1 add def
  ColR ColG ColB setrgbcolor} def
/BoxColFill {gsave Rec PolyFill} def
/PolyFill {gsave Density fill grestore grestore} def
/h {rlineto rlineto rlineto gsave closepath fill grestore} bind def
%
% PostScript Level 1 Pattern Fill routine for rectangles
% Usage: x y w h s a XX PatternFill
%	x,y = lower left corner of box to be filled
%	w,h = width and height of box
%	  a = angle in degrees between lines and x-axis
%	 XX = 0/1 for no/yes cross-hatch
%
/PatternFill {gsave /PFa [ 9 2 roll ] def
  PFa 0 get PFa 2 get 2 div add PFa 1 get PFa 3 get 2 div add translate
  PFa 2 get -2 div PFa 3 get -2 div PFa 2 get PFa 3 get Rec
  gsave 1 setgray fill grestore clip
  currentlinewidth 0.5 mul setlinewidth
  /PFs PFa 2 get dup mul PFa 3 get dup mul add sqrt def
  0 0 M PFa 5 get rotate PFs -2 div dup translate
  0 1 PFs PFa 4 get div 1 add floor cvi
	{PFa 4 get mul 0 M 0 PFs V} for
  0 PFa 6 get ne {
	0 1 PFs PFa 4 get div 1 add floor cvi
	{PFa 4 get mul 0 2 1 roll M PFs 0 V} for
 } if
  stroke grestore} def
%
/languagelevel where
 {pop languagelevel} {1} ifelse
 2 lt
	{/InterpretLevel1 true def}
	{/InterpretLevel1 Level1 def}
 ifelse
%
% PostScript level 2 pattern fill definitions
%
/Level2PatternFill {
/Tile8x8 {/PaintType 2 /PatternType 1 /TilingType 1 /BBox [0 0 8 8] /XStep 8 /YStep 8}
	bind def
/KeepColor {currentrgbcolor [/Pattern /DeviceRGB] setcolorspace} bind def
<< Tile8x8
 /PaintProc {0.5 setlinewidth pop 0 0 M 8 8 L 0 8 M 8 0 L stroke} 
>> matrix makepattern
/Pat1 exch def
<< Tile8x8
 /PaintProc {0.5 setlinewidth pop 0 0 M 8 8 L 0 8 M 8 0 L stroke
	0 4 M 4 8 L 8 4 L 4 0 L 0 4 L stroke}
>> matrix makepattern
/Pat2 exch def
<< Tile8x8
 /PaintProc {0.5 setlinewidth pop 0 0 M 0 8 L
	8 8 L 8 0 L 0 0 L fill}
>> matrix makepattern
/Pat3 exch def
<< Tile8x8
 /PaintProc {0.5 setlinewidth pop -4 8 M 8 -4 L
	0 12 M 12 0 L stroke}
>> matrix makepattern
/Pat4 exch def
<< Tile8x8
 /PaintProc {0.5 setlinewidth pop -4 0 M 8 12 L
	0 -4 M 12 8 L stroke}
>> matrix makepattern
/Pat5 exch def
<< Tile8x8
 /PaintProc {0.5 setlinewidth pop -2 8 M 4 -4 L
	0 12 M 8 -4 L 4 12 M 10 0 L stroke}
>> matrix makepattern
/Pat6 exch def
<< Tile8x8
 /PaintProc {0.5 setlinewidth pop -2 0 M 4 12 L
	0 -4 M 8 12 L 4 -4 M 10 8 L stroke}
>> matrix makepattern
/Pat7 exch def
<< Tile8x8
 /PaintProc {0.5 setlinewidth pop 8 -2 M -4 4 L
	12 0 M -4 8 L 12 4 M 0 10 L stroke}
>> matrix makepattern
/Pat8 exch def
<< Tile8x8
 /PaintProc {0.5 setlinewidth pop 0 -2 M 12 4 L
	-4 0 M 12 8 L -4 4 M 8 10 L stroke}
>> matrix makepattern
/Pat9 exch def
/Pattern1 {PatternBgnd KeepColor Pat1 setpattern} bind def
/Pattern2 {PatternBgnd KeepColor Pat2 setpattern} bind def
/Pattern3 {PatternBgnd KeepColor Pat3 setpattern} bind def
/Pattern4 {PatternBgnd KeepColor Landscape {Pat5} {Pat4} ifelse setpattern} bind def
/Pattern5 {PatternBgnd KeepColor Landscape {Pat4} {Pat5} ifelse setpattern} bind def
/Pattern6 {PatternBgnd KeepColor Landscape {Pat9} {Pat6} ifelse setpattern} bind def
/Pattern7 {PatternBgnd KeepColor Landscape {Pat8} {Pat7} ifelse setpattern} bind def
} def
%
%
%End of PostScript Level 2 code
%
/PatternBgnd {
  TransparentPatterns {} {gsave 1 setgray fill grestore} ifelse
} def
%
% Substitute for Level 2 pattern fill codes with
% grayscale if Level 2 support is not selected.
%
/Level1PatternFill {
/Pattern1 {0.250 Density} bind def
/Pattern2 {0.500 Density} bind def
/Pattern3 {0.750 Density} bind def
/Pattern4 {0.125 Density} bind def
/Pattern5 {0.375 Density} bind def
/Pattern6 {0.625 Density} bind def
/Pattern7 {0.875 Density} bind def
} def
%
% Now test for support of Level 2 code
%
Level1 {Level1PatternFill} {Level2PatternFill} ifelse
%
/Symbol-Oblique /Symbol findfont [1 0 .167 1 0 0] makefont
dup length dict begin {1 index /FID eq {pop pop} {def} ifelse} forall
currentdict end definefont pop
/MFshow {
   { dup 5 get 3 ge
     { 5 get 3 eq {gsave} {grestore} ifelse }
     {dup dup 0 get findfont exch 1 get scalefont setfont
     [ currentpoint ] exch dup 2 get 0 exch R dup 5 get 2 ne {dup dup 6
     get exch 4 get {show} {stringwidth pop 0 R} ifelse }if dup 5 get 0 eq
     {dup 3 get {2 get neg 0 exch R pop} {pop aload pop M} ifelse} {dup 5
     get 1 eq {dup 2 get exch dup 3 get exch 6 get stringwidth pop -2 div
     dup 0 R} {dup 6 get stringwidth pop -2 div 0 R 6 get
     show 2 index {aload pop M neg 3 -1 roll neg R pop pop} {pop pop pop
     pop aload pop M} ifelse }ifelse }ifelse }
     ifelse }
   forall} bind def
/MFwidth {0 exch { dup 5 get 3 ge { 5 get 3 eq { 0 } { pop } ifelse }
 {dup 3 get{dup dup 0 get findfont exch 1 get scalefont setfont
     6 get stringwidth pop add} {pop} ifelse} ifelse} forall} bind def
/MLshow { currentpoint stroke M
  0 exch R
  Blacktext {gsave 0 setgray MFshow grestore} {MFshow} ifelse } bind def
/MRshow { currentpoint stroke M
  exch dup MFwidth neg 3 -1 roll R
  Blacktext {gsave 0 setgray MFshow grestore} {MFshow} ifelse } bind def
/MCshow { currentpoint stroke M
  exch dup MFwidth -2 div 3 -1 roll R
  Blacktext {gsave 0 setgray MFshow grestore} {MFshow} ifelse } bind def
/XYsave    { [( ) 1 2 true false 3 ()] } bind def
/XYrestore { [( ) 1 2 true false 4 ()] } bind def
end
%%EndProlog
gnudict begin
gsave
50 50 translate
0.050 0.050 scale
0 setgray
newpath
(Roman) findfont 240 scalefont setfont
gsave % colour palette begin
/maxcolors 0 def
/HSV2RGB {  exch dup 0.0 eq {pop exch pop dup dup} % achromatic gray
  { /HSVs exch def /HSVv exch def 6.0 mul dup floor dup 3 1 roll sub
     /HSVf exch def /HSVi exch cvi def /HSVp HSVv 1.0 HSVs sub mul def
	 /HSVq HSVv 1.0 HSVs HSVf mul sub mul def 
	 /HSVt HSVv 1.0 HSVs 1.0 HSVf sub mul sub mul def
	 /HSVi HSVi 6 mod def 0 HSVi eq {HSVv HSVt HSVp}
	 {1 HSVi eq {HSVq HSVv HSVp}{2 HSVi eq {HSVp HSVv HSVt}
	 {3 HSVi eq {HSVp HSVq HSVv}{4 HSVi eq {HSVt HSVp HSVv}
	 {HSVv HSVp HSVq} ifelse} ifelse} ifelse} ifelse} ifelse
  } ifelse} def
/Constrain {
  dup 0 lt {0 exch pop}{dup 1 gt {1 exch pop} if} ifelse} def
/YIQ2RGB {
  3 copy -1.702 mul exch -1.105 mul add add Constrain 4 1 roll
  3 copy -0.647 mul exch -0.272 mul add add Constrain 5 1 roll
  0.621 mul exch -0.956 mul add add Constrain 3 1 roll } def
/CMY2RGB {  1 exch sub exch 1 exch sub 3 2 roll 1 exch sub 3 1 roll exch } def
/XYZ2RGB {  3 copy -0.9017 mul exch -0.1187 mul add exch 0.0585 mul exch add
  Constrain 4 1 roll 3 copy -0.0279 mul exch 1.999 mul add exch
  -0.9844 mul add Constrain 5 1 roll -0.2891 mul exch -0.5338 mul add
  exch 1.91 mul exch add Constrain 3 1 roll} def
/SelectSpace {ColorSpace (HSV) eq {HSV2RGB}{ColorSpace (XYZ) eq {
  XYZ2RGB}{ColorSpace (CMY) eq {CMY2RGB}{ColorSpace (YIQ) eq {YIQ2RGB}
  if} ifelse} ifelse} ifelse} def
/InterpolatedColor false def
/cF7 {sqrt} bind def	% sqrt(x)
/cF5 {dup dup mul mul} bind def	% x^3
/cF15 {360 mul sin} bind def	% sin(360x)
/pm3dround {maxcolors 0 gt {dup 1 ge
	{pop 1} {maxcolors mul floor maxcolors 1 sub div} ifelse} if} def
/pm3dGamma 1.0 1.5 div def
/ColorSpace (RGB) def
Color true and { % COLOUR vs. GRAY map
  InterpolatedColor { %% Interpolation vs. RGB-Formula
    /g {stroke pm3dround /grayv exch def interpolate
        SelectSpace setrgbcolor} bind def
  }{
  /g {stroke pm3dround dup cF7 Constrain exch dup cF5 Constrain exch cF15 Constrain 
       SelectSpace setrgbcolor} bind def
  } ifelse
}{
  /g {stroke pm3dround pm3dGamma exp setgray} bind def
} ifelse
1.000 UL
LTb
1890 720 M
157 0 V
4078 0 R
-157 0 V
stroke
1746 720 M
[ [(Roman) 240.0 0.0 true true 0 ( 0.5)]
] -80.0 MRshow
1.000 UL
LTb
1890 819 M
78 0 V
4157 0 R
-78 0 V
1890 917 M
78 0 V
4157 0 R
-78 0 V
-4157 99 R
78 0 V
4157 0 R
-78 0 V
-4157 99 R
78 0 V
4157 0 R
-78 0 V
-4157 98 R
78 0 V
4157 0 R
-78 0 V
-4157 0 R
157 0 V
4078 0 R
-157 0 V
stroke
1746 1213 M
[ [(Roman) 240.0 0.0 true true 0 ( 0.6)]
] -80.0 MRshow
1.000 UL
LTb
1890 1312 M
78 0 V
4157 0 R
-78 0 V
-4157 98 R
78 0 V
4157 0 R
-78 0 V
-4157 99 R
78 0 V
4157 0 R
-78 0 V
-4157 99 R
78 0 V
4157 0 R
-78 0 V
-4157 98 R
78 0 V
4157 0 R
-78 0 V
-4157 0 R
157 0 V
4078 0 R
-157 0 V
stroke
1746 1706 M
[ [(Roman) 240.0 0.0 true true 0 ( 0.7)]
] -80.0 MRshow
1.000 UL
LTb
1890 1805 M
78 0 V
4157 0 R
-78 0 V
-4157 99 R
78 0 V
4157 0 R
-78 0 V
-4157 98 R
78 0 V
4157 0 R
-78 0 V
-4157 99 R
78 0 V
4157 0 R
-78 0 V
-4157 98 R
78 0 V
4157 0 R
-78 0 V
-4157 0 R
157 0 V
4078 0 R
-157 0 V
stroke
1746 2199 M
[ [(Roman) 240.0 0.0 true true 0 ( 0.8)]
] -80.0 MRshow
1.000 UL
LTb
1890 2298 M
78 0 V
4157 0 R
-78 0 V
-4157 99 R
78 0 V
4157 0 R
-78 0 V
-4157 98 R
78 0 V
4157 0 R
-78 0 V
-4157 99 R
78 0 V
4157 0 R
-78 0 V
-4157 99 R
78 0 V
4157 0 R
-78 0 V
-4157 0 R
157 0 V
4078 0 R
-157 0 V
stroke
1746 2693 M
[ [(Roman) 240.0 0.0 true true 0 ( 0.9)]
] -80.0 MRshow
1.000 UL
LTb
1890 2791 M
78 0 V
4157 0 R
-78 0 V
-4157 99 R
78 0 V
4157 0 R
-78 0 V
-4157 98 R
78 0 V
4157 0 R
-78 0 V
-4157 99 R
78 0 V
4157 0 R
-78 0 V
-4157 99 R
78 0 V
4157 0 R
-78 0 V
-4157 0 R
157 0 V
4078 0 R
-157 0 V
stroke
1746 3186 M
[ [(Roman) 240.0 0.0 true true 0 ( 1)]
] -80.0 MRshow
1.000 UL
LTb
1890 3284 M
78 0 V
4157 0 R
-78 0 V
-4157 99 R
78 0 V
4157 0 R
-78 0 V
-4157 99 R
78 0 V
4157 0 R
-78 0 V
-4157 98 R
78 0 V
4157 0 R
-78 0 V
-4157 99 R
78 0 V
4157 0 R
-78 0 V
-4157 0 R
157 0 V
4078 0 R
-157 0 V
stroke
1746 3679 M
[ [(Roman) 240.0 0.0 true true 0 ( 1.1)]
] -80.0 MRshow
1.000 UL
LTb
1890 3778 M
78 0 V
4157 0 R
-78 0 V
-4157 98 R
78 0 V
4157 0 R
-78 0 V
-4157 99 R
78 0 V
4157 0 R
-78 0 V
-4157 98 R
78 0 V
4157 0 R
-78 0 V
-4157 99 R
78 0 V
4157 0 R
-78 0 V
-4157 0 R
157 0 V
4078 0 R
-157 0 V
stroke
1746 4172 M
[ [(Roman) 240.0 0.0 true true 0 ( 1.2)]
] -80.0 MRshow
1.000 UL
LTb
1890 4271 M
78 0 V
4157 0 R
-78 0 V
1890 720 M
0 78 V
0 3522 R
0 -78 V
2011 720 M
0 157 V
0 3443 R
0 -157 V
stroke
2011 480 M
[ [(Roman) 240.0 0.0 true true 0 ( 0)]
] -80.0 MCshow
1.000 UL
LTb
2132 720 M
0 78 V
0 3522 R
0 -78 V
2253 720 M
0 78 V
0 3522 R
0 -78 V
2374 720 M
0 78 V
0 3522 R
0 -78 V
2495 720 M
0 78 V
0 3522 R
0 -78 V
2616 720 M
0 157 V
0 3443 R
0 -157 V
stroke
2616 480 M
[ [(Roman) 240.0 0.0 true true 0 ( 0.01)]
] -80.0 MCshow
1.000 UL
LTb
2737 720 M
0 78 V
0 3522 R
0 -78 V
2858 720 M
0 78 V
0 3522 R
0 -78 V
2979 720 M
0 78 V
0 3522 R
0 -78 V
3100 720 M
0 78 V
0 3522 R
0 -78 V
3221 720 M
0 157 V
0 3443 R
0 -157 V
stroke
3221 480 M
[ [(Roman) 240.0 0.0 true true 0 ( 0.02)]
] -80.0 MCshow
1.000 UL
LTb
3342 720 M
0 78 V
0 3522 R
0 -78 V
3463 720 M
0 78 V
0 3522 R
0 -78 V
3584 720 M
0 78 V
0 3522 R
0 -78 V
3705 720 M
0 78 V
0 3522 R
0 -78 V
3826 720 M
0 157 V
0 3443 R
0 -157 V
stroke
3826 480 M
[ [(Roman) 240.0 0.0 true true 0 ( 0.03)]
] -80.0 MCshow
1.000 UL
LTb
3947 720 M
0 78 V
0 3522 R
0 -78 V
4068 720 M
0 78 V
0 3522 R
0 -78 V
4189 720 M
0 78 V
0 3522 R
0 -78 V
4310 720 M
0 78 V
0 3522 R
0 -78 V
4431 720 M
0 157 V
0 3443 R
0 -157 V
stroke
4431 480 M
[ [(Roman) 240.0 0.0 true true 0 ( 0.04)]
] -80.0 MCshow
1.000 UL
LTb
4552 720 M
0 78 V
0 3522 R
0 -78 V
4673 720 M
0 78 V
0 3522 R
0 -78 V
4794 720 M
0 78 V
0 3522 R
0 -78 V
4915 720 M
0 78 V
0 3522 R
0 -78 V
5036 720 M
0 157 V
0 3443 R
0 -157 V
stroke
5036 480 M
[ [(Roman) 240.0 0.0 true true 0 ( 0.05)]
] -80.0 MCshow
1.000 UL
LTb
5157 720 M
0 78 V
0 3522 R
0 -78 V
5278 720 M
0 78 V
0 3522 R
0 -78 V
5399 720 M
0 78 V
0 3522 R
0 -78 V
5520 720 M
0 78 V
0 3522 R
0 -78 V
5641 720 M
0 157 V
0 3443 R
0 -157 V
stroke
5641 480 M
[ [(Roman) 240.0 0.0 true true 0 ( 0.06)]
] -80.0 MCshow
1.000 UL
LTb
5762 720 M
0 78 V
0 3522 R
0 -78 V
5883 720 M
0 78 V
0 3522 R
0 -78 V
6004 720 M
0 78 V
0 3522 R
0 -78 V
6125 720 M
0 78 V
0 3522 R
0 -78 V
stroke
1890 4320 N
0 -3600 V
4235 0 V
0 3600 V
-4235 0 V
Z stroke
LCb setrgbcolor
906 2520 M
currentpoint gsave translate 90 rotate 0 0 moveto
[ [(Roman) 240.0 0.0 true true 0 (f)]
[(Roman) 192.0 -72.0 true true 0 (0)]
[(Roman) 240.0 0.0 true true 0 (  ,  f)]
[(Roman) 192.0 -72.0 true true 0 (+)]
] -56.0 MCshow
grestore
LTb
LCb setrgbcolor
4007 120 M
[ [(Roman) 240.0 0.0 true true 0 (z)]
] -80.0 MCshow
LTb
4007 4680 M
[ [(Roman) 240.0 0.0 true true 0 ( B)]
[(Roman) 192.0 -72.0 true true 0 (s)]
[(Roman) 240.0 0.0 true true 0 (->D)]
[(Roman) 192.0 -72.0 true true 0 (s)]
[(Roman) 240.0 0.0 true true 0 ( z-expansion:  )]
[(Symbol) 240.0 0.0 true true 0 (c)]
[(Roman) 192.0 120.0 true true 0 (2)]
[(Roman) 240.0 0.0 true true 0 (/dof=0.96/1, p-value=0.33 )]
] -80.0 MCshow
2.000 UP
1.000 UL
LTb
1.000 UL
LT0
1.00 0.75 0.80 C 2011 4197 N 0 -56 137 -148 0 56 h
2148 4049 N 0 -56 136 -143 0 56 h
2284 3906 N 0 -56 134 -139 0 56 h
2418 3767 N 0 -57 134 -133 0 56 h
2552 3633 N 0 -58 132 -129 0 57 h
2684 3503 N 0 -59 131 -125 0 58 h
2815 3377 N 0 -60 130 -120 0 59 h
2945 3256 N 0 -61 129 -117 0 60 h
3074 3138 N 0 -63 128 -112 0 61 h
3202 3024 N 0 -66 126 -108 0 63 h
3328 2913 N 0 -69 126 -104 0 66 h
3454 2806 N 0 -71 124 -101 0 69 h
3578 2703 N 0 -74 124 -97 0 71 h
3702 2603 N 0 -78 122 -94 0 74 h
3824 2505 N 0 -82 122 -90 0 78 h
3946 2411 N 0 -86 120 -87 0 82 h
4066 2320 N 0 -91 120 -83 0 86 h
4186 2232 N 0 -95 119 -81 0 91 h
4305 2147 N 0 -101 117 -77 0 95 h
4422 2064 N 0 -107 117 -74 0 101 h
4539 1984 N 0 -113 116 -72 0 107 h
4655 1906 N 0 -119 115 -69 0 113 h
4770 1831 N 0 -126 114 -66 0 119 h
4884 1758 N 0 -133 113 -63 0 126 h
4997 1688 N 0 -140 112 -61 0 133 h
5109 1620 N 0 -148 111 -58 0 140 h
5220 1554 N 0 -155 111 -56 0 148 h
5331 1491 N 0 -163 110 -54 0 155 h
5441 1429 N 0 -171 109 -51 0 163 h
5550 1370 N 0 -180 108 -49 0 171 h
1.000 UL
LT1
0.00 1.00 1.00 C 2011 2687 N 0 -30 137 -58 0 30 h
2148 2629 N 0 -31 136 -57 0 30 h
2284 2571 N 0 -31 134 -56 0 31 h
2418 2515 N 0 -32 134 -54 0 31 h
2552 2460 N 0 -34 132 -53 0 32 h
2684 2405 N 0 -35 131 -52 0 34 h
2815 2352 N 0 -37 130 -50 0 35 h
2945 2300 N 0 -39 129 -49 0 37 h
3074 2249 N 0 -42 128 -48 0 39 h
3202 2198 N 0 -44 126 -47 0 42 h
3328 2149 N 0 -48 126 -45 0 44 h
3454 2100 N 0 -52 124 -44 0 48 h
3578 2052 N 0 -56 124 -43 0 52 h
3702 2005 N 0 -60 122 -42 0 56 h
3824 1959 N 0 -66 122 -40 0 60 h
3946 1913 N 0 -71 120 -40 0 66 h
4066 1868 N 0 -77 120 -38 0 71 h
4186 1824 N 0 -83 119 -37 0 77 h
4305 1781 N 0 -89 117 -37 0 83 h
4422 1738 N 0 -96 117 -35 0 89 h
4539 1696 N 0 -103 116 -34 0 96 h
4655 1655 N 0 -111 115 -33 0 103 h
4770 1614 N 0 -118 114 -33 0 111 h
4884 1574 N 0 -126 113 -31 0 118 h
4997 1535 N 0 -135 112 -30 0 126 h
5109 1496 N 0 -143 111 -30 0 135 h
5220 1458 N 0 -152 111 -28 0 143 h
5331 1421 N 0 -161 110 -28 0 152 h
5441 1384 N 0 -170 109 -27 0 161 h
5550 1348 N 0 -180 108 -26 0 170 h
2.000 UP
2.000 UL
LT0
0.00 0.00 0.00 C LTb
4651 3855 M
[ [(Roman) 240.0 0.0 true true 0 (f)]
[(Roman) 192.0 -72.0 true true 0 (0)]
[(Roman) 240.0 0.0 true true 0 (\(M)]
[(Symbol) 192.0 -72.0 true true 0 (p)]
[(Roman) 192.0 120.0 true true 0 (2)]
[(Roman) 240.0 0.0 true true 0 (\) no pole)]
] -80.0 MRshow
LT0
0.00 0.00 0.00 C 4795 3855 M
702 0 V
-702 31 R
0 -62 V
702 62 R
0 -62 V
5652 1314 M
0 179 V
-31 -179 R
62 0 V
-62 179 R
62 0 V
5652 1404 TriUF
5146 3855 TriUF
2.000 UP
2.000 UL
LT0
1.00 0.00 0.00 C LTb
4651 3615 M
[ [(Roman) 240.0 0.0 true true 0 (f)]
[(Roman) 192.0 -72.0 true true 0 (0)]
[(Roman) 240.0 0.0 true true 0 (\(M)]
[(Symbol) 192.0 -72.0 true true 0 (p)]
[(Roman) 192.0 120.0 true true 0 (2)]
[(Roman) 240.0 0.0 true true 0 (\) f)]
[(Roman) 192.0 -72.0 true true 0 (+)]
[(Roman) 240.0 0.0 true true 0 ( pole)]
] -80.0 MRshow
LT0
1.00 0.00 0.00 C 4795 3615 M
702 0 V
-702 31 R
0 -62 V
702 62 R
0 -62 V
5652 1323 M
0 184 V
-31 -184 R
62 0 V
-62 184 R
62 0 V
5652 1415 Box
5146 3615 Box
1.000 UL
LT0
0.00 0.00 1.00 C LTb
4651 3375 M
[ [(Roman) 240.0 0.0 true true 0 (f)]
[(Roman) 192.0 -72.0 true true 0 (0)]
[(Roman) 240.0 0.0 true true 0 (\(fit\))]
] -56.0 MRshow
LT0
0.00 0.00 1.00 C 4795 3375 M
702 0 V
2011 2702 M
137 -58 V
136 -57 V
134 -56 V
134 -55 V
132 -54 V
131 -52 V
130 -52 V
129 -50 V
128 -49 V
126 -48 V
126 -47 V
124 -46 V
124 -45 V
122 -44 V
122 -43 V
120 -42 V
120 -41 V
119 -41 V
117 -39 V
117 -39 V
116 -38 V
115 -36 V
114 -37 V
113 -35 V
112 -34 V
111 -34 V
111 -33 V
110 -33 V
109 -31 V
108 -31 V
stroke
LT0
1.00 0.00 0.00 C LTb
4651 3135 M
[ [(Roman) 240.0 0.0 true true 0 (f)]
[(Roman) 192.0 -72.0 true true 0 (+)]
[(Roman) 240.0 0.0 true true 0 (\(fit\))]
] -56.0 MRshow
LT0
1.00 0.00 0.00 C 4795 3135 M
702 0 V
2011 4225 M
137 -148 V
136 -143 V
134 -139 V
134 -134 V
132 -129 V
131 -125 V
130 -121 V
129 -117 V
128 -113 V
126 -110 V
126 -105 V
124 -103 V
124 -98 V
122 -96 V
122 -92 V
120 -89 V
120 -86 V
119 -82 V
117 -81 V
117 -77 V
116 -74 V
115 -72 V
114 -70 V
113 -66 V
112 -65 V
111 -62 V
111 -60 V
110 -57 V
109 -56 V
108 -53 V
2.000 UP
stroke
LT0
0.00 0.00 1.00 C LTb
4651 2895 M
[ [(Roman) 240.0 0.0 true true 0 (f)]
[(Roman) 192.0 -72.0 true true 0 (0)]
[(Roman) 240.0 0.0 true true 0 (\(data\))]
] -56.0 MRshow
LT0
0.00 0.00 1.00 C 4795 2895 M
702 0 V
-702 31 R
0 -62 V
702 62 R
0 -62 V
2011 2686 M
0 30 V
-31 -30 R
62 0 V
-62 30 R
62 0 V
562 -279 R
0 32 V
-31 -32 R
62 0 V
-62 32 R
62 0 V
540 -264 R
0 42 V
-31 -42 R
62 0 V
-62 42 R
62 0 V
2011 2701 Circle
2604 2453 Circle
3175 2226 Circle
5146 2895 Circle
1.000 UL
LT4
0.00 0.00 1.00 C 2011 2686 M
188 -80 V
185 -78 V
184 -76 V
181 -75 V
179 -73 V
177 -71 V
175 -69 V
172 -67 V
171 -65 V
169 -62 V
167 -61 V
165 -59 V
163 -56 V
162 -55 V
160 -52 V
158 -50 V
156 -48 V
155 -46 V
153 -44 V
152 -42 V
150 -39 V
148 -37 V
147 -35 V
146 -33 V
stroke
LT4
0.00 0.00 1.00 C 2011 2716 M
188 -79 V
185 -78 V
184 -75 V
181 -73 V
179 -70 V
177 -68 V
175 -65 V
172 -61 V
171 -59 V
169 -55 V
167 -51 V
165 -47 V
163 -43 V
162 -38 V
160 -34 V
158 -29 V
156 -23 V
155 -19 V
153 -12 V
152 -7 V
150 -1 V
148 5 V
147 12 V
146 19 V
2.000 UP
stroke
LT0
1.00 0.00 0.00 C LTb
4651 2655 M
[ [(Roman) 240.0 0.0 true true 0 (f)]
[(Roman) 192.0 -72.0 true true 0 (+)]
[(Roman) 240.0 0.0 true true 0 (\(data\))]
] -56.0 MRshow
LT0
1.00 0.00 0.00 C 4795 2655 M
702 0 V
-702 31 R
0 -62 V
702 62 R
0 -62 V
2011 4193 M
0 57 V
-31 -57 R
62 0 V
-62 57 R
62 0 V
562 -669 R
0 57 V
-31 -57 R
62 0 V
-62 57 R
62 0 V
540 -596 R
0 64 V
-31 -64 R
62 0 V
-62 64 R
62 0 V
2011 4222 Dia
2604 3609 Dia
3175 3074 Dia
5146 2655 Dia
1.000 UL
LT4
1.00 0.00 0.00 C 2011 4193 M
188 -199 V
185 -192 V
184 -185 V
181 -178 V
179 -170 V
177 -164 V
175 -156 V
172 -150 V
171 -143 V
169 -137 V
167 -130 V
165 -124 V
163 -118 V
162 -111 V
160 -105 V
158 -98 V
156 -92 V
155 -85 V
153 -80 V
152 -72 V
150 -67 V
148 -60 V
147 -53 V
146 -47 V
stroke
LT4
1.00 0.00 0.00 C 2011 4250 M
188 -200 V
185 -192 V
184 -184 V
181 -177 V
179 -169 V
177 -160 V
175 -153 V
172 -145 V
171 -136 V
169 -128 V
167 -119 V
165 -111 V
163 -102 V
162 -94 V
160 -86 V
158 -77 V
156 -69 V
155 -60 V
153 -52 V
152 -44 V
150 -36 V
148 -27 V
147 -19 V
146 -10 V
stroke
LTb
1890 4320 N
0 -3600 V
4235 0 V
0 3600 V
-4235 0 V
Z stroke
2.000 UP
1.000 UL
LTb
grestore % colour palette end
stroke
grestore
end
showpage
%%Trailer
%%DocumentFonts: Symbol Roman
