2015-06-07T15:12:31: PING 8.8.8.8 (8.8.8.8) 56(84) bytes of data.
2015-06-07T15:12:31: [1433682751.489774] 64 bytes from 8.8.8.8: icmp_seq=1 ttl=54 time=60.3 ms
2015-06-07T15:12:32: [1433682752.452088] 64 bytes from 8.8.8.8: icmp_seq=2 ttl=54 time=21.2 ms
2015-06-07T15:12:33: [1433682753.682966] 64 bytes from 8.8.8.8: icmp_seq=3 ttl=54 time=250 ms
2015-06-07T15:12:34: [1433682754.509833] 64 bytes from 8.8.8.8: icmp_seq=4 ttl=54 time=76.0 ms
2015-06-07T15:12:35: [1433682755.688975] 64 bytes from 8.8.8.8: icmp_seq=5 ttl=54 time=254 ms
2015-06-07T15:12:36: [1433682756.634378] 64 bytes from 8.8.8.8: icmp_seq=6 ttl=54 time=198 ms
2015-06-07T15:12:37: [1433682757.576968] 64 bytes from 8.8.8.8: icmp_seq=7 ttl=54 time=139 ms
2015-06-07T15:12:38: [1433682758.474510] 64 bytes from 8.8.8.8: icmp_seq=8 ttl=54 time=35.5 ms
2015-06-07T15:12:39: [1433682759.614744] 64 bytes from 8.8.8.8: icmp_seq=9 ttl=54 time=174 ms
2015-06-07T15:12:40: [1433682760.476809] 64 bytes from 8.8.8.8: icmp_seq=10 ttl=54 time=35.0 ms
2015-06-07T15:12:41: [1433682761.692186] 64 bytes from 8.8.8.8: icmp_seq=11 ttl=54 time=249 ms
2015-06-07T15:12:42: [1433682762.533357] 64 bytes from 8.8.8.8: icmp_seq=12 ttl=54 time=89.3 ms
2015-06-07T15:12:43: [1433682763.462902] 64 bytes from 8.8.8.8: icmp_seq=13 ttl=54 time=17.5 ms
2015-06-07T15:12:44: [1433682764.478724] 64 bytes from 8.8.8.8: icmp_seq=14 ttl=54 time=31.7 ms
2015-06-07T15:12:45: [1433682765.655319] 64 bytes from 8.8.8.8: icmp_seq=15 ttl=54 time=206 ms
2015-06-07T15:12:46: [1433682766.550974] 64 bytes from 8.8.8.8: icmp_seq=16 ttl=54 time=100 ms
2015-06-07T15:12:47: [1433682767.473214] 64 bytes from 8.8.8.8: icmp_seq=17 ttl=54 time=21.2 ms
2015-06-07T15:12:48: [1433682768.475950] 64 bytes from 8.8.8.8: icmp_seq=18 ttl=54 time=22.6 ms
2015-06-07T15:12:49: [1433682769.490697] 64 bytes from 8.8.8.8: icmp_seq=19 ttl=54 time=35.7 ms
2015-06-07T15:12:50: [1433682770.511730] 64 bytes from 8.8.8.8: icmp_seq=20 ttl=54 time=55.0 ms
2015-06-07T15:12:51: [1433682771.475057] 64 bytes from 8.8.8.8: icmp_seq=21 ttl=54 time=17.2 ms
2015-06-07T15:12:52: [1433682772.468189] 64 bytes from 8.8.8.8: icmp_seq=22 ttl=54 time=9.09 ms
2015-06-07T15:12:53: [1433682773.474161] 64 bytes from 8.8.8.8: icmp_seq=23 ttl=54 time=13.9 ms
2015-06-07T15:12:54: [1433682774.472701] 64 bytes from 8.8.8.8: icmp_seq=24 ttl=54 time=10.4 ms
2015-06-07T15:12:55: [1433682775.482607] 64 bytes from 8.8.8.8: icmp_seq=25 ttl=54 time=19.0 ms
2015-06-07T15:12:56: [1433682776.479705] 64 bytes from 8.8.8.8: icmp_seq=26 ttl=54 time=15.0 ms
2015-06-07T15:12:57: [1433682777.498157] 64 bytes from 8.8.8.8: icmp_seq=27 ttl=54 time=32.4 ms
2015-06-07T15:12:58: [1433682778.491611] 64 bytes from 8.8.8.8: icmp_seq=28 ttl=54 time=24.4 ms
2015-06-07T15:12:59: [1433682779.583316] 64 bytes from 8.8.8.8: icmp_seq=29 ttl=54 time=114 ms
2015-06-07T15:13:00: [1433682780.502623] 64 bytes from 8.8.8.8: icmp_seq=30 ttl=54 time=32.2 ms
2015-06-07T15:13:01: [1433682781.489089] 64 bytes from 8.8.8.8: icmp_seq=31 ttl=54 time=17.4 ms
2015-06-07T15:13:02: [1433682782.497376] 64 bytes from 8.8.8.8: icmp_seq=32 ttl=54 time=24.2 ms
2015-06-07T15:13:03: [1433682783.529094] 64 bytes from 8.8.8.8: icmp_seq=33 ttl=54 time=54.6 ms
2015-06-07T15:13:04: [1433682784.510825] 64 bytes from 8.8.8.8: icmp_seq=34 ttl=54 time=34.6 ms
2015-06-07T15:13:05: [1433682785.510165] 64 bytes from 8.8.8.8: icmp_seq=35 ttl=54 time=32.2 ms
2015-06-07T15:13:06: [1433682786.582904] 64 bytes from 8.8.8.8: icmp_seq=36 ttl=54 time=103 ms
2015-06-07T15:13:07: [1433682787.575027] 64 bytes from 8.8.8.8: icmp_seq=37 ttl=54 time=94.1 ms
2015-06-07T15:13:08: [1433682788.507013] 64 bytes from 8.8.8.8: icmp_seq=38 ttl=54 time=25.0 ms
2015-06-07T15:13:09: [1433682789.522391] 64 bytes from 8.8.8.8: icmp_seq=39 ttl=54 time=39.3 ms
2015-06-07T15:13:10: [1433682790.808700] 64 bytes from 8.8.8.8: icmp_seq=40 ttl=54 time=324 ms
2015-06-07T15:13:11: [1433682791.859522] 64 bytes from 8.8.8.8: icmp_seq=41 ttl=54 time=374 ms
2015-06-07T15:13:12: [1433682792.508651] 64 bytes from 8.8.8.8: icmp_seq=42 ttl=54 time=22.4 ms
2015-06-07T15:13:13: [1433682793.674068] 64 bytes from 8.8.8.8: icmp_seq=43 ttl=54 time=186 ms
2015-06-07T15:13:14: [1433682794.505156] 64 bytes from 8.8.8.8: icmp_seq=44 ttl=54 time=16.1 ms
2015-06-07T15:13:15: [1433682795.762612] 64 bytes from 8.8.8.8: icmp_seq=45 ttl=54 time=272 ms
2015-06-07T15:13:16: [1433682796.529828] 64 bytes from 8.8.8.8: icmp_seq=46 ttl=54 time=38.4 ms
2015-06-07T15:13:17: [1433682797.652300] 64 bytes from 8.8.8.8: icmp_seq=47 ttl=54 time=159 ms
2015-06-07T15:13:18: [1433682798.512908] 64 bytes from 8.8.8.8: icmp_seq=48 ttl=54 time=18.6 ms
2015-06-07T15:13:19: [1433682799.590048] 64 bytes from 8.8.8.8: icmp_seq=49 ttl=54 time=94.0 ms
2015-06-07T15:13:20: [1433682800.542585] 64 bytes from 8.8.8.8: icmp_seq=50 ttl=54 time=45.5 ms
2015-06-07T15:13:21: [1433682801.788723] 64 bytes from 8.8.8.8: icmp_seq=51 ttl=54 time=290 ms
2015-06-07T15:13:22: [1433682802.652267] 64 bytes from 8.8.8.8: icmp_seq=52 ttl=54 time=152 ms
2015-06-07T15:13:23: [1433682803.752091] 64 bytes from 8.8.8.8: icmp_seq=53 ttl=54 time=250 ms
2015-06-07T15:13:24: [1433682804.622309] 64 bytes from 8.8.8.8: icmp_seq=54 ttl=54 time=119 ms
2015-06-07T15:13:25: [1433682805.555336] 64 bytes from 8.8.8.8: icmp_seq=55 ttl=54 time=51.0 ms
2015-06-07T15:13:26: [1433682806.535686] 64 bytes from 8.8.8.8: icmp_seq=56 ttl=54 time=30.3 ms
2015-06-07T15:13:27: [1433682807.540381] 64 bytes from 8.8.8.8: icmp_seq=57 ttl=54 time=33.6 ms
2015-06-07T15:13:28: [1433682808.749851] 64 bytes from 8.8.8.8: icmp_seq=58 ttl=54 time=241 ms
2015-06-07T15:13:29: [1433682809.803624] 64 bytes from 8.8.8.8: icmp_seq=59 ttl=54 time=293 ms
2015-06-07T15:13:31: [1433682811.036400] 64 bytes from 8.8.8.8: icmp_seq=60 ttl=54 time=524 ms
2015-06-07T15:13:31: [1433682811.776808] 64 bytes from 8.8.8.8: icmp_seq=61 ttl=54 time=265 ms
2015-06-07T15:13:32: [1433682812.865091] 64 bytes from 8.8.8.8: icmp_seq=62 ttl=54 time=352 ms
2015-06-07T15:13:33: [1433682813.527583] 64 bytes from 8.8.8.8: icmp_seq=63 ttl=54 time=13.7 ms
2015-06-07T15:13:34: [1433682814.941030] 64 bytes from 8.8.8.8: icmp_seq=64 ttl=54 time=425 ms
2015-06-07T15:13:35: [1433682815.545887] 64 bytes from 8.8.8.8: icmp_seq=65 ttl=54 time=29.1 ms
2015-06-07T15:13:36: [1433682816.915972] 64 bytes from 8.8.8.8: icmp_seq=66 ttl=54 time=398 ms
2015-06-07T15:13:37: [1433682817.864019] 64 bytes from 8.8.8.8: icmp_seq=67 ttl=54 time=345 ms
2015-06-07T15:13:38: [1433682818.553211] 64 bytes from 8.8.8.8: icmp_seq=68 ttl=54 time=33.4 ms
2015-06-07T15:13:39: [1433682819.548799] 64 bytes from 8.8.8.8: icmp_seq=69 ttl=54 time=27.5 ms
2015-06-07T15:13:40: [1433682820.553506] 64 bytes from 8.8.8.8: icmp_seq=70 ttl=54 time=30.6 ms
2015-06-07T15:13:41: [1433682821.676969] 64 bytes from 8.8.8.8: icmp_seq=71 ttl=54 time=152 ms
2015-06-07T15:13:42: [1433682822.691092] 64 bytes from 8.8.8.8: icmp_seq=72 ttl=54 time=165 ms
2015-06-07T15:13:43: [1433682823.548941] 64 bytes from 8.8.8.8: icmp_seq=73 ttl=54 time=21.9 ms
2015-06-07T15:13:44: [1433682824.597026] 64 bytes from 8.8.8.8: icmp_seq=74 ttl=54 time=69.0 ms
2015-06-07T15:13:45: [1433682825.839301] 64 bytes from 8.8.8.8: icmp_seq=75 ttl=54 time=310 ms
2015-06-07T15:13:46: [1433682826.554249] 64 bytes from 8.8.8.8: icmp_seq=76 ttl=54 time=24.1 ms
2015-06-07T15:13:47: [1433682827.840127] 64 bytes from 8.8.8.8: icmp_seq=77 ttl=54 time=308 ms
2015-06-07T15:13:48: [1433682828.683419] 64 bytes from 8.8.8.8: icmp_seq=78 ttl=54 time=150 ms
2015-06-07T15:13:49: [1433682829.643560] 64 bytes from 8.8.8.8: icmp_seq=79 ttl=54 time=109 ms
2015-06-07T15:13:50: [1433682830.738451] 64 bytes from 8.8.8.8: icmp_seq=80 ttl=54 time=202 ms
2015-06-07T15:13:51: [1433682831.585967] 64 bytes from 8.8.8.8: icmp_seq=81 ttl=54 time=48.6 ms
2015-06-07T15:13:52: [1433682832.565813] 64 bytes from 8.8.8.8: icmp_seq=82 ttl=54 time=26.8 ms
2015-06-07T15:13:53: [1433682833.800673] 64 bytes from 8.8.8.8: icmp_seq=83 ttl=54 time=259 ms
2015-06-07T15:13:54: [1433682834.555110] 64 bytes from 8.8.8.8: icmp_seq=84 ttl=54 time=12.6 ms
2015-06-07T15:13:55: [1433682835.558807] 64 bytes from 8.8.8.8: icmp_seq=85 ttl=54 time=14.6 ms
2015-06-07T15:13:56: [1433682836.742394] 64 bytes from 8.8.8.8: icmp_seq=86 ttl=54 time=196 ms
2015-06-07T15:13:57: [1433682837.568472] 64 bytes from 8.8.8.8: icmp_seq=87 ttl=54 time=21.1 ms
2015-06-07T15:13:58: [1433682838.648858] 64 bytes from 8.8.8.8: icmp_seq=88 ttl=54 time=100 ms
2015-06-07T15:13:59: [1433682839.579678] 64 bytes from 8.8.8.8: icmp_seq=89 ttl=54 time=29.8 ms
2015-06-07T15:14:00: [1433682840.577963] 64 bytes from 8.8.8.8: icmp_seq=90 ttl=54 time=26.2 ms
2015-06-07T15:14:01: [1433682841.563772] 64 bytes from 8.8.8.8: icmp_seq=91 ttl=54 time=10.7 ms
2015-06-07T15:14:02: [1433682842.710351] 64 bytes from 8.8.8.8: icmp_seq=92 ttl=54 time=155 ms
2015-06-07T15:14:03: [1433682843.773245] 64 bytes from 8.8.8.8: icmp_seq=93 ttl=54 time=216 ms
2015-06-07T15:14:04: [1433682844.578658] 64 bytes from 8.8.8.8: icmp_seq=94 ttl=54 time=21.5 ms
2015-06-07T15:14:05: [1433682845.629775] 64 bytes from 8.8.8.8: icmp_seq=95 ttl=54 time=71.0 ms
2015-06-07T15:14:06: [1433682846.687201] 64 bytes from 8.8.8.8: icmp_seq=96 ttl=54 time=127 ms
2015-06-07T15:14:07: [1433682847.597743] 64 bytes from 8.8.8.8: icmp_seq=97 ttl=54 time=36.6 ms
2015-06-07T15:14:08: [1433682848.753767] 64 bytes from 8.8.8.8: icmp_seq=98 ttl=54 time=191 ms
2015-06-07T15:14:09: [1433682849.591897] 64 bytes from 8.8.8.8: icmp_seq=99 ttl=54 time=28.2 ms
2015-06-07T15:14:10: [1433682850.586310] 64 bytes from 8.8.8.8: icmp_seq=100 ttl=54 time=22.0 ms
2015-06-07T15:14:10: 
2015-06-07T15:14:10: --- 8.8.8.8 ping statistics ---
2015-06-07T15:14:10: 100 packets transmitted, 100 received, 0% packet loss, time 99134ms
2015-06-07T15:14:10: rtt min/avg/max/mdev = 9.092/113.840/524.986/115.992 ms
