[Thu Jun 11 00:00:07 2015] systemd-udevd[3002]: device 0x7f0a1f83faa0 filled with db file data
[Thu Jun 11 00:00:07 2015] systemd-udevd[3002]: removing watch on '/dev/sda3'
[Thu Jun 11 00:00:07 2015] systemd-udevd[2965]: maximum number (24) of children reached
[Thu Jun 11 00:00:07 2015] systemd-udevd[2965]: maximum number (24) of children reached
[Thu Jun 11 00:00:07 2015] systemd-udevd[2965]: maximum number (24) of children reached
[Thu Jun 11 00:00:07 2015] systemd-udevd[2965]: maximum number (24) of children reached
[Thu Jun 11 00:00:07 2015] systemd-udevd[2965]: maximum number (24) of children reached
[Thu Jun 11 00:00:07 2015] systemd-udevd[2965]: maximum number (24) of children reached
[Thu Jun 11 00:00:07 2015] systemd-udevd[3002]: GROUP 6 /lib64/udev/rules.d/50-udev-default.rules:52
[Thu Jun 11 00:00:07 2015] systemd-udevd[2965]: maximum number (24) of children reached
[Thu Jun 11 00:00:07 2015] systemd-udevd[2965]: maximum number (24) of children reached
[Thu Jun 11 00:00:07 2015] systemd-udevd[2965]: maximum number (24) of children reached
[Thu Jun 11 00:00:07 2015] systemd-udevd[2965]: maximum number (24) of children reached
[Thu Jun 11 00:00:07 2015] systemd-udevd[2965]: maximum number (24) of children reached
[Thu Jun 11 00:00:07 2015] systemd-udevd[2965]: maximum number (24) of children reached
[Thu Jun 11 00:00:07 2015] systemd-udevd[2965]: maximum number (24) of children reached
[Thu Jun 11 00:00:07 2015] systemd-udevd[2965]: maximum number (24) of children reached
[Thu Jun 11 00:00:07 2015] systemd-udevd[2965]: maximum number (24) of children reached
[Thu Jun 11 00:00:07 2015] systemd-udevd[2965]: maximum number (24) of children reached
[Thu Jun 11 00:00:07 2015] systemd-udevd[2965]: maximum number (24) of children reached
[Thu Jun 11 00:00:07 2015] systemd-udevd[2965]: maximum number (24) of children reached
[Thu Jun 11 00:00:07 2015] systemd-udevd[2965]: maximum number (24) of children reached
[Thu Jun 11 00:00:07 2015] systemd-udevd[2965]: maximum number (24) of children reached
[Thu Jun 11 00:00:07 2015] systemd-udevd[2965]: maximum number (24) of children reached
[Thu Jun 11 00:00:07 2015] systemd-udevd[2965]: maximum number (24) of children reached
[Thu Jun 11 00:00:07 2015] systemd-udevd[2965]: maximum number (24) of children reached
[Thu Jun 11 00:00:07 2015] systemd-udevd[2965]: maximum number (24) of children reached
[Thu Jun 11 00:00:07 2015] systemd-udevd[2965]: maximum number (24) of children reached
[Thu Jun 11 00:00:07 2015] systemd-udevd[2987]: probe /dev/sda1 raid offset=0
[Thu Jun 11 00:00:07 2015] systemd-udevd[2965]: maximum number (24) of children reached
[Thu Jun 11 00:00:07 2015] systemd-udevd[2965]: maximum number (24) of children reached
[Thu Jun 11 00:00:07 2015] systemd-udevd[2965]: maximum number (24) of children reached
[Thu Jun 11 00:00:07 2015] systemd-udevd[2965]: maximum number (24) of children reached
[Thu Jun 11 00:00:07 2015] systemd-udevd[2965]: maximum number (24) of children reached
[Thu Jun 11 00:00:07 2015] systemd-udevd[2965]: maximum number (24) of children reached
[Thu Jun 11 00:00:07 2015] systemd-udevd[2965]: maximum number (24) of children reached
[Thu Jun 11 00:00:07 2015] systemd-udevd[3002]: device 0x7f0a1f838380 filled with db file data
[Thu Jun 11 00:00:07 2015] systemd-udevd[2965]: maximum number (24) of children reached
[Thu Jun 11 00:00:07 2015] systemd-udevd[2965]: maximum number (24) of children reached
[Thu Jun 11 00:00:07 2015] systemd-udevd[2965]: maximum number (24) of children reached
[Thu Jun 11 00:00:07 2015] systemd-udevd[2965]: maximum number (24) of children reached
[Thu Jun 11 00:00:07 2015] systemd-udevd[2965]: maximum number (24) of children reached
[Thu Jun 11 00:00:07 2015] systemd-udevd[3002]: LINK 'disk/by-id/ata-TS256GSSD720_49982012030714570011-part3' /lib64/udev/rules.d/60-persistent-storage.rules:43
[Thu Jun 11 00:00:07 2015] systemd-udevd[2965]: maximum number (24) of children reached
[Thu Jun 11 00:00:07 2015] systemd-udevd[2965]: maximum number (24) of children reached
[Thu Jun 11 00:00:07 2015] systemd-udevd[2965]: maximum number (24) of children reached
[Thu Jun 11 00:00:07 2015] systemd-udevd[2965]: maximum number (24) of children reached
[Thu Jun 11 00:00:07 2015] systemd-udevd[2965]: maximum number (24) of children reached
[Thu Jun 11 00:00:07 2015] systemd-udevd[2965]: maximum number (24) of children reached
[Thu Jun 11 00:00:07 2015] systemd-udevd[2965]: maximum number (24) of children reached
[Thu Jun 11 00:00:07 2015] systemd-udevd[2965]: maximum number (24) of children reached
[Thu Jun 11 00:00:07 2015] systemd-udevd[2965]: maximum number (24) of children reached
[Thu Jun 11 00:00:07 2015] systemd-udevd[2965]: maximum number (24) of children reached
[Thu Jun 11 00:00:07 2015] systemd-udevd[2965]: maximum number (24) of children reached
[Thu Jun 11 00:00:07 2015] systemd-udevd[2965]: maximum number (24) of children reached
[Thu Jun 11 00:00:07 2015] systemd-udevd[2965]: maximum number (24) of children reached
[Thu Jun 11 00:00:07 2015] systemd-udevd[2965]: maximum number (24) of children reached
[Thu Jun 11 00:00:07 2015] systemd-udevd[2965]: maximum number (24) of children reached
[Thu Jun 11 00:00:07 2015] systemd-udevd[2965]: maximum number (24) of children reached
[Thu Jun 11 00:00:07 2015] systemd-udevd[2965]: maximum number (24) of children reached
[Thu Jun 11 00:00:07 2015] systemd-udevd[2965]: maximum number (24) of children reached
[Thu Jun 11 00:00:07 2015] systemd-udevd[2965]: maximum number (24) of children reached
[Thu Jun 11 00:00:07 2015] systemd-udevd[2965]: maximum number (24) of children reached
[Thu Jun 11 00:00:07 2015] systemd-udevd[2965]: maximum number (24) of children reached
[Thu Jun 11 00:00:07 2015] systemd-udevd[2965]: maximum number (24) of children reached
[Thu Jun 11 00:00:07 2015] systemd-udevd[2965]: maximum number (24) of children reached
[Thu Jun 11 00:00:07 2015] systemd-udevd[2965]: maximum number (24) of children reached
[Thu Jun 11 00:00:07 2015] systemd-udevd[2965]: maximum number (24) of children reached
[Thu Jun 11 00:00:07 2015] systemd-udevd[2965]: maximum number (24) of children reached
[Thu Jun 11 00:00:07 2015] systemd-udevd[3002]: device 0x7f0a1f9428d0 has devpath '/devices/pci0000:00/0000:00:1f.2/ata1/host0/target0:0:0/0:0:0:0'
[Thu Jun 11 00:00:07 2015] systemd-udevd[3002]: device 0x7f0a1f9430c0 has devpath '/devices/pci0000:00/0000:00:1f.2/ata1/host0/target0:0:0'
[Thu Jun 11 00:00:07 2015] systemd-udevd[2965]: seq 2380 queued, 'add' 'misc'
[Thu Jun 11 00:00:07 2015] systemd-udevd[3002]: device 0x7f0a1f9438a0 has devpath '/devices/pci0000:00/0000:00:1f.2/ata1/host0'
[Thu Jun 11 00:00:07 2015] systemd-udevd[2965]: passed 173 bytes to netlink monitor 0x7f0a1f8383a0
[Thu Jun 11 00:00:07 2015] systemd-udevd[3002]: device 0x7f0a1f944070 has devpath '/devices/pci0000:00/0000:00:1f.2/ata1'
[Thu Jun 11 00:00:07 2015] systemd-udevd[2965]: maximum number (24) of children reached
[Thu Jun 11 00:00:07 2015] systemd-udevd[2965]: maximum number (24) of children reached
[Thu Jun 11 00:00:07 2015] systemd-udevd[2965]: maximum number (24) of children reached
[Thu Jun 11 00:00:07 2015] systemd-udevd[3002]: device 0x7f0a1f944830 has devpath '/devices/pci0000:00/0000:00:1f.2'
[Thu Jun 11 00:00:07 2015] systemd-udevd[2965]: maximum number (24) of children reached
[Thu Jun 11 00:00:07 2015] systemd-udevd[2989]: seq 2296 running
[Thu Jun 11 00:00:07 2015] systemd-udevd[2965]: maximum number (24) of children reached
[Thu Jun 11 00:00:07 2015] systemd-udevd[2965]: maximum number (24) of children reached
[Thu Jun 11 00:00:07 2015] systemd-udevd[2965]: maximum number (24) of children reached
[Thu Jun 11 00:00:07 2015] systemd-udevd[2965]: maximum number (24) of children reached
[Thu Jun 11 00:00:07 2015] systemd-udevd[2965]: maximum number (24) of children reached
[Thu Jun 11 00:00:07 2015] systemd-udevd[2965]: maximum number (24) of children reached
[Thu Jun 11 00:00:07 2015] systemd-udevd[2965]: maximum number (24) of children reached
[Thu Jun 11 00:00:07 2015] systemd-udevd[2965]: maximum number (24) of children reached
[Thu Jun 11 00:00:07 2015] systemd-udevd[2965]: maximum number (24) of children reached
[Thu Jun 11 00:00:07 2015] systemd-udevd[3002]: device 0x7f0a1f944fe0 has devpath '/devices/pci0000:00'
[Thu Jun 11 00:00:07 2015] systemd-udevd[2965]: maximum number (24) of children reached
[Thu Jun 11 00:00:07 2015] systemd-udevd[2965]: maximum number (24) of children reached
[Thu Jun 11 00:00:07 2015] systemd-udevd[2965]: maximum number (24) of children reached
[Thu Jun 11 00:00:07 2015] systemd-udevd[2965]: maximum number (24) of children reached
[Thu Jun 11 00:00:07 2015] systemd-udevd[3002]: IMPORT builtin 'blkid' /lib64/udev/rules.d/60-persistent-storage.rules:70
[Thu Jun 11 00:00:07 2015] traps: systemd-udevd[2989] trap invalid opcode ip:7f0a1eb4793a sp:7fff974f0ae8 error:0 in libpthread-2.20.so[7f0a1eb3c000+16000]
[Thu Jun 11 00:00:07 2015] systemd-udevd[2965]: maximum number (24) of children reached
[Thu Jun 11 00:00:07 2015] systemd-udevd[2965]: maximum number (24) of children reached

[Thu Jun 11 00:00:07 2015] systemd-udevd[2965]: maximum number (24) of children reached
[Thu Jun 11 00:00:07 2015] systemd-udevd[2965]: maximum number (24) of children reached
[Thu Jun 11 00:00:07 2015] systemd-udevd[2965]: maximum number (24) of children reached
[Thu Jun 11 00:00:07 2015] systemd-udevd[2965]: maximum number (24) of children reached
[Thu Jun 11 00:00:07 2015] systemd-udevd[2965]: maximum number (24) of children reached
[Thu Jun 11 00:00:07 2015] systemd-udevd[2965]: maximum number (24) of children reached
[Thu Jun 11 00:00:07 2015] systemd-udevd[2965]: maximum number (24) of children reached
[Thu Jun 11 00:00:07 2015] systemd-udevd[2965]: maximum number (24) of children reached
[Thu Jun 11 00:00:07 2015] systemd-udevd[2965]: maximum number (24) of children reached
[Thu Jun 11 00:00:07 2015] systemd-udevd[2965]: maximum number (24) of children reached
[Thu Jun 11 00:00:07 2015] systemd-udevd[2965]: maximum number (24) of children reached
[Thu Jun 11 00:00:07 2015] systemd-udevd[2965]: maximum number (24) of children reached
[Thu Jun 11 00:00:07 2015] systemd-udevd[2965]: maximum number (24) of children reached
[Thu Jun 11 00:00:07 2015] systemd-udevd[2965]: maximum number (24) of children reached
[Thu Jun 11 00:00:07 2015] systemd-udevd[2965]: maximum number (24) of children reached
[Thu Jun 11 00:00:07 2015] systemd-udevd[2965]: maximum number (24) of children reached
[Thu Jun 11 00:00:07 2015] systemd-udevd[2965]: maximum number (24) of children reached
[Thu Jun 11 00:00:07 2015] systemd-udevd[2965]: maximum number (24) of children reached
[Thu Jun 11 00:00:07 2015] systemd-udevd[2965]: maximum number (24) of children reached
[Thu Jun 11 00:00:07 2015] systemd-udevd[2965]: maximum number (24) of children reached
[Thu Jun 11 00:00:07 2015] systemd-udevd[2965]: maximum number (24) of children reached
[Thu Jun 11 00:00:07 2015] systemd-udevd[2965]: maximum number (24) of children reached
[Thu Jun 11 00:00:07 2015] systemd-udevd[2965]: maximum number (24) of children reached
[Thu Jun 11 00:00:07 2015] systemd-udevd[2965]: maximum number (24) of children reached
[Thu Jun 11 00:00:07 2015] systemd-udevd[2965]: maximum number (24) of children reached
[Thu Jun 11 00:00:07 2015] systemd-udevd[2965]: maximum number (24) of children reached
[Thu Jun 11 00:00:07 2015] systemd-udevd[2965]: maximum number (24) of children reached
[Thu Jun 11 00:00:07 2015] systemd-udevd[3002]: probe /dev/sda3 raid offset=0
[Thu Jun 11 00:00:07 2015] systemd-udevd[2965]: maximum number (24) of children reached
[Thu Jun 11 00:00:07 2015] systemd-udevd[2965]: maximum number (24) of children reached
[Thu Jun 11 00:00:07 2015] systemd-udevd[2965]: maximum number (24) of children reached
[Thu Jun 11 00:00:07 2015] systemd-udevd[2965]: maximum number (24) of children reached
[Thu Jun 11 00:00:07 2015] systemd-udevd[2965]: maximum number (24) of children reached
[Thu Jun 11 00:00:07 2015] systemd-udevd[2965]: maximum number (24) of children reached
[Thu Jun 11 00:00:07 2015] systemd-udevd[2965]: maximum number (24) of children reached
[Thu Jun 11 00:00:07 2015] systemd-udevd[2965]: maximum number (24) of children reached
[Thu Jun 11 00:00:07 2015] systemd-udevd[2965]: maximum number (24) of children reached
[Thu Jun 11 00:00:07 2015] systemd-udevd[2965]: maximum number (24) of children reached
[Thu Jun 11 00:00:07 2015] systemd-udevd[2965]: maximum number (24) of children reached
[Thu Jun 11 00:00:07 2015] systemd-udevd[2965]: maximum number (24) of children reached
[Thu Jun 11 00:00:07 2015] systemd-udevd[2965]: maximum number (24) of children reached
[Thu Jun 11 00:00:07 2015] systemd-udevd[2965]: maximum number (24) of children reached
[Thu Jun 11 00:00:07 2015] systemd-udevd[2965]: maximum number (24) of children reached
[Thu Jun 11 00:00:07 2015] systemd-udevd[2965]: maximum number (24) of children reached
[Thu Jun 11 00:00:07 2015] systemd-udevd[2965]: maximum number (24) of children reached
[Thu Jun 11 00:00:07 2015] systemd-udevd[2965]: maximum number (24) of children reached
[Thu Jun 11 00:00:07 2015] systemd-udevd[2965]: maximum number (24) of children reached
[Thu Jun 11 00:00:07 2015] systemd-udevd[2965]: maximum number (24) of children reached
[Thu Jun 11 00:00:07 2015] systemd-udevd[2965]: maximum number (24) of children reached
[Thu Jun 11 00:00:07 2015] systemd-udevd[2965]: maximum number (24) of children reached
[Thu Jun 11 00:00:07 2015] systemd-udevd[2965]: maximum number (24) of children reached
[Thu Jun 11 00:00:07 2015] systemd-udevd[2965]: maximum number (24) of children reached
[Thu Jun 11 00:00:07 2015] systemd-udevd[2965]: maximum number (24) of children reached
[Thu Jun 11 00:00:07 2015] systemd-udevd[2965]: maximum number (24) of children reached
[Thu Jun 11 00:00:07 2015] systemd-udevd[2965]: maximum number (24) of children reached
[Thu Jun 11 00:00:07 2015] systemd-udevd[2965]: maximum number (24) of children reached
[Thu Jun 11 00:00:07 2015] systemd-udevd[2965]: maximum number (24) of children reached
[Thu Jun 11 00:00:07 2015] systemd-udevd[2965]: maximum number (24) of children reached
[Thu Jun 11 00:00:07 2015] systemd-udevd[2965]: maximum number (24) of children reached
[Thu Jun 11 00:00:07 2015] systemd-udevd[2965]: maximum number (24) of children reached
[Thu Jun 11 00:00:07 2015] systemd-udevd[2965]: maximum number (24) of children reached
[Thu Jun 11 00:00:07 2015] systemd-udevd[2965]: maximum number (24) of children reached
[Thu Jun 11 00:00:07 2015] systemd-udevd[2965]: maximum number (24) of children reached
[Thu Jun 11 00:00:07 2015] systemd-udevd[2965]: maximum number (24) of children reached
[Thu Jun 11 00:00:07 2015] systemd-udevd[2965]: maximum number (24) of children reached
[Thu Jun 11 00:00:07 2015] systemd-udevd[2965]: maximum number (24) of children reached
[Thu Jun 11 00:00:07 2015] systemd-udevd[2965]: worker [2989] exit
[Thu Jun 11 00:00:07 2015] traps: systemd-udevd[2965] trap invalid opcode ip:7f0a1eb4793a sp:7fff974f64c8 error:0 in libpthread-2.20.so[7f0a1eb3c000+16000]
[Thu Jun 11 00:00:07 2015] microcode: CPU4 updated to revision 0x1c, date = 2014-07-03
[Thu Jun 11 00:00:07 2015] microcode: CPU5 sig=0x306c3, pf=0x2, revision=0x19
[Thu Jun 11 00:00:07 2015] systemd-udevd[3009]: seq 2295 running
[Thu Jun 11 00:00:07 2015] microcode: CPU5 sig=0x306c3, pf=0x2, revision=0x19
[Thu Jun 11 00:00:07 2015] traps: systemd-udevd[3009] trap invalid opcode ip:7f0a1eb4793a sp:7fff974f0ae8 error:0 in libpthread-2.20.so[7f0a1eb3c000+16000]
[Thu Jun 11 00:00:07 2015] microcode: CPU5 updated to revision 0x1c, date = 2014-07-03
[Thu Jun 11 00:00:07 2015] microcode: CPU6 sig=0x306c3, pf=0x2, revision=0x19
[Thu Jun 11 00:00:07 2015] microcode: CPU6 sig=0x306c3, pf=0x2, revision=0x19
[Thu Jun 11 00:00:07 2015] systemd-udevd[2988]: '/sbin/mdadm --incremental --export /dev/sdb1 --offroot ${DEVLINKS}'(out) 'MD_DEVICE=md0'
[Thu Jun 11 00:00:07 2015] systemd-udevd[2988]: '/sbin/mdadm --incremental --export /dev/sdb1 --offroot ${DEVLINKS}'(out) 'MD_DEVNAME=/dev/md0'
[Thu Jun 11 00:00:07 2015] systemd-udevd[2988]: '/sbin/mdadm --incremental --export /dev/sdb1 --offroot ${DEVLINKS}'(out) 'MD_FOREIGN=no'
[Thu Jun 11 00:00:07 2015] systemd-udevd[2988]: '/sbin/mdadm --incremental --export /dev/sdb1 --offroot ${DEVLINKS}'(out) 'MD_STARTED=no'
[Thu Jun 11 00:00:07 2015] systemd-udevd[2988]: '/sbin/mdadm --incremental --export /dev/sdb1 --offroot ${DEVLINKS}' [3036] exit with return code 0
[Thu Jun 11 00:00:07 2015] systemd-udevd[2988]: IMPORT '/bin/sh -c '/sbin/mdadm --examine --export /dev/sdb1 | /bin/sed s/^MD_/UDISKS_MD_MEMBER_/g'' /lib64/udev/rules.d/80-udisks2.rules:20
[Thu Jun 11 00:00:07 2015] md: bind<sdd1>
[Thu Jun 11 00:00:07 2015] microcode: CPU6 updated to revision 0x1c, date = 2014-07-03
[Thu Jun 11 00:00:07 2015] systemd-udevd[3047]: starting '/bin/sh -c '/sbin/mdadm --examine --export /dev/sdb1 | /bin/sed s/^MD_/UDISKS_MD_MEMBER_/g''
[Thu Jun 11 00:00:07 2015] microcode: CPU7 sig=0x306c3, pf=0x2, revision=0x19
[Thu Jun 11 00:00:07 2015] microcode: CPU7 sig=0x306c3, pf=0x2, revision=0x19
[Thu Jun 11 00:00:07 2015] systemd-udevd[2994]: '/sbin/mdadm --incremental --export /dev/sdd1 --offroot ${DEVLINKS}'(out) 'MD_DEVICE=md0'
[Thu Jun 11 00:00:07 2015] systemd-udevd[2994]: '/sbin/mdadm --incremental --export /dev/sdd1 --offroot ${DEVLINKS}'(out) 'MD_DEVNAME=/dev/md0'
[Thu Jun 11 00:00:07 2015] systemd-udevd[2994]: '/sbin/mdadm --incremental --export /dev/sdd1 --offroot ${DEVLINKS}'(out) 'MD_FOREIGN=no'
[Thu Jun 11 00:00:07 2015] systemd-udevd[2994]: '/sbin/mdadm --incremental --export /dev/sdd1 --offroot ${DEVLINKS}'(out) 'MD_STARTED=no'
[Thu Jun 11 00:00:07 2015] systemd-udevd[2994]: '/sbin/mdadm --incremental --export /dev/sdd1 --offroot ${DEVLINKS}' [3044] exit with return code 0
[Thu Jun 11 00:00:07 2015] systemd-udevd[2984]: LINK 'disk/by-id/wwn-0x50014ee260e7536f' /lib64/udev/rules.d/60-persistent-storage.rules:80
[Thu Jun 11 00:00:07 2015] systemd-udevd[2994]: IMPORT '/bin/sh -c '/sbin/mdadm --examine --export /dev/sdd1 | /bin/sed s/^MD_/UDISKS_MD_MEMBER_/g'' /lib64/udev/rules.d/80-udisks2.rules:20
[Thu Jun 11 00:00:07 2015] systemd-udevd[2984]: handling device node '/dev/sdf', devnum=b8:80, mode=0660, uid=0, gid=6
[Thu Jun 11 00:00:07 2015] systemd-udevd[2984]: set permissions /dev/sdf, 060660, uid=0, gid=6
[Thu Jun 11 00:00:07 2015] systemd-udevd[2984]: preserve already existing symlink '/dev/block/8:80' to '../sdf'
[Thu Jun 11 00:00:07 2015] systemd-udevd[2984]: found 'b8:80' claiming '/run/udev/links/\x2fdisk\x2fby-id\x2fata-WDC_WD60EFRX-68MYMN1_WD-WX11DC449R92'
[Thu Jun 11 00:00:07 2015] systemd-udevd[2984]: creating link '/dev/disk/by-id/ata-WDC_WD60EFRX-68MYMN1_WD-WX11DC449R92' to '/dev/sdf'
[Thu Jun 11 00:00:07 2015] systemd-udevd[2984]: preserve already existing symlink '/dev/disk/by-id/ata-WDC_WD60EFRX-68MYMN1_WD-WX11DC449R92' to '../../sdf'
[Thu Jun 11 00:00:07 2015] systemd-udevd[2984]: found 'b8:80' claiming '/run/udev/links/\x2fdisk\x2fby-id\x2fwwn-0x50014ee260e7536f'
[Thu Jun 11 00:00:07 2015] systemd-udevd[2984]: creating link '/dev/disk/by-id/wwn-0x50014ee260e7536f' to '/dev/sdf'
[Thu Jun 11 00:00:07 2015] systemd-udevd[2984]: preserve already existing symlink '/dev/disk/by-id/wwn-0x50014ee260e7536f' to '../../sdf'
[Thu Jun 11 00:00:07 2015] systemd-udevd[2984]: created db file '/run/udev/data/b8:80' for '/devices/pci0000:00/0000:00:1c.3/0000:03:00.0/0000:04:07.0/0000:08:00.0/ata7/host6/target6:0:0/6:0:0:0/block/sdf'
[Thu Jun 11 00:00:07 2015] systemd-udevd[2984]: adding watch on '/dev/sdf'
[Thu Jun 11 00:00:07 2015] systemd-udevd[2984]: created db file '/run/udev/data/b8:80' for '/devices/pci0000:00/0000:00:1c.3/0000:03:00.0/0000:04:07.0/0000:08:00.0/ata7/host6/target6:0:0/6:0:0:0/block/sdf'
[Thu Jun 11 00:00:07 2015] microcode: CPU7 updated to revision 0x1c, date = 2014-07-03
[Thu Jun 11 00:00:07 2015] systemd-udevd[2984]: passed -1 bytes to netlink monitor 0x7f0a1f83a9f0
[Thu Jun 11 00:00:07 2015] systemd-udevd[2984]: seq 2129 processed with 0
[Thu Jun 11 00:00:07 2015] systemd-udevd[2984]: unload module index
[Thu Jun 11 00:00:07 2015] systemd-udevd[3048]: starting '/bin/sh -c '/sbin/mdadm --examine --export /dev/sdd1 | /bin/sed s/^MD_/UDISKS_MD_MEMBER_/g''
[Thu Jun 11 00:00:07 2015] systemd-udevd[2984]: Unloaded link configuration context.
[Thu Jun 11 00:00:07 2015] systemd-udevd[2990]: inserted 'efivars'
[Thu Jun 11 00:00:07 2015] systemd-udevd[2990]: passed -1 bytes to netlink monitor 0x7f0a1f84cf70
[Thu Jun 11 00:00:07 2015] systemd-udevd[2990]: seq 2255 processed with 0
[Thu Jun 11 00:00:07 2015] systemd-udevd[2990]: unload module index
[Thu Jun 11 00:00:07 2015] systemd-udevd[2990]: Unloaded link configuration context.
[Thu Jun 11 00:00:07 2015] microcode: Microcode Update Driver: v2.00 <tigran@aivazian.fsnet.co.uk>, Peter Oruba
[Thu Jun 11 00:00:07 2015] systemd-udevd[3004]: inserted 'microcode'
[Thu Jun 11 00:00:07 2015] systemd-udevd[3008]: inserted 'microcode'
[Thu Jun 11 00:00:07 2015] systemd-udevd[3000]: inserted 'microcode'
[Thu Jun 11 00:00:07 2015] systemd-udevd[3006]: inserted 'microcode'
[Thu Jun 11 00:00:07 2015] systemd-udevd[2999]: inserted 'microcode'
[Thu Jun 11 00:00:07 2015] traps: systemd-udevd[3008] trap invalid opcode ip:7f0a1eb4793a sp:7fff974f4538 error:0
[Thu Jun 11 00:00:07 2015] traps: systemd-udevd[3000] trap invalid opcode ip:7f0a1eb4793a sp:7fff974f4568 error:0
[Thu Jun 11 00:00:07 2015]  in libpthread-2.20.so[7f0a1eb3c000+16000]

[Thu Jun 11 00:00:07 2015] traps: systemd-udevd[3006] trap invalid opcode ip:7f0a1eb4793a sp:7fff974f4568 error:0 in libpthread-2.20.so[7f0a1eb3c000+16000]
[Thu Jun 11 00:00:07 2015]  in libpthread-2.20.so[7f0a1eb3c000+16000]


[Thu Jun 11 00:00:07 2015] systemd-udevd[3001]: inserted 'microcode'
[Thu Jun 11 00:00:07 2015] systemd-udevd[3007]: inserted 'microcode'
[Thu Jun 11 00:00:07 2015] systemd-udevd[2998]: inserted 'microcode'
[Thu Jun 11 00:00:07 2015] md: bind<sdc1>
[Thu Jun 11 00:00:07 2015] systemd-udevd[2985]: '/sbin/mdadm --incremental --export /dev/sdc1 --offroot ${DEVLINKS}'(out) 'MD_DEVICE=md0'
[Thu Jun 11 00:00:07 2015] systemd-udevd[2985]: '/sbin/mdadm --incremental --export /dev/sdc1 --offroot ${DEVLINKS}'(out) 'MD_DEVNAME=/dev/md0'
[Thu Jun 11 00:00:07 2015] systemd-udevd[2985]: '/sbin/mdadm --incremental --export /dev/sdc1 --offroot ${DEVLINKS}'(out) 'MD_FOREIGN=no'
[Thu Jun 11 00:00:07 2015] systemd-udevd[2985]: '/sbin/mdadm --incremental --export /dev/sdc1 --offroot ${DEVLINKS}'(out) 'MD_STARTED=no'
[Thu Jun 11 00:00:07 2015] systemd-udevd[2985]: '/sbin/mdadm --incremental --export /dev/sdc1 --offroot ${DEVLINKS}' [3038] exit with return code 0
[Thu Jun 11 00:00:07 2015] systemd-udevd[2985]: IMPORT '/bin/sh -c '/sbin/mdadm --examine --export /dev/sdc1 | /bin/sed s/^MD_/UDISKS_MD_MEMBER_/g'' /lib64/udev/rules.d/80-udisks2.rules:20
[Thu Jun 11 00:00:07 2015] systemd-udevd[3054]: starting '/bin/sh -c '/sbin/mdadm --examine --export /dev/sdc1 | /bin/sed s/^MD_/UDISKS_MD_MEMBER_/g''
[Thu Jun 11 00:00:07 2015] md: bind<sde1>
[Thu Jun 11 00:00:07 2015] systemd-udevd[2988]: '/bin/sh -c '/sbin/mdadm --examine --export /dev/sdb1 | /bin/sed s/^MD_/UDISKS_MD_MEMBER_/g''(out) 'UDISKS_MD_MEMBER_LEVEL=raid6'
[Thu Jun 11 00:00:07 2015] systemd-udevd[2988]: '/bin/sh -c '/sbin/mdadm --examine --export /dev/sdb1 | /bin/sed s/^MD_/UDISKS_MD_MEMBER_/g''(out) 'UDISKS_MD_MEMBER_DEVICES=6'
[Thu Jun 11 00:00:07 2015] systemd-udevd[2988]: '/bin/sh -c '/sbin/mdadm --examine --export /dev/sdb1 | /bin/sed s/^MD_/UDISKS_MD_MEMBER_/g''(out) 'UDISKS_MD_MEMBER_NAME=hadean:0'
[Thu Jun 11 00:00:07 2015] systemd-udevd[2988]: '/bin/sh -c '/sbin/mdadm --examine --export /dev/sdb1 | /bin/sed s/^MD_/UDISKS_MD_MEMBER_/g''(out) 'UDISKS_MD_MEMBER_ARRAY_SIZE=24004.16GB'
[Thu Jun 11 00:00:07 2015] systemd-udevd[2988]: '/bin/sh -c '/sbin/mdadm --examine --export /dev/sdb1 | /bin/sed s/^MD_/UDISKS_MD_MEMBER_/g''(out) 'UDISKS_MD_MEMBER_UUID=9dd19957:01e05b7d:0d133efd:e0ec565d'
[Thu Jun 11 00:00:07 2015] systemd-udevd[2988]: '/bin/sh -c '/sbin/mdadm --examine --export /dev/sdb1 | /bin/sed s/^MD_/UDISKS_MD_MEMBER_/g''(out) 'UDISKS_MD_MEMBER_UPDATE_TIME=1433973531'
[Thu Jun 11 00:00:07 2015] systemd-udevd[2988]: '/bin/sh -c '/sbin/mdadm --examine --export /dev/sdb1 | /bin/sed s/^MD_/UDISKS_MD_MEMBER_/g''(out) 'UDISKS_MD_MEMBER_DEV_UUID=4f51e456:52744e14:39e1974c:a8375f17'
[Thu Jun 11 00:00:07 2015] systemd-udevd[2988]: '/bin/sh -c '/sbin/mdadm --examine --export /dev/sdb1 | /bin/sed s/^MD_/UDISKS_MD_MEMBER_/g''(out) 'UDISKS_MD_MEMBER_EVENTS=21853'
[Thu Jun 11 00:00:07 2015] systemd-udevd[2991]: '/sbin/mdadm --incremental --export /dev/sde1 --offroot ${DEVLINKS}'(out) 'MD_DEVICE=md0'
[Thu Jun 11 00:00:07 2015] systemd-udevd[2991]: '/sbin/mdadm --incremental --export /dev/sde1 --offroot ${DEVLINKS}'(out) 'MD_DEVNAME=/dev/md0'
[Thu Jun 11 00:00:07 2015] systemd-udevd[2991]: '/sbin/mdadm --incremental --export /dev/sde1 --offroot ${DEVLINKS}'(out) 'MD_FOREIGN=no'
[Thu Jun 11 00:00:07 2015] systemd-udevd[2991]: '/sbin/mdadm --incremental --export /dev/sde1 --offroot ${DEVLINKS}'(out) 'MD_STARTED=unsafe'
[Thu Jun 11 00:00:07 2015] systemd-udevd[2988]: '/bin/sh -c '/sbin/mdadm --examine --export /dev/sdb1 | /bin/sed s/^MD_/UDISKS_MD_MEMBER_/g'' [3047] exit with return code 0
[Thu Jun 11 00:00:07 2015] systemd-udevd[2991]: '/sbin/mdadm --incremental --export /dev/sde1 --offroot ${DEVLINKS}' [3045] exit with return code 0
[Thu Jun 11 00:00:07 2015] systemd-udevd[2988]: handling device node '/dev/sdb1', devnum=b8:17, mode=0660, uid=0, gid=6
[Thu Jun 11 00:00:07 2015] systemd-udevd[2988]: set permissions /dev/sdb1, 060660, uid=0, gid=6
[Thu Jun 11 00:00:07 2015] systemd-udevd[2988]: preserve already existing symlink '/dev/block/8:17' to '../sdb1'
[Thu Jun 11 00:00:07 2015] systemd-udevd[2988]: found 'b8:17' claiming '/run/udev/links/\x2fdisk\x2fby-id\x2fata-WDC_WD60EFRX-68MYMN1_WD-WX11DC4FK2L4-part1'
[Thu Jun 11 00:00:07 2015] systemd-udevd[2991]: IMPORT '/bin/sh -c '/sbin/mdadm --examine --export /dev/sde1 | /bin/sed s/^MD_/UDISKS_MD_MEMBER_/g'' /lib64/udev/rules.d/80-udisks2.rules:20
[Thu Jun 11 00:00:07 2015] systemd-udevd[2988]: creating link '/dev/disk/by-id/ata-WDC_WD60EFRX-68MYMN1_WD-WX11DC4FK2L4-part1' to '/dev/sdb1'
[Thu Jun 11 00:00:07 2015] systemd-udevd[2994]: '/bin/sh -c '/sbin/mdadm --examine --export /dev/sdd1 | /bin/sed s/^MD_/UDISKS_MD_MEMBER_/g''(out) 'UDISKS_MD_MEMBER_LEVEL=raid6'
[Thu Jun 11 00:00:07 2015] systemd-udevd[2988]: preserve already existing symlink '/dev/disk/by-id/ata-WDC_WD60EFRX-68MYMN1_WD-WX11DC4FK2L4-part1' to '../../sdb1'
[Thu Jun 11 00:00:07 2015] systemd-udevd[2994]: '/bin/sh -c '/sbin/mdadm --examine --export /dev/sdd1 | /bin/sed s/^MD_/UDISKS_MD_MEMBER_/g''(out) 'UDISKS_MD_MEMBER_DEVICES=6'
[Thu Jun 11 00:00:07 2015] systemd-udevd[2994]: '/bin/sh -c '/sbin/mdadm --examine --export /dev/sdd1 | /bin/sed s/^MD_/UDISKS_MD_MEMBER_/g''(out) 'UDISKS_MD_MEMBER_NAME=hadean:0'
[Thu Jun 11 00:00:07 2015] systemd-udevd[2988]: found 'b8:17' claiming '/run/udev/links/\x2fdisk\x2fby-id\x2fwwn-0x50014ee2b63ce07b-part1'
[Thu Jun 11 00:00:07 2015] systemd-udevd[2994]: '/bin/sh -c '/sbin/mdadm --examine --export /dev/sdd1 | /bin/sed s/^MD_/UDISKS_MD_MEMBER_/g''(out) 'UDISKS_MD_MEMBER_ARRAY_SIZE=24004.16GB'
[Thu Jun 11 00:00:07 2015] systemd-udevd[2988]: creating link '/dev/disk/by-id/wwn-0x50014ee2b63ce07b-part1' to '/dev/sdb1'
[Thu Jun 11 00:00:07 2015] systemd-udevd[2994]: '/bin/sh -c '/sbin/mdadm --examine --export /dev/sdd1 | /bin/sed s/^MD_/UDISKS_MD_MEMBER_/g''(out) 'UDISKS_MD_MEMBER_UUID=9dd19957:01e05b7d:0d133efd:e0ec565d'
[Thu Jun 11 00:00:07 2015] systemd-udevd[2994]: '/bin/sh -c '/sbin/mdadm --examine --export /dev/sdd1 | /bin/sed s/^MD_/UDISKS_MD_MEMBER_/g''(out) 'UDISKS_MD_MEMBER_UPDATE_TIME=1433973531'
[Thu Jun 11 00:00:07 2015] systemd-udevd[2988]: preserve already existing symlink '/dev/disk/by-id/wwn-0x50014ee2b63ce07b-part1' to '../../sdb1'
[Thu Jun 11 00:00:07 2015] systemd-udevd[2994]: '/bin/sh -c '/sbin/mdadm --examine --export /dev/sdd1 | /bin/sed s/^MD_/UDISKS_MD_MEMBER_/g''(out) 'UDISKS_MD_MEMBER_DEV_UUID=56768122:044c74d6:fd8af04e:60a46fb0'
[Thu Jun 11 00:00:07 2015] systemd-udevd[2994]: '/bin/sh -c '/sbin/mdadm --examine --export /dev/sdd1 | /bin/sed s/^MD_/UDISKS_MD_MEMBER_/g''(out) 'UDISKS_MD_MEMBER_EVENTS=21853'
[Thu Jun 11 00:00:07 2015] systemd-udevd[2988]: found 'b8:81' claiming '/run/udev/links/\x2fdisk\x2fby-partlabel\x2fLinux\x5cx20filesystem'
[Thu Jun 11 00:00:07 2015] systemd-udevd[2988]: device 0x7f0a1f870120 has devpath '/devices/pci0000:00/0000:00:1c.3/0000:03:00.0/0000:04:07.0/0000:08:00.0/ata7/host6/target6:0:0/6:0:0:0/block/sdf/sdf1'
[Thu Jun 11 00:00:07 2015] systemd-udevd[2988]: device 0x7f0a1f870120 filled with db file data
[Thu Jun 11 00:00:07 2015] systemd-udevd[2988]: found 'b8:97' claiming '/run/udev/links/\x2fdisk\x2fby-partlabel\x2fLinux\x5cx20filesystem'
[Thu Jun 11 00:00:07 2015] systemd-udevd[2988]: device 0x7f0a1f870120 has devpath '/devices/pci0000:00/0000:00:1c.3/0000:03:00.0/0000:04:07.0/0000:08:00.0/ata8/host7/target7:0:0/7:0:0:0/block/sdg/sdg1'
[Thu Jun 11 00:00:07 2015] systemd-udevd[3058]: starting '/bin/sh -c '/sbin/mdadm --examine --export /dev/sde1 | /bin/sed s/^MD_/UDISKS_MD_MEMBER_/g''
[Thu Jun 11 00:00:07 2015] systemd-udevd[2986]: LINK 'disk/by-id/wwn-0x50014ee260e78c75' /lib64/udev/rules.d/60-persistent-storage.rules:80
[Thu Jun 11 00:00:07 2015] systemd-udevd[2994]: '/bin/sh -c '/sbin/mdadm --examine --export /dev/sdd1 | /bin/sed s/^MD_/UDISKS_MD_MEMBER_/g'' [3048] exit with return code 0
[Thu Jun 11 00:00:07 2015] systemd-udevd[2988]: device 0x7f0a1f870120 filled with db file data
[Thu Jun 11 00:00:07 2015] systemd-udevd[2988]: found 'b8:49' claiming '/run/udev/links/\x2fdisk\x2fby-partlabel\x2fLinux\x5cx20filesystem'
[Thu Jun 11 00:00:07 2015] systemd-udevd[2988]: device 0x7f0a1f870120 has devpath '/devices/pci0000:00/0000:00:1f.2/ata5/host4/target4:0:0/4:0:0:0/block/sdd/sdd1'
[Thu Jun 11 00:00:07 2015] systemd-udevd[2988]: device 0x7f0a1f870120 filled with db file data
[Thu Jun 11 00:00:07 2015] systemd-udevd[2988]: found 'b8:17' claiming '/run/udev/links/\x2fdisk\x2fby-partlabel\x2fLinux\x5cx20filesystem'
[Thu Jun 11 00:00:07 2015] systemd-udevd[2988]: found 'b8:33' claiming '/run/udev/links/\x2fdisk\x2fby-partlabel\x2fLinux\x5cx20filesystem'
[Thu Jun 11 00:00:07 2015] systemd-udevd[2988]: device 0x7f0a1f870120 has devpath '/devices/pci0000:00/0000:00:1f.2/ata4/host3/target3:0:0/3:0:0:0/block/sdc/sdc1'
[Thu Jun 11 00:00:07 2015] systemd-udevd[2994]: handling device node '/dev/sdd1', devnum=b8:49, mode=0660, uid=0, gid=6
[Thu Jun 11 00:00:07 2015] systemd-udevd[2994]: set permissions /dev/sdd1, 060660, uid=0, gid=6
[Thu Jun 11 00:00:07 2015] systemd-udevd[2994]: preserve already existing symlink '/dev/block/8:49' to '../sdd1'
[Thu Jun 11 00:00:07 2015] systemd-udevd[2994]: found 'b8:49' claiming '/run/udev/links/\x2fdisk\x2fby-id\x2fata-WDC_WD60EFRX-68MYMN1_WD-WX71DA4A0L9U-part1'
[Thu Jun 11 00:00:07 2015] systemd-udevd[2994]: creating link '/dev/disk/by-id/ata-WDC_WD60EFRX-68MYMN1_WD-WX71DA4A0L9U-part1' to '/dev/sdd1'
[Thu Jun 11 00:00:07 2015] systemd-udevd[2986]: handling device node '/dev/sdg', devnum=b8:96, mode=0660, uid=0, gid=6
[Thu Jun 11 00:00:07 2015] systemd-udevd[2994]: preserve already existing symlink '/dev/disk/by-id/ata-WDC_WD60EFRX-68MYMN1_WD-WX71DA4A0L9U-part1' to '../../sdd1'
[Thu Jun 11 00:00:07 2015] systemd-udevd[2986]: set permissions /dev/sdg, 060660, uid=0, gid=6
[Thu Jun 11 00:00:07 2015] systemd-udevd[2994]: found 'b8:49' claiming '/run/udev/links/\x2fdisk\x2fby-id\x2fwwn-0x50014ee260e0f8b6-part1'
[Thu Jun 11 00:00:07 2015] systemd-udevd[2988]: device 0x7f0a1f870120 filled with db file data
[Thu Jun 11 00:00:07 2015] systemd-udevd[2994]: creating link '/dev/disk/by-id/wwn-0x50014ee260e0f8b6-part1' to '/dev/sdd1'
[Thu Jun 11 00:00:07 2015] systemd-udevd[2986]: preserve already existing symlink '/dev/block/8:96' to '../sdg'
[Thu Jun 11 00:00:07 2015] systemd-udevd[2994]: preserve already existing symlink '/dev/disk/by-id/wwn-0x50014ee260e0f8b6-part1' to '../../sdd1'
[Thu Jun 11 00:00:07 2015] systemd-udevd[2988]: found 'b8:65' claiming '/run/udev/links/\x2fdisk\x2fby-partlabel\x2fLinux\x5cx20filesystem'
[Thu Jun 11 00:00:07 2015] systemd-udevd[2986]: found 'b8:96' claiming '/run/udev/links/\x2fdisk\x2fby-id\x2fata-WDC_WD60EFRX-68MYMN1_WD-WX11DC4FKYD1'
[Thu Jun 11 00:00:07 2015] systemd-udevd[2994]: found 'b8:81' claiming '/run/udev/links/\x2fdisk\x2fby-partlabel\x2fLinux\x5cx20filesystem'
[Thu Jun 11 00:00:07 2015] systemd-udevd[2986]: creating link '/dev/disk/by-id/ata-WDC_WD60EFRX-68MYMN1_WD-WX11DC4FKYD1' to '/dev/sdg'
[Thu Jun 11 00:00:07 2015] systemd-udevd[2986]: preserve already existing symlink '/dev/disk/by-id/ata-WDC_WD60EFRX-68MYMN1_WD-WX11DC4FKYD1' to '../../sdg'
[Thu Jun 11 00:00:07 2015] systemd-udevd[2986]: found 'b8:96' claiming '/run/udev/links/\x2fdisk\x2fby-id\x2fwwn-0x50014ee260e78c75'
[Thu Jun 11 00:00:07 2015] systemd-udevd[2988]: device 0x7f0a1f870120 has devpath '/devices/pci0000:00/0000:00:1f.2/ata6/host5/target5:0:0/5:0:0:0/block/sde/sde1'
[Thu Jun 11 00:00:07 2015] systemd-udevd[2986]: creating link '/dev/disk/by-id/wwn-0x50014ee260e78c75' to '/dev/sdg'
[Thu Jun 11 00:00:07 2015] systemd-udevd[2986]: preserve already existing symlink '/dev/disk/by-id/wwn-0x50014ee260e78c75' to '../../sdg'
[Thu Jun 11 00:00:07 2015] systemd-udevd[2994]: device 0x7f0a1f86f710 has devpath '/devices/pci0000:00/0000:00:1c.3/0000:03:00.0/0000:04:07.0/0000:08:00.0/ata7/host6/target6:0:0/6:0:0:0/block/sdf/sdf1'
[Thu Jun 11 00:00:07 2015] systemd-udevd[2986]: created db file '/run/udev/data/b8:96' for '/devices/pci0000:00/0000:00:1c.3/0000:03:00.0/0000:04:07.0/0000:08:00.0/ata8/host7/target7:0:0/7:0:0:0/block/sdg'
[Thu Jun 11 00:00:07 2015] systemd-udevd[2986]: adding watch on '/dev/sdg'
[Thu Jun 11 00:00:07 2015] systemd-udevd[2988]: device 0x7f0a1f870120 filled with db file data
[Thu Jun 11 00:00:07 2015] systemd-udevd[2988]: creating link '/dev/disk/by-partlabel/Linux\x20filesystem' to '/dev/sdb1'
[Thu Jun 11 00:00:07 2015] systemd-udevd[2988]: atomically replace '/dev/disk/by-partlabel/Linux\x20filesystem'
[Thu Jun 11 00:00:07 2015] systemd-udevd[2988]: found 'b8:17' claiming '/run/udev/links/\x2fdisk\x2fby-partuuid\x2f27eaa682-c777-41db-a080-02be864cfeac'
[Thu Jun 11 00:00:07 2015] systemd-udevd[2988]: creating link '/dev/disk/by-partuuid/27eaa682-c777-41db-a080-02be864cfeac' to '/dev/sdb1'
[Thu Jun 11 00:00:07 2015] systemd-udevd[2986]: created db file '/run/udev/data/b8:96' for '/devices/pci0000:00/0000:00:1c.3/0000:03:00.0/0000:04:07.0/0000:08:00.0/ata8/host7/target7:0:0/7:0:0:0/block/sdg'
[Thu Jun 11 00:00:07 2015] systemd-udevd[2988]: preserve already existing symlink '/dev/disk/by-partuuid/27eaa682-c777-41db-a080-02be864cfeac' to '../../sdb1'
[Thu Jun 11 00:00:07 2015] systemd-udevd[2994]: device 0x7f0a1f86f710 filled with db file data
[Thu Jun 11 00:00:07 2015] systemd-udevd[2994]: found 'b8:97' claiming '/run/udev/links/\x2fdisk\x2fby-partlabel\x2fLinux\x5cx20filesystem'
[Thu Jun 11 00:00:07 2015] systemd-udevd[2988]: created db file '/run/udev/data/b8:17' for '/devices/pci0000:00/0000:00:1f.2/ata3/host2/target2:0:0/2:0:0:0/block/sdb/sdb1'
[Thu Jun 11 00:00:07 2015] systemd-udevd[2988]: adding watch on '/dev/sdb1'
[Thu Jun 11 00:00:07 2015] systemd-udevd[2994]: device 0x7f0a1f86f710 has devpath '/devices/pci0000:00/0000:00:1c.3/0000:03:00.0/0000:04:07.0/0000:08:00.0/ata8/host7/target7:0:0/7:0:0:0/block/sdg/sdg1'
[Thu Jun 11 00:00:07 2015] systemd-udevd[2986]: passed -1 bytes to netlink monitor 0x7f0a1f86f240
[Thu Jun 11 00:00:07 2015] systemd-udevd[2986]: seq 2142 processed with 0
[Thu Jun 11 00:00:07 2015] systemd-udevd[2988]: created db file '/run/udev/data/b8:17' for '/devices/pci0000:00/0000:00:1f.2/ata3/host2/target2:0:0/2:0:0:0/block/sdb/sdb1'
[Thu Jun 11 00:00:07 2015] systemd-udevd[2988]: passed -1 bytes to netlink monitor 0x7f0a1f852000
[Thu Jun 11 00:00:07 2015] systemd-udevd[2988]: seq 2194 processed with 0
[Thu Jun 11 00:00:07 2015] systemd-udevd[2994]: device 0x7f0a1f86f710 filled with db file data
[Thu Jun 11 00:00:07 2015] systemd-udevd[2994]: found 'b8:49' claiming '/run/udev/links/\x2fdisk\x2fby-partlabel\x2fLinux\x5cx20filesystem'
[Thu Jun 11 00:00:07 2015] systemd-udevd[2994]: found 'b8:17' claiming '/run/udev/links/\x2fdisk\x2fby-partlabel\x2fLinux\x5cx20filesystem'
[Thu Jun 11 00:00:07 2015] systemd-udevd[2994]: device 0x7f0a1f86f710 has devpath '/devices/pci0000:00/0000:00:1f.2/ata3/host2/target2:0:0/2:0:0:0/block/sdb/sdb1'
[Thu Jun 11 00:00:07 2015] systemd-udevd[2986]: unload module index
[Thu Jun 11 00:00:07 2015] systemd-udevd[2988]: unload module index
[Thu Jun 11 00:00:07 2015] systemd-udevd[2986]: Unloaded link configuration context.
[Thu Jun 11 00:00:07 2015] systemd-udevd[2988]: Unloaded link configuration context.
[Thu Jun 11 00:00:07 2015] systemd-udevd[2994]: device 0x7f0a1f86f710 filled with db file data
[Thu Jun 11 00:00:07 2015] systemd-udevd[2994]: found 'b8:33' claiming '/run/udev/links/\x2fdisk\x2fby-partlabel\x2fLinux\x5cx20filesystem'
[Thu Jun 11 00:00:07 2015] systemd-udevd[2994]: device 0x7f0a1f86f710 has devpath '/devices/pci0000:00/0000:00:1f.2/ata4/host3/target3:0:0/3:0:0:0/block/sdc/sdc1'
[Thu Jun 11 00:00:07 2015] systemd-udevd[2994]: device 0x7f0a1f86f710 filled with db file data
[Thu Jun 11 00:00:07 2015] systemd-udevd[2994]: found 'b8:65' claiming '/run/udev/links/\x2fdisk\x2fby-partlabel\x2fLinux\x5cx20filesystem'
[Thu Jun 11 00:00:07 2015] systemd-udevd[2994]: device 0x7f0a1f86f710 has devpath '/devices/pci0000:00/0000:00:1f.2/ata6/host5/target5:0:0/5:0:0:0/block/sde/sde1'
[Thu Jun 11 00:00:07 2015] systemd-udevd[2994]: device 0x7f0a1f86f710 filled with db file data
[Thu Jun 11 00:00:07 2015] systemd-udevd[2994]: creating link '/dev/disk/by-partlabel/Linux\x20filesystem' to '/dev/sdd1'
[Thu Jun 11 00:00:07 2015] systemd-udevd[2994]: atomically replace '/dev/disk/by-partlabel/Linux\x20filesystem'
[Thu Jun 11 00:00:07 2015] systemd-udevd[2994]: found 'b8:49' claiming '/run/udev/links/\x2fdisk\x2fby-partuuid\x2f5377f704-61d2-45ea-b5ea-b54732ef54d7'
[Thu Jun 11 00:00:07 2015] systemd-udevd[2994]: creating link '/dev/disk/by-partuuid/5377f704-61d2-45ea-b5ea-b54732ef54d7' to '/dev/sdd1'
[Thu Jun 11 00:00:07 2015] systemd-udevd[2994]: preserve already existing symlink '/dev/disk/by-partuuid/5377f704-61d2-45ea-b5ea-b54732ef54d7' to '../../sdd1'
[Thu Jun 11 00:00:07 2015] systemd-udevd[2997]: LINK 'disk/by-uuid/1955b88d-6414-4147-aec5-524c3b432d85' /lib64/udev/rules.d/60-persistent-storage.rules:76
[Thu Jun 11 00:00:07 2015] systemd-udevd[2997]: LINK 'disk/by-partuuid/47b6d36a-e6c9-43c6-b182-ec49e1e92873' /lib64/udev/rules.d/60-persistent-storage.rules:84
[Thu Jun 11 00:00:07 2015] systemd-udevd[2994]: created db file '/run/udev/data/b8:49' for '/devices/pci0000:00/0000:00:1f.2/ata5/host4/target4:0:0/4:0:0:0/block/sdd/sdd1'
[Thu Jun 11 00:00:07 2015] systemd-udevd[2997]: LINK 'disk/by-partlabel/root' /lib64/udev/rules.d/60-persistent-storage.rules:85
[Thu Jun 11 00:00:07 2015] systemd-udevd[2997]: LINK 'root' /run/udev/rules.d/61-dev-root-link.rules:1
[Thu Jun 11 00:00:07 2015] systemd-udevd[2994]: adding watch on '/dev/sdd1'
[Thu Jun 11 00:00:07 2015] systemd-udevd[2994]: created db file '/run/udev/data/b8:49' for '/devices/pci0000:00/0000:00:1f.2/ata5/host4/target4:0:0/4:0:0:0/block/sdd/sdd1'
[Thu Jun 11 00:00:07 2015] systemd-udevd[2994]: passed -1 bytes to netlink monitor 0x7f0a1f869c50
[Thu Jun 11 00:00:07 2015] systemd-udevd[2994]: seq 2220 processed with 0
[Thu Jun 11 00:00:07 2015] systemd-udevd[2997]: handling device node '/dev/sda4', devnum=b8:4, mode=0660, uid=0, gid=6
[Thu Jun 11 00:00:07 2015] systemd-udevd[2997]: set permissions /dev/sda4, 060660, uid=0, gid=6
[Thu Jun 11 00:00:07 2015] systemd-udevd[2997]: preserve already existing symlink '/dev/block/8:4' to '../sda4'
[Thu Jun 11 00:00:07 2015] systemd-udevd[2997]: found 'b8:4' claiming '/run/udev/links/\x2fdisk\x2fby-id\x2fata-TS256GSSD720_49982012030714570011-part4'
[Thu Jun 11 00:00:07 2015] systemd-udevd[2997]: creating link '/dev/disk/by-id/ata-TS256GSSD720_49982012030714570011-part4' to '/dev/sda4'
[Thu Jun 11 00:00:07 2015] systemd-udevd[2997]: preserve already existing symlink '/dev/disk/by-id/ata-TS256GSSD720_49982012030714570011-part4' to '../../sda4'
[Thu Jun 11 00:00:07 2015] systemd-udevd[2997]: found 'b8:4' claiming '/run/udev/links/\x2fdisk\x2fby-partlabel\x2froot'
[Thu Jun 11 00:00:07 2015] systemd-udevd[2997]: creating link '/dev/disk/by-partlabel/root' to '/dev/sda4'
[Thu Jun 11 00:00:07 2015] systemd-udevd[2997]: preserve already existing symlink '/dev/disk/by-partlabel/root' to '../../sda4'
[Thu Jun 11 00:00:07 2015] systemd-udevd[2994]: unload module index
[Thu Jun 11 00:00:07 2015] systemd-udevd[2997]: found 'b8:4' claiming '/run/udev/links/\x2fdisk\x2fby-partuuid\x2f47b6d36a-e6c9-43c6-b182-ec49e1e92873'
[Thu Jun 11 00:00:07 2015] systemd-udevd[2997]: creating link '/dev/disk/by-partuuid/47b6d36a-e6c9-43c6-b182-ec49e1e92873' to '/dev/sda4'
[Thu Jun 11 00:00:07 2015] systemd-udevd[2997]: preserve already existing symlink '/dev/disk/by-partuuid/47b6d36a-e6c9-43c6-b182-ec49e1e92873' to '../../sda4'
[Thu Jun 11 00:00:07 2015] systemd-udevd[2994]: Unloaded link configuration context.
[Thu Jun 11 00:00:07 2015] systemd-udevd[2997]: found 'b8:4' claiming '/run/udev/links/\x2fdisk\x2fby-uuid\x2f1955b88d-6414-4147-aec5-524c3b432d85'
[Thu Jun 11 00:00:07 2015] systemd-udevd[2997]: creating link '/dev/disk/by-uuid/1955b88d-6414-4147-aec5-524c3b432d85' to '/dev/sda4'
[Thu Jun 11 00:00:07 2015] systemd-udevd[2997]: preserve already existing symlink '/dev/disk/by-uuid/1955b88d-6414-4147-aec5-524c3b432d85' to '../../sda4'
[Thu Jun 11 00:00:07 2015] systemd-udevd[2997]: creating link '/dev/root' to '/dev/sda4'
[Thu Jun 11 00:00:07 2015] systemd-udevd[2997]: creating symlink '/dev/root' to 'sda4'
[Thu Jun 11 00:00:07 2015] systemd-udevd[2997]: created db file '/run/udev/data/b8:4' for '/devices/pci0000:00/0000:00:1f.2/ata1/host0/target0:0:0/0:0:0:0/block/sda/sda4'
[Thu Jun 11 00:00:07 2015] systemd-udevd[2997]: adding watch on '/dev/sda4'
[Thu Jun 11 00:00:07 2015] systemd-udevd[2997]: created db file '/run/udev/data/b8:4' for '/devices/pci0000:00/0000:00:1f.2/ata1/host0/target0:0:0/0:0:0:0/block/sda/sda4'
[Thu Jun 11 00:00:07 2015] systemd-udevd[2997]: passed -1 bytes to netlink monitor 0x7f0a1f8512b0
[Thu Jun 11 00:00:07 2015] systemd-udevd[2997]: seq 2176 processed with 0
[Thu Jun 11 00:00:07 2015] systemd-udevd[2985]: '/bin/sh -c '/sbin/mdadm --examine --export /dev/sdc1 | /bin/sed s/^MD_/UDISKS_MD_MEMBER_/g''(out) 'UDISKS_MD_MEMBER_LEVEL=raid6'
[Thu Jun 11 00:00:07 2015] systemd-udevd[2985]: '/bin/sh -c '/sbin/mdadm --examine --export /dev/sdc1 | /bin/sed s/^MD_/UDISKS_MD_MEMBER_/g''(out) 'UDISKS_MD_MEMBER_DEVICES=6'
[Thu Jun 11 00:00:07 2015] systemd-udevd[2985]: '/bin/sh -c '/sbin/mdadm --examine --export /dev/sdc1 | /bin/sed s/^MD_/UDISKS_MD_MEMBER_/g''(out) 'UDISKS_MD_MEMBER_NAME=hadean:0'
[Thu Jun 11 00:00:07 2015] systemd-udevd[2985]: '/bin/sh -c '/sbin/mdadm --examine --export /dev/sdc1 | /bin/sed s/^MD_/UDISKS_MD_MEMBER_/g''(out) 'UDISKS_MD_MEMBER_ARRAY_SIZE=24004.16GB'
[Thu Jun 11 00:00:07 2015] systemd-udevd[2985]: '/bin/sh -c '/sbin/mdadm --examine --export /dev/sdc1 | /bin/sed s/^MD_/UDISKS_MD_MEMBER_/g''(out) 'UDISKS_MD_MEMBER_UUID=9dd19957:01e05b7d:0d133efd:e0ec565d'
[Thu Jun 11 00:00:07 2015] systemd-udevd[2985]: '/bin/sh -c '/sbin/mdadm --examine --export /dev/sdc1 | /bin/sed s/^MD_/UDISKS_MD_MEMBER_/g''(out) 'UDISKS_MD_MEMBER_UPDATE_TIME=1433973531'
[Thu Jun 11 00:00:07 2015] systemd-udevd[2985]: '/bin/sh -c '/sbin/mdadm --examine --export /dev/sdc1 | /bin/sed s/^MD_/UDISKS_MD_MEMBER_/g''(out) 'UDISKS_MD_MEMBER_DEV_UUID=90dce636:862ac3b5:3f7d9c6f:aecc2298'
[Thu Jun 11 00:00:07 2015] systemd-udevd[2997]: unload module index
[Thu Jun 11 00:00:07 2015] systemd-udevd[2985]: '/bin/sh -c '/sbin/mdadm --examine --export /dev/sdc1 | /bin/sed s/^MD_/UDISKS_MD_MEMBER_/g''(out) 'UDISKS_MD_MEMBER_EVENTS=21853'
[Thu Jun 11 00:00:07 2015] systemd-udevd[2997]: Unloaded link configuration context.
[Thu Jun 11 00:00:07 2015] systemd-udevd[2985]: '/bin/sh -c '/sbin/mdadm --examine --export /dev/sdc1 | /bin/sed s/^MD_/UDISKS_MD_MEMBER_/g'' [3054] exit with return code 0
[Thu Jun 11 00:00:07 2015] systemd-udevd[2985]: handling device node '/dev/sdc1', devnum=b8:33, mode=0660, uid=0, gid=6
[Thu Jun 11 00:00:07 2015] systemd-udevd[2985]: set permissions /dev/sdc1, 060660, uid=0, gid=6
[Thu Jun 11 00:00:07 2015] systemd-udevd[2985]: preserve already existing symlink '/dev/block/8:33' to '../sdc1'
[Thu Jun 11 00:00:07 2015] systemd-udevd[2985]: found 'b8:33' claiming '/run/udev/links/\x2fdisk\x2fby-id\x2fata-WDC_WD60EFRX-68MYMN1_WD-WX11DC4FKACA-part1'
[Thu Jun 11 00:00:07 2015] systemd-udevd[2985]: creating link '/dev/disk/by-id/ata-WDC_WD60EFRX-68MYMN1_WD-WX11DC4FKACA-part1' to '/dev/sdc1'
[Thu Jun 11 00:00:07 2015] systemd-udevd[2985]: preserve already existing symlink '/dev/disk/by-id/ata-WDC_WD60EFRX-68MYMN1_WD-WX11DC4FKACA-part1' to '../../sdc1'
[Thu Jun 11 00:00:07 2015] systemd-udevd[2985]: found 'b8:33' claiming '/run/udev/links/\x2fdisk\x2fby-id\x2fwwn-0x50014ee20b922c4c-part1'
[Thu Jun 11 00:00:07 2015] systemd-udevd[2985]: creating link '/dev/disk/by-id/wwn-0x50014ee20b922c4c-part1' to '/dev/sdc1'
[Thu Jun 11 00:00:07 2015] systemd-udevd[2985]: preserve already existing symlink '/dev/disk/by-id/wwn-0x50014ee20b922c4c-part1' to '../../sdc1'
[Thu Jun 11 00:00:07 2015] systemd-udevd[2985]: found 'b8:81' claiming '/run/udev/links/\x2fdisk\x2fby-partlabel\x2fLinux\x5cx20filesystem'
[Thu Jun 11 00:00:07 2015] systemd-udevd[2985]: device 0x7f0a1f84c2a0 has devpath '/devices/pci0000:00/0000:00:1c.3/0000:03:00.0/0000:04:07.0/0000:08:00.0/ata7/host6/target6:0:0/6:0:0:0/block/sdf/sdf1'
[Thu Jun 11 00:00:07 2015] systemd-udevd[2985]: device 0x7f0a1f84c2a0 filled with db file data
[Thu Jun 11 00:00:07 2015] systemd-udevd[2985]: found 'b8:97' claiming '/run/udev/links/\x2fdisk\x2fby-partlabel\x2fLinux\x5cx20filesystem'
[Thu Jun 11 00:00:07 2015] systemd-udevd[2985]: device 0x7f0a1f84c2a0 has devpath '/devices/pci0000:00/0000:00:1c.3/0000:03:00.0/0000:04:07.0/0000:08:00.0/ata8/host7/target7:0:0/7:0:0:0/block/sdg/sdg1'
[Thu Jun 11 00:00:07 2015] systemd-udevd[2985]: device 0x7f0a1f84c2a0 filled with db file data
[Thu Jun 11 00:00:07 2015] systemd-udevd[2985]: found 'b8:49' claiming '/run/udev/links/\x2fdisk\x2fby-partlabel\x2fLinux\x5cx20filesystem'
[Thu Jun 11 00:00:07 2015] systemd-udevd[2985]: device 0x7f0a1f84c2a0 has devpath '/devices/pci0000:00/0000:00:1f.2/ata5/host4/target4:0:0/4:0:0:0/block/sdd/sdd1'
[Thu Jun 11 00:00:07 2015] systemd-udevd[2985]: device 0x7f0a1f84c2a0 filled with db file data
[Thu Jun 11 00:00:07 2015] systemd-udevd[2985]: found 'b8:17' claiming '/run/udev/links/\x2fdisk\x2fby-partlabel\x2fLinux\x5cx20filesystem'
[Thu Jun 11 00:00:07 2015] systemd-udevd[2985]: device 0x7f0a1f84c2a0 has devpath '/devices/pci0000:00/0000:00:1f.2/ata3/host2/target2:0:0/2:0:0:0/block/sdb/sdb1'
[Thu Jun 11 00:00:07 2015] systemd-udevd[2985]: device 0x7f0a1f84c2a0 filled with db file data
[Thu Jun 11 00:00:07 2015] systemd-udevd[2985]: found 'b8:33' claiming '/run/udev/links/\x2fdisk\x2fby-partlabel\x2fLinux\x5cx20filesystem'
[Thu Jun 11 00:00:07 2015] systemd-udevd[2985]: found 'b8:65' claiming '/run/udev/links/\x2fdisk\x2fby-partlabel\x2fLinux\x5cx20filesystem'
[Thu Jun 11 00:00:07 2015] systemd-udevd[2985]: device 0x7f0a1f84c2a0 has devpath '/devices/pci0000:00/0000:00:1f.2/ata6/host5/target5:0:0/5:0:0:0/block/sde/sde1'
[Thu Jun 11 00:00:07 2015] systemd-udevd[2985]: device 0x7f0a1f84c2a0 filled with db file data
[Thu Jun 11 00:00:07 2015] systemd-udevd[2985]: creating link '/dev/disk/by-partlabel/Linux\x20filesystem' to '/dev/sdc1'
[Thu Jun 11 00:00:07 2015] systemd-udevd[2985]: atomically replace '/dev/disk/by-partlabel/Linux\x20filesystem'
[Thu Jun 11 00:00:07 2015] systemd-udevd[2985]: found 'b8:33' claiming '/run/udev/links/\x2fdisk\x2fby-partuuid\x2f65d3b1d8-3ec0-4d3b-8b24-ff57258a43ab'
[Thu Jun 11 00:00:07 2015] systemd-udevd[2985]: creating link '/dev/disk/by-partuuid/65d3b1d8-3ec0-4d3b-8b24-ff57258a43ab' to '/dev/sdc1'
[Thu Jun 11 00:00:07 2015] systemd-udevd[2985]: preserve already existing symlink '/dev/disk/by-partuuid/65d3b1d8-3ec0-4d3b-8b24-ff57258a43ab' to '../../sdc1'
[Thu Jun 11 00:00:07 2015] systemd-udevd[2985]: created db file '/run/udev/data/b8:33' for '/devices/pci0000:00/0000:00:1f.2/ata4/host3/target3:0:0/3:0:0:0/block/sdc/sdc1'
[Thu Jun 11 00:00:07 2015] systemd-udevd[2985]: adding watch on '/dev/sdc1'
[Thu Jun 11 00:00:07 2015] systemd-udevd[2985]: created db file '/run/udev/data/b8:33' for '/devices/pci0000:00/0000:00:1f.2/ata4/host3/target3:0:0/3:0:0:0/block/sdc/sdc1'
[Thu Jun 11 00:00:07 2015] systemd-udevd[2985]: passed -1 bytes to netlink monitor 0x7f0a1f86ec50
[Thu Jun 11 00:00:07 2015] systemd-udevd[2985]: seq 2207 processed with 0
[Thu Jun 11 00:00:07 2015] systemd-udevd[2985]: unload module index
[Thu Jun 11 00:00:07 2015] systemd-udevd[2985]: Unloaded link configuration context.
[Thu Jun 11 00:00:07 2015] systemd-udevd[3003]: LINK 'disk/by-uuid/b863dbb8-e81e-4e9d-8949-0174ce55495e' /lib64/udev/rules.d/60-persistent-storage.rules:76
[Thu Jun 11 00:00:07 2015] systemd-udevd[3003]: LINK 'disk/by-partuuid/23635cf3-f67e-4330-a471-4ad165e23b15' /lib64/udev/rules.d/60-persistent-storage.rules:84
[Thu Jun 11 00:00:07 2015] systemd-udevd[3003]: LINK 'disk/by-partlabel/boot' /lib64/udev/rules.d/60-persistent-storage.rules:85
[Thu Jun 11 00:00:07 2015] systemd-udevd[3003]: handling device node '/dev/sda2', devnum=b8:2, mode=0660, uid=0, gid=6
[Thu Jun 11 00:00:07 2015] systemd-udevd[3003]: set permissions /dev/sda2, 060660, uid=0, gid=6
[Thu Jun 11 00:00:07 2015] systemd-udevd[3003]: preserve already existing symlink '/dev/block/8:2' to '../sda2'
[Thu Jun 11 00:00:07 2015] systemd-udevd[3003]: found 'b8:2' claiming '/run/udev/links/\x2fdisk\x2fby-id\x2fata-TS256GSSD720_49982012030714570011-part2'
[Thu Jun 11 00:00:07 2015] systemd-udevd[3003]: creating link '/dev/disk/by-id/ata-TS256GSSD720_49982012030714570011-part2' to '/dev/sda2'
[Thu Jun 11 00:00:07 2015] systemd-udevd[3003]: preserve already existing symlink '/dev/disk/by-id/ata-TS256GSSD720_49982012030714570011-part2' to '../../sda2'
[Thu Jun 11 00:00:07 2015] systemd-udevd[3003]: found 'b8:2' claiming '/run/udev/links/\x2fdisk\x2fby-partlabel\x2fboot'
[Thu Jun 11 00:00:07 2015] systemd-udevd[3003]: creating link '/dev/disk/by-partlabel/boot' to '/dev/sda2'
[Thu Jun 11 00:00:07 2015] systemd-udevd[3003]: preserve already existing symlink '/dev/disk/by-partlabel/boot' to '../../sda2'
[Thu Jun 11 00:00:07 2015] systemd-udevd[3003]: found 'b8:2' claiming '/run/udev/links/\x2fdisk\x2fby-partuuid\x2f23635cf3-f67e-4330-a471-4ad165e23b15'
[Thu Jun 11 00:00:07 2015] systemd-udevd[3003]: creating link '/dev/disk/by-partuuid/23635cf3-f67e-4330-a471-4ad165e23b15' to '/dev/sda2'
[Thu Jun 11 00:00:07 2015] systemd-udevd[3003]: preserve already existing symlink '/dev/disk/by-partuuid/23635cf3-f67e-4330-a471-4ad165e23b15' to '../../sda2'
[Thu Jun 11 00:00:07 2015] systemd-udevd[3003]: found 'b8:2' claiming '/run/udev/links/\x2fdisk\x2fby-uuid\x2fb863dbb8-e81e-4e9d-8949-0174ce55495e'
[Thu Jun 11 00:00:07 2015] systemd-udevd[3003]: creating link '/dev/disk/by-uuid/b863dbb8-e81e-4e9d-8949-0174ce55495e' to '/dev/sda2'
[Thu Jun 11 00:00:07 2015] systemd-udevd[3003]: preserve already existing symlink '/dev/disk/by-uuid/b863dbb8-e81e-4e9d-8949-0174ce55495e' to '../../sda2'
[Thu Jun 11 00:00:07 2015] systemd-udevd[3003]: created db file '/run/udev/data/b8:2' for '/devices/pci0000:00/0000:00:1f.2/ata1/host0/target0:0:0/0:0:0:0/block/sda/sda2'
[Thu Jun 11 00:00:07 2015] systemd-udevd[3003]: adding watch on '/dev/sda2'
[Thu Jun 11 00:00:07 2015] systemd-udevd[3003]: created db file '/run/udev/data/b8:2' for '/devices/pci0000:00/0000:00:1f.2/ata1/host0/target0:0:0/0:0:0:0/block/sda/sda2'
[Thu Jun 11 00:00:07 2015] systemd-udevd[3003]: passed -1 bytes to netlink monitor 0x7f0a1f953df0
[Thu Jun 11 00:00:07 2015] systemd-udevd[3003]: seq 2174 processed with 0
[Thu Jun 11 00:00:07 2015] systemd-udevd[3003]: unload module index
[Thu Jun 11 00:00:07 2015] systemd-udevd[3003]: Unloaded link configuration context.
[Thu Jun 11 00:00:07 2015] systemd-udevd[2991]: '/bin/sh -c '/sbin/mdadm --examine --export /dev/sde1 | /bin/sed s/^MD_/UDISKS_MD_MEMBER_/g''(out) 'UDISKS_MD_MEMBER_LEVEL=raid6'
[Thu Jun 11 00:00:07 2015] systemd-udevd[2991]: '/bin/sh -c '/sbin/mdadm --examine --export /dev/sde1 | /bin/sed s/^MD_/UDISKS_MD_MEMBER_/g''(out) 'UDISKS_MD_MEMBER_DEVICES=6'
[Thu Jun 11 00:00:07 2015] systemd-udevd[2991]: '/bin/sh -c '/sbin/mdadm --examine --export /dev/sde1 | /bin/sed s/^MD_/UDISKS_MD_MEMBER_/g''(out) 'UDISKS_MD_MEMBER_NAME=hadean:0'
[Thu Jun 11 00:00:07 2015] systemd-udevd[2991]: '/bin/sh -c '/sbin/mdadm --examine --export /dev/sde1 | /bin/sed s/^MD_/UDISKS_MD_MEMBER_/g''(out) 'UDISKS_MD_MEMBER_ARRAY_SIZE=24004.16GB'
[Thu Jun 11 00:00:07 2015] systemd-udevd[2991]: '/bin/sh -c '/sbin/mdadm --examine --export /dev/sde1 | /bin/sed s/^MD_/UDISKS_MD_MEMBER_/g''(out) 'UDISKS_MD_MEMBER_UUID=9dd19957:01e05b7d:0d133efd:e0ec565d'
[Thu Jun 11 00:00:07 2015] systemd-udevd[2991]: '/bin/sh -c '/sbin/mdadm --examine --export /dev/sde1 | /bin/sed s/^MD_/UDISKS_MD_MEMBER_/g''(out) 'UDISKS_MD_MEMBER_UPDATE_TIME=1433973531'
[Thu Jun 11 00:00:07 2015] systemd-udevd[2991]: '/bin/sh -c '/sbin/mdadm --examine --export /dev/sde1 | /bin/sed s/^MD_/UDISKS_MD_MEMBER_/g''(out) 'UDISKS_MD_MEMBER_DEV_UUID=fa61e3c7:548e7442:922bc80b:a0f278b2'
[Thu Jun 11 00:00:07 2015] systemd-udevd[2991]: '/bin/sh -c '/sbin/mdadm --examine --export /dev/sde1 | /bin/sed s/^MD_/UDISKS_MD_MEMBER_/g''(out) 'UDISKS_MD_MEMBER_EVENTS=21853'
[Thu Jun 11 00:00:07 2015] systemd-udevd[3002]: LINK 'disk/by-uuid/48e41332-7d3e-490c-861c-1b47b238f05d' /lib64/udev/rules.d/60-persistent-storage.rules:76
[Thu Jun 11 00:00:07 2015] systemd-udevd[3002]: LINK 'disk/by-partuuid/115e95af-c022-4403-adf4-d1c2d01dc8ef' /lib64/udev/rules.d/60-persistent-storage.rules:84
[Thu Jun 11 00:00:07 2015] systemd-udevd[3002]: LINK 'disk/by-partlabel/swap' /lib64/udev/rules.d/60-persistent-storage.rules:85
[Thu Jun 11 00:00:07 2015] systemd-udevd[2991]: '/bin/sh -c '/sbin/mdadm --examine --export /dev/sde1 | /bin/sed s/^MD_/UDISKS_MD_MEMBER_/g'' [3058] exit with return code 0
[Thu Jun 11 00:00:07 2015] systemd-udevd[2991]: handling device node '/dev/sde1', devnum=b8:65, mode=0660, uid=0, gid=6
[Thu Jun 11 00:00:07 2015] systemd-udevd[3002]: handling device node '/dev/sda3', devnum=b8:3, mode=0660, uid=0, gid=6
[Thu Jun 11 00:00:07 2015] systemd-udevd[2991]: set permissions /dev/sde1, 060660, uid=0, gid=6
[Thu Jun 11 00:00:07 2015] systemd-udevd[3002]: set permissions /dev/sda3, 060660, uid=0, gid=6
[Thu Jun 11 00:00:07 2015] systemd-udevd[2991]: preserve already existing symlink '/dev/block/8:65' to '../sde1'
[Thu Jun 11 00:00:07 2015] systemd-udevd[3002]: preserve already existing symlink '/dev/block/8:3' to '../sda3'
[Thu Jun 11 00:00:07 2015] systemd-udevd[2991]: found 'b8:65' claiming '/run/udev/links/\x2fdisk\x2fby-id\x2fata-WDC_WD60EFRX-68MYMN1_WD-WX11DC4FKLXA-part1'
[Thu Jun 11 00:00:07 2015] systemd-udevd[3002]: found 'b8:3' claiming '/run/udev/links/\x2fdisk\x2fby-id\x2fata-TS256GSSD720_49982012030714570011-part3'
[Thu Jun 11 00:00:07 2015] systemd-udevd[2991]: creating link '/dev/disk/by-id/ata-WDC_WD60EFRX-68MYMN1_WD-WX11DC4FKLXA-part1' to '/dev/sde1'
[Thu Jun 11 00:00:07 2015] systemd-udevd[3002]: creating link '/dev/disk/by-id/ata-TS256GSSD720_49982012030714570011-part3' to '/dev/sda3'
[Thu Jun 11 00:00:07 2015] systemd-udevd[2991]: preserve already existing symlink '/dev/disk/by-id/ata-WDC_WD60EFRX-68MYMN1_WD-WX11DC4FKLXA-part1' to '../../sde1'
[Thu Jun 11 00:00:07 2015] systemd-udevd[3002]: preserve already existing symlink '/dev/disk/by-id/ata-TS256GSSD720_49982012030714570011-part3' to '../../sda3'
[Thu Jun 11 00:00:07 2015] systemd-udevd[2991]: found 'b8:65' claiming '/run/udev/links/\x2fdisk\x2fby-id\x2fwwn-0x50014ee20b922602-part1'
[Thu Jun 11 00:00:07 2015] systemd-udevd[3002]: found 'b8:3' claiming '/run/udev/links/\x2fdisk\x2fby-partlabel\x2fswap'
[Thu Jun 11 00:00:07 2015] systemd-udevd[2991]: creating link '/dev/disk/by-id/wwn-0x50014ee20b922602-part1' to '/dev/sde1'
[Thu Jun 11 00:00:07 2015] systemd-udevd[3002]: creating link '/dev/disk/by-partlabel/swap' to '/dev/sda3'
[Thu Jun 11 00:00:07 2015] systemd-udevd[2991]: preserve already existing symlink '/dev/disk/by-id/wwn-0x50014ee20b922602-part1' to '../../sde1'
[Thu Jun 11 00:00:07 2015] systemd-udevd[3002]: preserve already existing symlink '/dev/disk/by-partlabel/swap' to '../../sda3'
[Thu Jun 11 00:00:07 2015] systemd-udevd[2991]: found 'b8:81' claiming '/run/udev/links/\x2fdisk\x2fby-partlabel\x2fLinux\x5cx20filesystem'
[Thu Jun 11 00:00:07 2015] systemd-udevd[3002]: found 'b8:3' claiming '/run/udev/links/\x2fdisk\x2fby-partuuid\x2f115e95af-c022-4403-adf4-d1c2d01dc8ef'
[Thu Jun 11 00:00:07 2015] systemd-udevd[3002]: creating link '/dev/disk/by-partuuid/115e95af-c022-4403-adf4-d1c2d01dc8ef' to '/dev/sda3'
[Thu Jun 11 00:00:07 2015] systemd-udevd[3002]: preserve already existing symlink '/dev/disk/by-partuuid/115e95af-c022-4403-adf4-d1c2d01dc8ef' to '../../sda3'
[Thu Jun 11 00:00:07 2015] systemd-udevd[3002]: found 'b8:3' claiming '/run/udev/links/\x2fdisk\x2fby-uuid\x2f48e41332-7d3e-490c-861c-1b47b238f05d'
[Thu Jun 11 00:00:07 2015] systemd-udevd[2991]: device 0x7f0a1f84d5c0 has devpath '/devices/pci0000:00/0000:00:1c.3/0000:03:00.0/0000:04:07.0/0000:08:00.0/ata7/host6/target6:0:0/6:0:0:0/block/sdf/sdf1'
[Thu Jun 11 00:00:07 2015] systemd-udevd[3002]: creating link '/dev/disk/by-uuid/48e41332-7d3e-490c-861c-1b47b238f05d' to '/dev/sda3'
[Thu Jun 11 00:00:07 2015] systemd-udevd[3002]: preserve already existing symlink '/dev/disk/by-uuid/48e41332-7d3e-490c-861c-1b47b238f05d' to '../../sda3'
[Thu Jun 11 00:00:07 2015] systemd-udevd[3002]: created db file '/run/udev/data/b8:3' for '/devices/pci0000:00/0000:00:1f.2/ata1/host0/target0:0:0/0:0:0:0/block/sda/sda3'
[Thu Jun 11 00:00:07 2015] systemd-udevd[3002]: adding watch on '/dev/sda3'
[Thu Jun 11 00:00:07 2015] systemd-udevd[2991]: device 0x7f0a1f84d5c0 filled with db file data
[Thu Jun 11 00:00:07 2015] systemd-udevd[2991]: found 'b8:97' claiming '/run/udev/links/\x2fdisk\x2fby-partlabel\x2fLinux\x5cx20filesystem'
[Thu Jun 11 00:00:07 2015] systemd-udevd[2991]: device 0x7f0a1f84d5c0 has devpath '/devices/pci0000:00/0000:00:1c.3/0000:03:00.0/0000:04:07.0/0000:08:00.0/ata8/host7/target7:0:0/7:0:0:0/block/sdg/sdg1'
[Thu Jun 11 00:00:07 2015] systemd-udevd[3002]: created db file '/run/udev/data/b8:3' for '/devices/pci0000:00/0000:00:1f.2/ata1/host0/target0:0:0/0:0:0:0/block/sda/sda3'
[Thu Jun 11 00:00:07 2015] systemd-udevd[3002]: passed -1 bytes to netlink monitor 0x7f0a1f953be0
[Thu Jun 11 00:00:07 2015] systemd-udevd[3002]: seq 2175 processed with 0
[Thu Jun 11 00:00:07 2015] systemd-udevd[2991]: device 0x7f0a1f84d5c0 filled with db file data
[Thu Jun 11 00:00:07 2015] systemd-udevd[2991]: found 'b8:49' claiming '/run/udev/links/\x2fdisk\x2fby-partlabel\x2fLinux\x5cx20filesystem'
[Thu Jun 11 00:00:07 2015] systemd-udevd[2991]: device 0x7f0a1f84d5c0 has devpath '/devices/pci0000:00/0000:00:1f.2/ata5/host4/target4:0:0/4:0:0:0/block/sdd/sdd1'
[Thu Jun 11 00:00:07 2015] systemd-udevd[3002]: unload module index
[Thu Jun 11 00:00:07 2015] systemd-udevd[3002]: Unloaded link configuration context.
[Thu Jun 11 00:00:07 2015] systemd-udevd[2991]: device 0x7f0a1f84d5c0 filled with db file data
[Thu Jun 11 00:00:07 2015] systemd-udevd[2991]: found 'b8:17' claiming '/run/udev/links/\x2fdisk\x2fby-partlabel\x2fLinux\x5cx20filesystem'
[Thu Jun 11 00:00:07 2015] systemd-udevd[2991]: device 0x7f0a1f84d5c0 has devpath '/devices/pci0000:00/0000:00:1f.2/ata3/host2/target2:0:0/2:0:0:0/block/sdb/sdb1'
[Thu Jun 11 00:00:07 2015] systemd-udevd[2991]: device 0x7f0a1f84d5c0 filled with db file data
[Thu Jun 11 00:00:07 2015] systemd-udevd[2991]: found 'b8:33' claiming '/run/udev/links/\x2fdisk\x2fby-partlabel\x2fLinux\x5cx20filesystem'
[Thu Jun 11 00:00:07 2015] systemd-udevd[2991]: device 0x7f0a1f84d5c0 has devpath '/devices/pci0000:00/0000:00:1f.2/ata4/host3/target3:0:0/3:0:0:0/block/sdc/sdc1'
[Thu Jun 11 00:00:07 2015] systemd-udevd[2991]: device 0x7f0a1f84d5c0 filled with db file data
[Thu Jun 11 00:00:07 2015] systemd-udevd[2991]: found 'b8:65' claiming '/run/udev/links/\x2fdisk\x2fby-partlabel\x2fLinux\x5cx20filesystem'
[Thu Jun 11 00:00:07 2015] systemd-udevd[2987]: LINK 'disk/by-uuid/5DCB-90C9' /lib64/udev/rules.d/60-persistent-storage.rules:76
[Thu Jun 11 00:00:07 2015] systemd-udevd[2991]: creating link '/dev/disk/by-partlabel/Linux\x20filesystem' to '/dev/sde1'
[Thu Jun 11 00:00:07 2015] systemd-udevd[2991]: atomically replace '/dev/disk/by-partlabel/Linux\x20filesystem'
[Thu Jun 11 00:00:07 2015] systemd-udevd[2987]: LINK 'disk/by-label/grub' /lib64/udev/rules.d/60-persistent-storage.rules:77
[Thu Jun 11 00:00:07 2015] systemd-udevd[2987]: LINK 'disk/by-partuuid/5e066ced-9ec2-4f45-8598-c40114c8859c' /lib64/udev/rules.d/60-persistent-storage.rules:84
[Thu Jun 11 00:00:07 2015] systemd-udevd[2987]: LINK 'disk/by-partlabel/grub' /lib64/udev/rules.d/60-persistent-storage.rules:85
[Thu Jun 11 00:00:07 2015] systemd-udevd[2991]: found 'b8:65' claiming '/run/udev/links/\x2fdisk\x2fby-partuuid\x2f7d5dda7b-a9e1-497e-99ad-4c3c92a3568b'
[Thu Jun 11 00:00:07 2015] systemd-udevd[2991]: creating link '/dev/disk/by-partuuid/7d5dda7b-a9e1-497e-99ad-4c3c92a3568b' to '/dev/sde1'
[Thu Jun 11 00:00:07 2015] systemd-udevd[2991]: preserve already existing symlink '/dev/disk/by-partuuid/7d5dda7b-a9e1-497e-99ad-4c3c92a3568b' to '../../sde1'
[Thu Jun 11 00:00:07 2015] systemd-udevd[2991]: created db file '/run/udev/data/b8:65' for '/devices/pci0000:00/0000:00:1f.2/ata6/host5/target5:0:0/5:0:0:0/block/sde/sde1'
[Thu Jun 11 00:00:07 2015] systemd-udevd[2991]: adding watch on '/dev/sde1'
[Thu Jun 11 00:00:07 2015] systemd-udevd[2987]: handling device node '/dev/sda1', devnum=b8:1, mode=0660, uid=0, gid=6
[Thu Jun 11 00:00:07 2015] systemd-udevd[2987]: set permissions /dev/sda1, 060660, uid=0, gid=6
[Thu Jun 11 00:00:07 2015] systemd-udevd[2991]: created db file '/run/udev/data/b8:65' for '/devices/pci0000:00/0000:00:1f.2/ata6/host5/target5:0:0/5:0:0:0/block/sde/sde1'
[Thu Jun 11 00:00:07 2015] systemd-udevd[2987]: preserve already existing symlink '/dev/block/8:1' to '../sda1'
[Thu Jun 11 00:00:07 2015] systemd-udevd[2987]: found 'b8:1' claiming '/run/udev/links/\x2fdisk\x2fby-id\x2fata-TS256GSSD720_49982012030714570011-part1'
[Thu Jun 11 00:00:07 2015] systemd-udevd[2987]: creating link '/dev/disk/by-id/ata-TS256GSSD720_49982012030714570011-part1' to '/dev/sda1'
[Thu Jun 11 00:00:07 2015] systemd-udevd[2991]: passed -1 bytes to netlink monitor 0x7f0a1f869530
[Thu Jun 11 00:00:07 2015] systemd-udevd[2991]: seq 2233 processed with 0
[Thu Jun 11 00:00:07 2015] systemd-udevd[2987]: preserve already existing symlink '/dev/disk/by-id/ata-TS256GSSD720_49982012030714570011-part1' to '../../sda1'
[Thu Jun 11 00:00:07 2015] systemd-udevd[2987]: found 'b8:1' claiming '/run/udev/links/\x2fdisk\x2fby-label\x2fgrub'
[Thu Jun 11 00:00:07 2015] systemd-udevd[2987]: creating link '/dev/disk/by-label/grub' to '/dev/sda1'
[Thu Jun 11 00:00:07 2015] systemd-udevd[2987]: preserve already existing symlink '/dev/disk/by-label/grub' to '../../sda1'
[Thu Jun 11 00:00:07 2015] systemd-udevd[2987]: found 'b8:1' claiming '/run/udev/links/\x2fdisk\x2fby-partlabel\x2fgrub'
[Thu Jun 11 00:00:07 2015] systemd-udevd[2987]: creating link '/dev/disk/by-partlabel/grub' to '/dev/sda1'
[Thu Jun 11 00:00:07 2015] systemd-udevd[2987]: preserve already existing symlink '/dev/disk/by-partlabel/grub' to '../../sda1'
[Thu Jun 11 00:00:07 2015] systemd-udevd[2987]: found 'b8:1' claiming '/run/udev/links/\x2fdisk\x2fby-partuuid\x2f5e066ced-9ec2-4f45-8598-c40114c8859c'
[Thu Jun 11 00:00:07 2015] systemd-udevd[2991]: unload module index
[Thu Jun 11 00:00:07 2015] systemd-udevd[2987]: creating link '/dev/disk/by-partuuid/5e066ced-9ec2-4f45-8598-c40114c8859c' to '/dev/sda1'
[Thu Jun 11 00:00:07 2015] systemd-udevd[2987]: preserve already existing symlink '/dev/disk/by-partuuid/5e066ced-9ec2-4f45-8598-c40114c8859c' to '../../sda1'
[Thu Jun 11 00:00:07 2015] systemd-udevd[2987]: found 'b8:1' claiming '/run/udev/links/\x2fdisk\x2fby-uuid\x2f5DCB-90C9'
[Thu Jun 11 00:00:07 2015] systemd-udevd[2991]: Unloaded link configuration context.
[Thu Jun 11 00:00:07 2015] systemd-udevd[2987]: creating link '/dev/disk/by-uuid/5DCB-90C9' to '/dev/sda1'
[Thu Jun 11 00:00:07 2015] systemd-udevd[2987]: preserve already existing symlink '/dev/disk/by-uuid/5DCB-90C9' to '../../sda1'
[Thu Jun 11 00:00:07 2015] systemd-udevd[2987]: created db file '/run/udev/data/b8:1' for '/devices/pci0000:00/0000:00:1f.2/ata1/host0/target0:0:0/0:0:0:0/block/sda/sda1'
[Thu Jun 11 00:00:07 2015] systemd-udevd[2987]: adding watch on '/dev/sda1'
[Thu Jun 11 00:00:07 2015] systemd-udevd[2987]: created db file '/run/udev/data/b8:1' for '/devices/pci0000:00/0000:00:1f.2/ata1/host0/target0:0:0/0:0:0:0/block/sda/sda1'
[Thu Jun 11 00:00:07 2015] systemd-udevd[2987]: passed -1 bytes to netlink monitor 0x7f0a1f8531d0
[Thu Jun 11 00:00:07 2015] systemd-udevd[2987]: seq 2173 processed with 0
[Thu Jun 11 00:00:07 2015] systemd-udevd[2987]: unload module index
[Thu Jun 11 00:00:07 2015] systemd-udevd[2987]: Unloaded link configuration context.
[Thu Jun 11 00:00:08 2015] usb 3-4: new high-speed USB device number 2 using xhci_hcd
[Thu Jun 11 00:00:08 2015] usb 3-4: New USB device found, idVendor=045e, idProduct=075d
[Thu Jun 11 00:00:08 2015] usb 3-4: New USB device strings: Mfr=1, Product=2, SerialNumber=0
[Thu Jun 11 00:00:08 2015] usb 3-4: Product: Microsoft® LifeCam Cinema(TM)
[Thu Jun 11 00:00:08 2015] usb 3-4: Manufacturer: Microsoft
[Thu Jun 11 00:00:08 2015] usb 3-5: new high-speed USB device number 3 using xhci_hcd
[Thu Jun 11 00:00:08 2015] usb 3-5: New USB device found, idVendor=0424, idProduct=2514
[Thu Jun 11 00:00:08 2015] usb 3-5: New USB device strings: Mfr=0, Product=0, SerialNumber=0
[Thu Jun 11 00:00:08 2015] hub 3-5:1.0: USB hub found
[Thu Jun 11 00:00:08 2015] hub 3-5:1.0: 4 ports detected
[Thu Jun 11 00:00:08 2015] usb 3-6: new high-speed USB device number 4 using xhci_hcd
[Thu Jun 11 00:00:08 2015] usb 3-6: New USB device found, idVendor=0424, idProduct=2514
[Thu Jun 11 00:00:08 2015] usb 3-6: New USB device strings: Mfr=0, Product=0, SerialNumber=0
[Thu Jun 11 00:00:08 2015] hub 3-6:1.0: USB hub found
[Thu Jun 11 00:00:08 2015] hub 3-6:1.0: 4 ports detected
[Thu Jun 11 00:00:09 2015] usb 3-6.3: new full-speed USB device number 5 using xhci_hcd
[Thu Jun 11 00:00:09 2015] usb 3-6.3: New USB device found, idVendor=045e, idProduct=0745
[Thu Jun 11 00:00:09 2015] usb 3-6.3: New USB device strings: Mfr=1, Product=2, SerialNumber=0
[Thu Jun 11 00:00:09 2015] usb 3-6.3: Product: Microsoft® 2.4GHz Transceiver v8.0
[Thu Jun 11 00:00:09 2015] usb 3-6.3: Manufacturer: Microsoft
[Thu Jun 11 00:00:09 2015] input: Microsoft Microsoft® 2.4GHz Transceiver v8.0 as /devices/pci0000:00/0000:00:14.0/usb3/3-6/3-6.3/3-6.3:1.0/0003:045E:0745.0001/input/input6
[Thu Jun 11 00:00:09 2015] hid-generic 0003:045E:0745.0001: input,hidraw0: USB HID v1.11 Keyboard [Microsoft Microsoft® 2.4GHz Transceiver v8.0] on usb-0000:00:14.0-6.3/input0
[Thu Jun 11 00:00:09 2015] input: Microsoft Microsoft® 2.4GHz Transceiver v8.0 as /devices/pci0000:00/0000:00:14.0/usb3/3-6/3-6.3/3-6.3:1.1/0003:045E:0745.0002/input/input7
[Thu Jun 11 00:00:09 2015] hid-generic 0003:045E:0745.0002: input,hidraw1: USB HID v1.11 Mouse [Microsoft Microsoft® 2.4GHz Transceiver v8.0] on usb-0000:00:14.0-6.3/input1
[Thu Jun 11 00:00:09 2015] input: Microsoft Microsoft® 2.4GHz Transceiver v8.0 as /devices/pci0000:00/0000:00:14.0/usb3/3-6/3-6.3/3-6.3:1.2/0003:045E:0745.0003/input/input8
[Thu Jun 11 00:00:09 2015] hid-generic 0003:045E:0745.0003: input,hiddev0,hidraw2: USB HID v1.11 Device [Microsoft Microsoft® 2.4GHz Transceiver v8.0] on usb-0000:00:14.0-6.3/input2
[Thu Jun 11 00:00:09 2015] usb 3-6.4: new low-speed USB device number 6 using xhci_hcd
[Thu Jun 11 00:00:09 2015] usb 3-6.4: New USB device found, idVendor=045e, idProduct=0797
[Thu Jun 11 00:00:09 2015] usb 3-6.4: New USB device strings: Mfr=0, Product=2, SerialNumber=0
[Thu Jun 11 00:00:09 2015] usb 3-6.4: Product: USB Optical Mouse
[Thu Jun 11 00:00:09 2015] usb 3-6.4: ep 0x81 - rounding interval to 64 microframes, ep desc says 80 microframes
[Thu Jun 11 00:00:09 2015] input: USB Optical Mouse as /devices/pci0000:00/0000:00:14.0/usb3/3-6/3-6.4/3-6.4:1.0/0003:045E:0797.0004/input/input9
[Thu Jun 11 00:00:09 2015] hid-generic 0003:045E:0797.0004: input,hidraw3: USB HID v1.11 Mouse [USB Optical Mouse] on usb-0000:00:14.0-6.4/input0
[Thu Jun 11 00:01:05 2015] md: array md0 already has disks!
[Thu Jun 11 00:01:05 2015] md: bind<sdg1>
[Thu Jun 11 00:01:05 2015] md: bind<sdf1>
[Thu Jun 11 00:01:05 2015] md/raid:md0: device sdf1 operational as raid disk 0
[Thu Jun 11 00:01:05 2015] md/raid:md0: device sdg1 operational as raid disk 4
[Thu Jun 11 00:01:05 2015] md/raid:md0: device sde1 operational as raid disk 3
[Thu Jun 11 00:01:05 2015] md/raid:md0: device sdc1 operational as raid disk 2
[Thu Jun 11 00:01:05 2015] md/raid:md0: device sdd1 operational as raid disk 5
[Thu Jun 11 00:01:05 2015] md/raid:md0: device sdb1 operational as raid disk 1
[Thu Jun 11 00:01:05 2015] md/raid:md0: allocated 0kB
[Thu Jun 11 00:01:05 2015] md/raid:md0: raid level 6 active with 6 out of 6 devices, algorithm 2
[Thu Jun 11 00:01:05 2015] RAID conf printout:
[Thu Jun 11 00:01:05 2015]  --- level:6 rd:6 wd:6
[Thu Jun 11 00:01:05 2015]  disk 0, o:1, dev:sdf1
[Thu Jun 11 00:01:05 2015]  disk 1, o:1, dev:sdb1
[Thu Jun 11 00:01:05 2015]  disk 2, o:1, dev:sdc1
[Thu Jun 11 00:01:05 2015]  disk 3, o:1, dev:sde1
[Thu Jun 11 00:01:05 2015]  disk 4, o:1, dev:sdg1
[Thu Jun 11 00:01:05 2015]  disk 5, o:1, dev:sdd1
[Thu Jun 11 00:01:05 2015] created bitmap (44 pages) for device md0
[Thu Jun 11 00:01:05 2015] md0: bitmap initialized from disk: read 3 pages, set 0 of 89423 bits
[Thu Jun 11 00:01:05 2015] md0: detected capacity change from 0 to 24004159078400
[Thu Jun 11 00:01:05 2015]  md0: unknown partition table
[Thu Jun 11 00:01:05 2015] EXT4-fs (sda4): re-mounted. Opts: (null)
[Thu Jun 11 00:01:05 2015] Adding 16777212k swap on /dev/sda3.  Priority:-1 extents:1 across:16777212k SS
[Thu Jun 11 00:01:05 2015] EXT4-fs (md0): mounted filesystem with ordered data mode. Opts: (null)
[Thu Jun 11 00:01:06 2015] NET: Registered protocol family 10
[Thu Jun 11 00:01:06 2015] Installing knfsd (copyright (C) 1996 okir@monad.swb.de).
[Thu Jun 11 00:01:06 2015] NFSD: Using /var/lib/nfs/v4recovery as the NFSv4 state recovery directory
[Thu Jun 11 00:01:06 2015] NFSD: starting 90-second grace period (net ffffffff818303c0)
