2015-06-07T14:20:43: PING 41.181.221.246 (41.181.221.246) 56(84) bytes of data.
2015-06-07T14:20:43: [1433679643.607674] 64 bytes from 41.181.221.246: icmp_seq=1 ttl=58 time=271 ms
2015-06-07T14:20:44: [1433679644.612349] 64 bytes from 41.181.221.246: icmp_seq=2 ttl=58 time=274 ms
2015-06-07T14:20:45: [1433679645.617490] 64 bytes from 41.181.221.246: icmp_seq=3 ttl=58 time=278 ms
2015-06-07T14:20:46: [1433679646.602174] 64 bytes from 41.181.221.246: icmp_seq=4 ttl=58 time=261 ms
2015-06-07T14:20:47: [1433679647.848192] 64 bytes from 41.181.221.246: icmp_seq=5 ttl=58 time=506 ms
2015-06-07T14:20:48: [1433679648.447926] 64 bytes from 41.181.221.246: icmp_seq=6 ttl=58 time=105 ms
2015-06-07T14:20:49: [1433679649.666171] 64 bytes from 41.181.221.246: icmp_seq=7 ttl=58 time=322 ms
2015-06-07T14:20:50: [1433679650.683682] 64 bytes from 41.181.221.246: icmp_seq=8 ttl=58 time=338 ms
2015-06-07T14:20:51: [1433679651.664326] 64 bytes from 41.181.221.246: icmp_seq=9 ttl=58 time=317 ms
2015-06-07T14:20:52: [1433679652.685094] 64 bytes from 41.181.221.246: icmp_seq=10 ttl=58 time=336 ms
2015-06-07T14:20:53: [1433679653.723513] 64 bytes from 41.181.221.246: icmp_seq=11 ttl=58 time=374 ms
2015-06-07T14:20:54: [1433679654.509754] 64 bytes from 41.181.221.246: icmp_seq=12 ttl=58 time=159 ms
2015-06-07T14:20:55: [1433679655.747270] 64 bytes from 41.181.221.246: icmp_seq=13 ttl=58 time=395 ms
2015-06-07T14:20:56: [1433679656.576548] 64 bytes from 41.181.221.246: icmp_seq=14 ttl=58 time=223 ms
2015-06-07T14:20:57: [1433679657.565818] 64 bytes from 41.181.221.246: icmp_seq=15 ttl=58 time=211 ms
2015-06-07T14:20:58: [1433679658.427646] 64 bytes from 41.181.221.246: icmp_seq=16 ttl=58 time=71.9 ms
2015-06-07T14:20:59: [1433679659.668420] 64 bytes from 41.181.221.246: icmp_seq=17 ttl=58 time=310 ms
2015-06-07T14:21:01: [1433679661.734587] 64 bytes from 41.181.221.246: icmp_seq=19 ttl=58 time=372 ms
2015-06-07T14:21:02: [1433679662.657965] 64 bytes from 41.181.221.246: icmp_seq=20 ttl=58 time=294 ms
2015-06-07T14:21:03: [1433679663.637515] 64 bytes from 41.181.221.246: icmp_seq=21 ttl=58 time=272 ms
2015-06-07T14:21:04: [1433679664.947296] 64 bytes from 41.181.221.246: icmp_seq=22 ttl=58 time=580 ms
2015-06-07T14:21:06: [1433679666.075943] 64 bytes from 41.181.221.246: icmp_seq=23 ttl=58 time=709 ms
2015-06-07T14:21:07: [1433679667.032156] 64 bytes from 41.181.221.246: icmp_seq=24 ttl=58 time=665 ms
2015-06-07T14:21:07: [1433679667.996983] 64 bytes from 41.181.221.246: icmp_seq=25 ttl=58 time=630 ms
2015-06-07T14:21:09: [1433679669.099249] 64 bytes from 41.181.221.246: icmp_seq=26 ttl=58 time=731 ms
2015-06-07T14:21:09: [1433679669.983744] 64 bytes from 41.181.221.246: icmp_seq=27 ttl=58 time=616 ms
2015-06-07T14:21:11: [1433679671.136785] 64 bytes from 41.181.221.246: icmp_seq=28 ttl=58 time=768 ms
2015-06-07T14:21:11: [1433679671.974990] 64 bytes from 41.181.221.246: icmp_seq=29 ttl=58 time=606 ms
2015-06-07T14:21:12: [1433679672.980396] 64 bytes from 41.181.221.246: icmp_seq=30 ttl=58 time=610 ms
2015-06-07T14:21:14: [1433679674.113114] 64 bytes from 41.181.221.246: icmp_seq=31 ttl=58 time=743 ms
2015-06-07T14:21:15: [1433679675.254717] 64 bytes from 41.181.221.246: icmp_seq=32 ttl=58 time=885 ms
2015-06-07T14:21:16: [1433679676.144984] 64 bytes from 41.181.221.246: icmp_seq=33 ttl=58 time=776 ms
2015-06-07T14:21:16: [1433679676.968735] 64 bytes from 41.181.221.246: icmp_seq=34 ttl=58 time=600 ms
2015-06-07T14:21:18: [1433679678.785672] 64 bytes from 41.181.221.246: icmp_seq=36 ttl=58 time=413 ms
2015-06-07T14:21:19: [1433679679.663167] 64 bytes from 41.181.221.246: icmp_seq=37 ttl=58 time=289 ms
2015-06-07T14:21:20: [1433679680.498659] 64 bytes from 41.181.221.246: icmp_seq=38 ttl=58 time=123 ms
2015-06-07T14:21:21: [1433679681.478011] 64 bytes from 41.181.221.246: icmp_seq=39 ttl=58 time=101 ms
2015-06-07T14:21:22: [1433679682.557675] 64 bytes from 41.181.221.246: icmp_seq=40 ttl=58 time=179 ms
2015-06-07T14:21:23: [1433679683.581028] 64 bytes from 41.181.221.246: icmp_seq=41 ttl=58 time=201 ms
2015-06-07T14:21:24: [1433679684.693508] 64 bytes from 41.181.221.246: icmp_seq=42 ttl=58 time=312 ms
2015-06-07T14:21:25: [1433679685.439766] 64 bytes from 41.181.221.246: icmp_seq=43 ttl=58 time=58.0 ms
2015-06-07T14:21:26: [1433679686.433640] 64 bytes from 41.181.221.246: icmp_seq=44 ttl=58 time=50.8 ms
2015-06-07T14:21:27: [1433679687.565274] 64 bytes from 41.181.221.246: icmp_seq=45 ttl=58 time=180 ms
2015-06-07T14:21:28: [1433679688.967675] 64 bytes from 41.181.221.246: icmp_seq=46 ttl=58 time=581 ms
2015-06-07T14:21:29: [1433679689.663114] 64 bytes from 41.181.221.246: icmp_seq=47 ttl=58 time=275 ms
2015-06-07T14:21:30: [1433679690.843119] 64 bytes from 41.181.221.246: icmp_seq=48 ttl=58 time=454 ms
2015-06-07T14:21:31: [1433679691.515245] 64 bytes from 41.181.221.246: icmp_seq=49 ttl=58 time=125 ms
2015-06-07T14:21:32: [1433679692.721977] 64 bytes from 41.181.221.246: icmp_seq=50 ttl=58 time=330 ms
2015-06-07T14:21:33: [1433679693.798059] 64 bytes from 41.181.221.246: icmp_seq=51 ttl=58 time=405 ms
2015-06-07T14:21:34: [1433679694.861505] 64 bytes from 41.181.221.246: icmp_seq=52 ttl=58 time=467 ms
2015-06-07T14:21:36: [1433679696.163703] 64 bytes from 41.181.221.246: icmp_seq=53 ttl=58 time=768 ms
2015-06-07T14:21:37: [1433679697.173926] 64 bytes from 41.181.221.246: icmp_seq=54 ttl=58 time=778 ms
2015-06-07T14:21:38: [1433679698.116646] 64 bytes from 41.181.221.246: icmp_seq=55 ttl=58 time=721 ms
2015-06-07T14:21:39: [1433679699.054412] 64 bytes from 41.181.221.246: icmp_seq=56 ttl=58 time=659 ms
2015-06-07T14:21:39: [1433679699.829233] 64 bytes from 41.181.221.246: icmp_seq=57 ttl=58 time=434 ms
2015-06-07T14:21:40: [1433679700.659345] 64 bytes from 41.181.221.246: icmp_seq=58 ttl=58 time=263 ms
2015-06-07T14:21:41: [1433679701.804190] 64 bytes from 41.181.221.246: icmp_seq=59 ttl=58 time=407 ms
2015-06-07T14:21:42: [1433679702.817539] 64 bytes from 41.181.221.246: icmp_seq=60 ttl=58 time=419 ms
2015-06-07T14:21:44: [1433679704.044022] 64 bytes from 41.181.221.246: icmp_seq=61 ttl=58 time=644 ms
2015-06-07T14:21:44: [1433679704.769016] 64 bytes from 41.181.221.246: icmp_seq=62 ttl=58 time=369 ms
2015-06-07T14:21:45: [1433679705.697171] 64 bytes from 41.181.221.246: icmp_seq=63 ttl=58 time=296 ms
2015-06-07T14:21:46: [1433679706.639085] 64 bytes from 41.181.221.246: icmp_seq=64 ttl=58 time=237 ms
2015-06-07T14:21:47: [1433679707.473221] 64 bytes from 41.181.221.246: icmp_seq=65 ttl=58 time=70.3 ms
2015-06-07T14:21:48: [1433679708.744216] 64 bytes from 41.181.221.246: icmp_seq=66 ttl=58 time=339 ms
2015-06-07T14:21:49: [1433679709.472017] 64 bytes from 41.181.221.246: icmp_seq=67 ttl=58 time=66.9 ms
2015-06-07T14:21:50: [1433679710.426670] 64 bytes from 41.181.221.246: icmp_seq=68 ttl=58 time=20.6 ms
2015-06-07T14:21:51: [1433679711.542518] 64 bytes from 41.181.221.246: icmp_seq=69 ttl=58 time=134 ms
2015-06-07T14:21:52: [1433679712.673657] 64 bytes from 41.181.221.246: icmp_seq=70 ttl=58 time=264 ms
2015-06-07T14:21:53: [1433679713.456824] 64 bytes from 41.181.221.246: icmp_seq=71 ttl=58 time=46.3 ms
2015-06-07T14:21:54: [1433679714.496868] 64 bytes from 41.181.221.246: icmp_seq=72 ttl=58 time=85.1 ms
2015-06-07T14:21:55: [1433679715.635630] 64 bytes from 41.181.221.246: icmp_seq=73 ttl=58 time=222 ms
2015-06-07T14:21:56: [1433679716.421716] 64 bytes from 41.181.221.246: icmp_seq=74 ttl=58 time=7.26 ms
2015-06-07T14:21:57: [1433679717.723662] 64 bytes from 41.181.221.246: icmp_seq=75 ttl=58 time=307 ms
2015-06-07T14:21:58: [1433679718.590665] 64 bytes from 41.181.221.246: icmp_seq=76 ttl=58 time=173 ms
2015-06-07T14:21:59: [1433679719.429015] 64 bytes from 41.181.221.246: icmp_seq=77 ttl=58 time=10.4 ms
2015-06-07T14:22:00: [1433679720.796397] 64 bytes from 41.181.221.246: icmp_seq=78 ttl=58 time=376 ms
2015-06-07T14:22:01: [1433679721.565426] 64 bytes from 41.181.221.246: icmp_seq=79 ttl=58 time=144 ms
2015-06-07T14:22:02: [1433679722.429412] 64 bytes from 41.181.221.246: icmp_seq=80 ttl=58 time=7.72 ms
2015-06-07T14:22:03: [1433679723.714774] 64 bytes from 41.181.221.246: icmp_seq=81 ttl=58 time=291 ms
2015-06-07T14:22:04: [1433679724.601281] 64 bytes from 41.181.221.246: icmp_seq=82 ttl=58 time=176 ms
2015-06-07T14:22:06: [1433679726.494247] 64 bytes from 41.181.221.246: icmp_seq=84 ttl=58 time=62.4 ms
2015-06-07T14:22:07: [1433679727.595287] 64 bytes from 41.181.221.246: icmp_seq=85 ttl=58 time=162 ms
2015-06-07T14:22:08: [1433679728.711172] 64 bytes from 41.181.221.246: icmp_seq=86 ttl=58 time=276 ms
2015-06-07T14:22:09: [1433679729.727744] 64 bytes from 41.181.221.246: icmp_seq=87 ttl=58 time=292 ms
2015-06-07T14:22:10: [1433679730.587975] 64 bytes from 41.181.221.246: icmp_seq=88 ttl=58 time=151 ms
2015-06-07T14:22:11: [1433679731.566319] 64 bytes from 41.181.221.246: icmp_seq=89 ttl=58 time=128 ms
2015-06-07T14:22:12: [1433679732.654647] 64 bytes from 41.181.221.246: icmp_seq=90 ttl=58 time=215 ms
2015-06-07T14:22:13: [1433679733.713591] 64 bytes from 41.181.221.246: icmp_seq=91 ttl=58 time=273 ms
2015-06-07T14:22:14: [1433679734.539371] 64 bytes from 41.181.221.246: icmp_seq=92 ttl=58 time=97.9 ms
2015-06-07T14:22:15: [1433679735.811999] 64 bytes from 41.181.221.246: icmp_seq=93 ttl=58 time=369 ms
2015-06-07T14:22:16: [1433679736.840839] 64 bytes from 41.181.221.246: icmp_seq=94 ttl=58 time=397 ms
2015-06-07T14:22:17: [1433679737.848763] 64 bytes from 41.181.221.246: icmp_seq=95 ttl=58 time=404 ms
2015-06-07T14:22:18: [1433679738.665002] 64 bytes from 41.181.221.246: icmp_seq=96 ttl=58 time=219 ms
2015-06-07T14:22:19: [1433679739.494857] 64 bytes from 41.181.221.246: icmp_seq=97 ttl=58 time=47.9 ms
2015-06-07T14:22:20: [1433679740.576980] 64 bytes from 41.181.221.246: icmp_seq=98 ttl=58 time=129 ms
2015-06-07T14:22:21: [1433679741.535620] 64 bytes from 41.181.221.246: icmp_seq=99 ttl=58 time=86.6 ms
2015-06-07T14:22:22: [1433679742.647962] 64 bytes from 41.181.221.246: icmp_seq=100 ttl=58 time=197 ms
2015-06-07T14:22:24: 
2015-06-07T14:22:24: --- 41.181.221.246 ping statistics ---
2015-06-07T14:22:24: 100 packets transmitted, 97 received, 3% packet loss, time 99114ms
2015-06-07T14:22:24: rtt min/avg/max/mdev = 7.260/324.125/885.276/216.105 ms
