traceroute to 8.8.8.8 (8.8.8.8), 30 hops max, 60 byte packets
 1  105-236-12-193-esr-lo.mtnbusiness.co.za (105.236.12.193)  68.641 ms  70.823 ms  73.586 ms
 2  41.181.221.246 (41.181.221.246)  76.974 ms  79.168 ms  81.642 ms
 3  qux-jh-dca-2.za-b.za.mtnbusiness.net (41.181.165.115)  86.817 ms  89.002 ms  90.739 ms
 4  jh-dca-2.za--qux-q.za.mtnbusiness.net (196.31.180.4)  93.406 ms  95.851 ms jh-dca-2.za--qux-b.za.mtnbusiness.net (41.181.165.114)  97.088 ms
 5  41.181.180.10 (41.181.180.10)  125.193 ms jh-cr-2.za--jh-dca-2.za-a.mtnns.net (196.44.0.224)  106.943 ms 41.181.180.10 (41.181.180.10)  129.331 ms
 6  rb-cr-1.za--jh-cr-2.za-a.mtnns.net (196.44.31.94)  116.011 ms  8.754 ms  8.532 ms
 7  41.181.139.99 (41.181.139.99)  45.240 ms 41.181.139.109 (41.181.139.109)  45.425 ms  45.407 ms
 8  72.14.194.74 (72.14.194.74)  33.418 ms  35.058 ms  38.269 ms
 9  72.14.239.33 (72.14.239.33)  27.196 ms  29.129 ms  31.094 ms
10  google-public-dns-a.google.com (8.8.8.8)  55.491 ms  58.215 ms  60.385 ms
