[0:0:0:0]    disk    ATA      TOSHIBA MQ01ABD1 AX00  /dev/sda [8:0]  -  /dev/sg0 [21:0]  1.00TB
  state=running queue_depth=31 scsi_level=6 type=0 device_blocked=0 timeout=30
[1:0:0:0]    disk    ATA      TOSHIBA MQ01ABD1 AX00  /dev/sdb [8:16]  -  /dev/sg1 [21:1]  1.00TB
  state=running queue_depth=31 scsi_level=6 type=0 device_blocked=0 timeout=30
[2:0:0:0]    disk    ATA      ST4000VN000-1H41 SC43  /dev/sdc [8:32]  -  /dev/sg2 [21:2]  4.00TB
  state=running queue_depth=31 scsi_level=6 type=0 device_blocked=0 timeout=30
[3:0:0:0]    disk    ATA      ST4000VN000-1H41 SC43  /dev/sdd [8:48]  -  /dev/sg3 [21:3]  4.00TB
  state=running queue_depth=31 scsi_level=6 type=0 device_blocked=0 timeout=30
[4:0:0:0]    disk    ATA      ST4000VN000-1H41 SC43  /dev/sde [8:64]  -  /dev/sg4 [21:4]  4.00TB
  state=running queue_depth=31 scsi_level=6 type=0 device_blocked=0 timeout=30
[5:0:0:0]    disk    ATA      ST4000VN000-1H41 SC43  /dev/sdf [8:80]  -  /dev/sg5 [21:5]  4.00TB
  state=running queue_depth=31 scsi_level=6 type=0 device_blocked=0 timeout=30
[6:0:0:0]    disk    ATA      ST4000VN000-1H41 SC43  /dev/sdg [8:96]  -  /dev/sg6 [21:6]  4.00TB
  state=running queue_depth=31 scsi_level=6 type=0 device_blocked=0 timeout=30
[7:0:0:0]    disk    ATA      ST4000VN000-1H41 SC43  /dev/sdh [8:112]  -  /dev/sg7 [21:7]  4.00TB
  state=running queue_depth=31 scsi_level=6 type=0 device_blocked=0 timeout=30
[13:0:0:0]   process Marvell  91xx Config      1.01  -          -  /dev/sg8 [21:8]       -
  state=running queue_depth=1 scsi_level=6 type=3 device_blocked=0 timeout=0
