{
  "port": 4000,
  "mongoURL": "mongodb+srv://Ivan:1q2w3e4r@cluster0-hxkhe.mongodb.net/<dbname>?retryWrites=true&w=majority",
  "TEST_DB_URL": "mongodb+srv://dbAdmin:ghDArVnin57B4r5I@cluster0.eaipi.mongodb.net/litvins?retryWrites=true&w=majority",
  "SERVER_URL": "http://localhost:4000",
  "CLIENT_URL": "http://localhost:3000",
  "host": "123.45.678.901",
  "SMTP_LOGIN": "litvins.server@gmail.com",
  "SMTP_PASSWORD": "`1qazxsw2"
}