{
  "replace": false,
  "values": [
    "cobblemon:polished_tumblestone_stairs",
    "cobblemon:polished_black_tumblestone_stairs",
    "cobblemon:polished_sky_tumblestone_stairs",
	"cobblemon:tumblestone_brick_stairs",
	"cobblemon:black_tumblestone_brick_stairs",
	"cobblemon:sky_tumblestone_brick_stairs"
  ]
}