<?xml version="1.0" encoding="iso-8859-1"?>
<!DOCTYPE svg PUBLIC "-//W3C//DTD SVG 1.1//EN" "http://www.w3.org/Graphics/SVG/1.1/DTD/svg11.dtd">
<svg 
 version="1.1" xmlns="http://www.w3.org/2000/svg" xmlns:xlink="http://www.w3.org/1999/xlink" x="0px" y="0px" width="512px"
	 height="512px" viewBox="0 0 512 512" enable-background="new 0 0 512 512" xml:space="preserve"
><g id="5151e0c8492e5103c096af88a525c555"><g></g><g fill="#c9a846"><path display="inline" d="M362.292,71.895L468.589,256L362.292,440.105H149.708L43.412,256L149.708,71.895H362.292 M383.75,34.731
		h-255.5L0.5,256l127.75,221.27h255.5L511.5,256L383.75,34.731L383.75,34.731z"></path></g></g></svg>