{
	"info": {
		"_postman_id": "0f1e618d-395c-40b1-a3c5-f6f4ffa58010",
		"name": "Software Vulnerabilities System",
		"schema": "https://schema.getpostman.com/json/collection/v2.1.0/collection.json"
	},
	"item": [
		{
			"name": "Authorization",
			"item": [
				{
					"name": "LOGIN user",
					"event": [
						{
							"listen": "test",
							"script": {
								"id": "d3d8e63d-c838-425e-ad7f-739fd5e97cd9",
								"exec": [
									"var jsonData = JSON.parse(responseBody);\r",
									"postman.setGlobalVariable(\"token\",jsonData.token);"
								],
								"type": "text/javascript"
							}
						}
					],
					"request": {
						"auth": {
							"type": "bearer",
							"bearer": [
								{
									"key": "token",
									"value": "{{token}}",
									"type": "string"
								}
							]
						},
						"method": "POST",
						"header": [
							{
								"key": "Content-Type",
								"value": "application/json",
								"type": "text"
							}
						],
						"body": {
							"mode": "raw",
							"raw": " {\r\n    \"username\": \"admin\",\r\n    \"password\": \"12345a$\"\r\n}",
							"options": {
								"raw": {
									"language": "json"
								}
							}
						},
						"url": {
							"raw": "localhost:3000/api/session",
							"host": [
								"localhost"
							],
							"port": "3000",
							"path": [
								"api",
								"session"
							]
						}
					},
					"response": []
				},
				{
					"name": "LOGIN user - invalid password",
					"event": [
						{
							"listen": "test",
							"script": {
								"id": "e83bbee4-3829-4343-85ae-b45b99091ef9",
								"exec": [
									"var jsonData = JSON.parse(responseBody);\r",
									"postman.setGlobalVariable(\"token\",jsonData.token);"
								],
								"type": "text/javascript"
							}
						}
					],
					"request": {
						"auth": {
							"type": "bearer",
							"bearer": [
								{
									"key": "token",
									"value": "{{token}}",
									"type": "string"
								}
							]
						},
						"method": "POST",
						"header": [
							{
								"key": "Content-Type",
								"type": "text",
								"value": "application/json"
							}
						],
						"body": {
							"mode": "raw",
							"raw": " {\r\n    \"username\": \"Dolores\",\r\n    \"password\": \"12345a$secret\"\r\n}",
							"options": {
								"raw": {
									"language": "json"
								}
							}
						},
						"url": {
							"raw": "localhost:3000/api/session",
							"host": [
								"localhost"
							],
							"port": "3000",
							"path": [
								"api",
								"session"
							]
						}
					},
					"response": []
				},
				{
					"name": "LOGIN user - not existing username",
					"event": [
						{
							"listen": "test",
							"script": {
								"id": "ca0dbf11-3d75-49da-8223-158da9ed3364",
								"exec": [
									"var jsonData = JSON.parse(responseBody);\r",
									"postman.setGlobalVariable(\"token\",jsonData.token);"
								],
								"type": "text/javascript"
							}
						}
					],
					"request": {
						"auth": {
							"type": "bearer",
							"bearer": [
								{
									"key": "token",
									"value": "{{token}}",
									"type": "string"
								}
							]
						},
						"method": "POST",
						"header": [
							{
								"key": "Content-Type",
								"type": "text",
								"value": "application/json"
							}
						],
						"body": {
							"mode": "raw",
							"raw": " {\r\n    \"username\": \"Nessebar\",\r\n    \"password\": \"12345a$\"\r\n}",
							"options": {
								"raw": {
									"language": "json"
								}
							}
						},
						"url": {
							"raw": "localhost:3000/api/session",
							"host": [
								"localhost"
							],
							"port": "3000",
							"path": [
								"api",
								"session"
							]
						}
					},
					"response": []
				},
				{
					"name": "LOGOUT user",
					"event": [
						{
							"listen": "test",
							"script": {
								"id": "561d94f7-ae14-4f87-8027-7ccb5ec38895",
								"exec": [
									""
								],
								"type": "text/javascript"
							}
						}
					],
					"request": {
						"auth": {
							"type": "bearer",
							"bearer": [
								{
									"key": "token",
									"value": "{{token}}",
									"type": "string"
								}
							]
						},
						"method": "DELETE",
						"header": [
							{
								"key": "Content-Type",
								"value": "application/json",
								"type": "text"
							}
						],
						"url": {
							"raw": "localhost:3000/api/session",
							"host": [
								"localhost"
							],
							"port": "3000",
							"path": [
								"api",
								"session"
							]
						}
					},
					"response": []
				}
			],
			"protocolProfileBehavior": {}
		},
		{
			"name": "CPE",
			"item": [
				{
					"name": "GET/UPDATE all CPEs",
					"request": {
						"auth": {
							"type": "bearer",
							"bearer": [
								{
									"key": "token",
									"value": "{{token}}",
									"type": "string"
								}
							]
						},
						"method": "PUT",
						"header": [],
						"url": {
							"raw": "http://localhost:3000/api/cpe",
							"protocol": "http",
							"host": [
								"localhost"
							],
							"port": "3000",
							"path": [
								"api",
								"cpe"
							]
						}
					},
					"response": []
				},
				{
					"name": "ASSIGN CPE",
					"request": {
						"auth": {
							"type": "bearer",
							"bearer": [
								{
									"key": "token",
									"value": "{{token}}",
									"type": "string"
								}
							]
						},
						"method": "PUT",
						"header": [],
						"body": {
							"mode": "raw",
							"raw": "",
							"options": {
								"raw": {
									"language": "json"
								}
							}
						},
						"url": {
							"raw": "localhost:3000/api/products/3/cpe/141879",
							"host": [
								"localhost"
							],
							"port": "3000",
							"path": [
								"api",
								"products",
								"3",
								"cpe",
								"141879"
							]
						}
					},
					"response": []
				}
			],
			"protocolProfileBehavior": {}
		},
		{
			"name": "CVE",
			"item": [
				{
					"name": "GET CVE by id - NVD feeds",
					"request": {
						"method": "GET",
						"header": [],
						"url": {
							"raw": "https://services.nvd.nist.gov/rest/json/cve/1.0/CVE-2015-5611",
							"protocol": "https",
							"host": [
								"services",
								"nvd",
								"nist",
								"gov"
							],
							"path": [
								"rest",
								"json",
								"cve",
								"1.0",
								"CVE-2015-5611"
							]
						}
					},
					"response": []
				},
				{
					"name": "GET CVE by id",
					"request": {
						"method": "GET",
						"header": [],
						"url": {
							"raw": "localhost:3000/api/cves/CVE-2015-5611",
							"host": [
								"localhost"
							],
							"port": "3000",
							"path": [
								"api",
								"cves",
								"CVE-2015-5611"
							]
						}
					},
					"response": []
				},
				{
					"name": "GET all CVEs - NVD feeds",
					"request": {
						"method": "GET",
						"header": [],
						"url": {
							"raw": "https://services.nvd.nist.gov/rest/json/cves/1.0?startIndex=3&resultsPerPage=20",
							"protocol": "https",
							"host": [
								"services",
								"nvd",
								"nist",
								"gov"
							],
							"path": [
								"rest",
								"json",
								"cves",
								"1.0"
							],
							"query": [
								{
									"key": "startIndex",
									"value": "3"
								},
								{
									"key": "resultsPerPage",
									"value": "20"
								}
							]
						}
					},
					"response": []
				},
				{
					"name": "GET all CVEs",
					"request": {
						"method": "GET",
						"header": [],
						"url": {
							"raw": "localhost:3000/api/cves?page=3&perPage=20",
							"host": [
								"localhost"
							],
							"port": "3000",
							"path": [
								"api",
								"cves"
							],
							"query": [
								{
									"key": "page",
									"value": "3"
								},
								{
									"key": "perPage",
									"value": "20"
								}
							]
						}
					},
					"response": []
				},
				{
					"name": "GET all CVEs for product",
					"request": {
						"auth": {
							"type": "bearer",
							"bearer": [
								{
									"key": "token",
									"value": "{{token}}",
									"type": "string"
								}
							]
						},
						"method": "GET",
						"header": [],
						"url": {
							"raw": "localhost:3000/api/products/4/cves",
							"host": [
								"localhost"
							],
							"port": "3000",
							"path": [
								"api",
								"products",
								"4",
								"cves"
							]
						}
					},
					"response": []
				},
				{
					"name": "SEND Email to system admins",
					"request": {
						"auth": {
							"type": "bearer",
							"bearer": [
								{
									"key": "token",
									"value": "{{token}}",
									"type": "string"
								}
							]
						},
						"method": "POST",
						"header": [],
						"body": {
							"mode": "raw",
							"raw": "{\n\t\"product\": \"Postman\",\n\t\"vendor\": \"Postman\",\n\t\"version\": \"5.8.7\"\n}",
							"options": {
								"raw": {
									"language": "json"
								}
							}
						},
						"url": {
							"raw": "localhost:3000/api/products/3/email",
							"host": [
								"localhost"
							],
							"port": "3000",
							"path": [
								"api",
								"products",
								"3",
								"email"
							]
						}
					},
					"response": []
				},
				{
					"name": "UNASSIGN CVE",
					"request": {
						"auth": {
							"type": "bearer",
							"bearer": [
								{
									"key": "token",
									"value": "{{token}}",
									"type": "string"
								}
							]
						},
						"method": "DELETE",
						"header": [],
						"url": {
							"raw": "localhost:3000/api/products/3/unassignCVE/CVE-2020-12762",
							"host": [
								"localhost"
							],
							"port": "3000",
							"path": [
								"api",
								"products",
								"3",
								"unassignCVE",
								"CVE-2020-12762"
							]
						}
					},
					"response": []
				},
				{
					"name": "ASSIGN CVE",
					"request": {
						"auth": {
							"type": "bearer",
							"bearer": [
								{
									"key": "token",
									"value": "{{token}}",
									"type": "string"
								}
							]
						},
						"method": "PUT",
						"header": [],
						"body": {
							"mode": "raw",
							"raw": "",
							"options": {
								"raw": {
									"language": "json"
								}
							}
						},
						"url": {
							"raw": "localhost:3000/api/products/3/cpe/141879",
							"host": [
								"localhost"
							],
							"port": "3000",
							"path": [
								"api",
								"products",
								"3",
								"cpe",
								"141879"
							]
						}
					},
					"response": []
				}
			],
			"protocolProfileBehavior": {}
		},
		{
			"name": "User",
			"item": [
				{
					"name": "GET all users",
					"protocolProfileBehavior": {
						"disableBodyPruning": true
					},
					"request": {
						"auth": {
							"type": "bearer",
							"bearer": [
								{
									"key": "token",
									"value": "{{token}}",
									"type": "string"
								}
							]
						},
						"method": "GET",
						"header": [],
						"body": {
							"mode": "raw",
							"raw": " {\r\n \t\"username\": \"Nickolas\",\r\n \t\"name\": \"Nicko\",\r\n \t\"password\": \"12345a$\",\r\n \t\"email\": \"alex@abv.bg\",\r\n \t\"role\": \"Basic\"\r\n}",
							"options": {
								"raw": {
									"language": "json"
								}
							}
						},
						"url": {
							"raw": "localhost:3000/api/users",
							"host": [
								"localhost"
							],
							"port": "3000",
							"path": [
								"api",
								"users"
							]
						}
					},
					"response": []
				},
				{
					"name": "GET user by username",
					"protocolProfileBehavior": {
						"disableBodyPruning": true
					},
					"request": {
						"auth": {
							"type": "bearer",
							"bearer": [
								{
									"key": "token",
									"value": "{{token}}",
									"type": "string"
								}
							]
						},
						"method": "GET",
						"header": [],
						"body": {
							"mode": "raw",
							"raw": " {\r\n \t\"username\": \"Nickolas\",\r\n \t\"name\": \"Nicko\",\r\n \t\"password\": \"12345a$\",\r\n \t\"email\": \"alex@abv.bg\",\r\n \t\"role\": \"Basic\"\r\n}",
							"options": {
								"raw": {
									"language": "json"
								}
							}
						},
						"url": {
							"raw": "localhost:3000/api/users/andy",
							"host": [
								"localhost"
							],
							"port": "3000",
							"path": [
								"api",
								"users",
								"andy"
							]
						}
					},
					"response": []
				},
				{
					"name": "CREATE user",
					"request": {
						"auth": {
							"type": "bearer",
							"bearer": [
								{
									"key": "token",
									"value": "{{token}}",
									"type": "string"
								}
							]
						},
						"method": "POST",
						"header": [],
						"body": {
							"mode": "raw",
							"raw": " {\r\n \t\"username\": \"izabela\",\r\n \t\"name\": \"Izabela\",\r\n \t\"password\": \"12345a$\",\r\n \t\"email\": \"izabela@abv.bg\",\r\n \t\"role\": \"Basic\"\r\n}",
							"options": {
								"raw": {
									"language": "json"
								}
							}
						},
						"url": {
							"raw": "localhost:3000/api/users/",
							"host": [
								"localhost"
							],
							"port": "3000",
							"path": [
								"api",
								"users",
								""
							]
						}
					},
					"response": []
				},
				{
					"name": "CREATE user - email already exists",
					"request": {
						"auth": {
							"type": "bearer",
							"bearer": [
								{
									"key": "token",
									"value": "{{token}}",
									"type": "string"
								}
							]
						},
						"method": "POST",
						"header": [],
						"body": {
							"mode": "raw",
							"raw": " {\r\n \t\"username\": \"Nickolas\",\r\n \t\"name\": \"Nicko\",\r\n \t\"password\": \"12345a$\",\r\n \t\"email\": \"alex@abv.bg\",\r\n \t\"role\": \"Basic\"\r\n}",
							"options": {
								"raw": {
									"language": "json"
								}
							}
						},
						"url": {
							"raw": "localhost:3000/api/users/",
							"host": [
								"localhost"
							],
							"port": "3000",
							"path": [
								"api",
								"users",
								""
							]
						}
					},
					"response": []
				},
				{
					"name": "CREATE user - username already exists",
					"request": {
						"auth": {
							"type": "bearer",
							"bearer": [
								{
									"key": "token",
									"value": "{{token}}",
									"type": "string"
								}
							]
						},
						"method": "POST",
						"header": [],
						"body": {
							"mode": "raw",
							"raw": " {\r\n \t\"username\": \"Alexander\",\r\n \t\"name\": \"Alex\",\r\n \t\"password\": \"12345a$\",\r\n \t\"email\": \"alex@abv.bg\",\r\n \t\"role\": \"Basic\"\r\n}",
							"options": {
								"raw": {
									"language": "json"
								}
							}
						},
						"url": {
							"raw": "localhost:3000/api/users/",
							"host": [
								"localhost"
							],
							"port": "3000",
							"path": [
								"api",
								"users",
								""
							]
						}
					},
					"response": []
				},
				{
					"name": "UPDATE user",
					"request": {
						"auth": {
							"type": "bearer",
							"bearer": [
								{
									"key": "token",
									"value": "{{token}}",
									"type": "string"
								}
							]
						},
						"method": "PUT",
						"header": [
							{
								"key": "Content-Type",
								"value": "application/json",
								"type": "text"
							}
						],
						"body": {
							"mode": "raw",
							"raw": " {\r\n    \"name\": \"Iviyana Stoyanova\"\r\n}"
						},
						"url": {
							"raw": "localhost:3000/api/users/iviyana",
							"host": [
								"localhost"
							],
							"port": "3000",
							"path": [
								"api",
								"users",
								"iviyana"
							]
						}
					},
					"response": []
				},
				{
					"name": "UPDATE avatar",
					"request": {
						"auth": {
							"type": "bearer",
							"bearer": [
								{
									"key": "token",
									"value": "{{token}}",
									"type": "string"
								}
							]
						},
						"method": "PUT",
						"header": [
							{
								"key": "Content-Type",
								"type": "text",
								"value": "application/json"
							}
						],
						"body": {
							"mode": "formdata",
							"formdata": [
								{
									"key": "file",
									"type": "file",
									"src": "/C:/Users/Iviyana/Pictures/sunflower-vector-png-11552162031wow9sbubrv.png"
								}
							]
						},
						"url": {
							"raw": "localhost:3000/api/users/iviyana/avatar",
							"host": [
								"localhost"
							],
							"port": "3000",
							"path": [
								"api",
								"users",
								"iviyana",
								"avatar"
							]
						}
					},
					"response": []
				},
				{
					"name": "UPDATE password",
					"request": {
						"auth": {
							"type": "bearer",
							"bearer": [
								{
									"key": "token",
									"value": "{{token}}",
									"type": "string"
								}
							]
						},
						"method": "PUT",
						"header": [
							{
								"key": "Content-Type",
								"value": "application/json",
								"type": "text"
							}
						],
						"body": {
							"mode": "raw",
							"raw": "{\n\t\"password\": \"12345a$\"\n}"
						},
						"url": {
							"raw": "localhost:3000/api/users/iviyana/password",
							"host": [
								"localhost"
							],
							"port": "3000",
							"path": [
								"api",
								"users",
								"iviyana",
								"password"
							]
						}
					},
					"response": []
				},
				{
					"name": "DELETE user",
					"request": {
						"auth": {
							"type": "bearer",
							"bearer": [
								{
									"key": "token",
									"value": "{{token}}",
									"type": "string"
								}
							]
						},
						"method": "DELETE",
						"header": [],
						"url": {
							"raw": "localhost:3000/api/users/iviyana/",
							"host": [
								"localhost"
							],
							"port": "3000",
							"path": [
								"api",
								"users",
								"iviyana",
								""
							]
						}
					},
					"response": []
				}
			],
			"protocolProfileBehavior": {}
		},
		{
			"name": "Producs",
			"item": [
				{
					"name": "GET product by id",
					"request": {
						"auth": {
							"type": "bearer",
							"bearer": [
								{
									"key": "token",
									"value": "{{token}}",
									"type": "string"
								}
							]
						},
						"method": "GET",
						"header": [],
						"url": {
							"raw": "localhost:3000/api/products/2",
							"host": [
								"localhost"
							],
							"port": "3000",
							"path": [
								"api",
								"products",
								"2"
							]
						}
					},
					"response": []
				},
				{
					"name": "GET product by id - not existing",
					"request": {
						"auth": {
							"type": "bearer",
							"bearer": [
								{
									"key": "token",
									"value": "{{token}}",
									"type": "string"
								}
							]
						},
						"method": "GET",
						"header": [],
						"url": {
							"raw": "localhost:3000/api/products/-5",
							"host": [
								"localhost"
							],
							"port": "3000",
							"path": [
								"api",
								"products",
								"-5"
							]
						}
					},
					"response": []
				},
				{
					"name": "GET all products with CVEs",
					"request": {
						"method": "GET",
						"header": [],
						"url": {
							"raw": "localhost:3000/api/products/cves",
							"host": [
								"localhost"
							],
							"port": "3000",
							"path": [
								"api",
								"products",
								"cves"
							]
						}
					},
					"response": []
				},
				{
					"name": "GET all products - numbers of products",
					"request": {
						"auth": {
							"type": "bearer",
							"bearer": [
								{
									"key": "token",
									"value": "{{token}}",
									"type": "string"
								}
							]
						},
						"method": "GET",
						"header": [],
						"url": {
							"raw": "localhost:3000/api/products/number-of-products",
							"host": [
								"localhost"
							],
							"port": "3000",
							"path": [
								"api",
								"products",
								"number-of-products"
							]
						}
					},
					"response": []
				},
				{
					"name": "GET all products without CVEs",
					"request": {
						"auth": {
							"type": "bearer",
							"bearer": [
								{
									"key": "token",
									"value": "{{token}}",
									"type": "string"
								}
							]
						},
						"method": "GET",
						"header": [],
						"url": {
							"raw": "localhost:3000/api/products/without-cves",
							"host": [
								"localhost"
							],
							"port": "3000",
							"path": [
								"api",
								"products",
								"without-cves"
							]
						}
					},
					"response": []
				},
				{
					"name": "GET all products - sort by ASC date",
					"request": {
						"auth": {
							"type": "bearer",
							"bearer": [
								{
									"key": "token",
									"value": "{{token}}",
									"type": "string"
								}
							]
						},
						"method": "GET",
						"header": [],
						"url": {
							"raw": "localhost:3000/api/products?page=1&resultsPerPage=10&sortBy=addedOn&sortType=ASC",
							"host": [
								"localhost"
							],
							"port": "3000",
							"path": [
								"api",
								"products"
							],
							"query": [
								{
									"key": "page",
									"value": "1"
								},
								{
									"key": "resultsPerPage",
									"value": "10"
								},
								{
									"key": "sortBy",
									"value": "addedOn"
								},
								{
									"key": "sortType",
									"value": "ASC"
								}
							]
						}
					},
					"response": []
				},
				{
					"name": "GET all products - sort by DESC date",
					"request": {
						"auth": {
							"type": "bearer",
							"bearer": [
								{
									"key": "token",
									"value": "{{token}}",
									"type": "string"
								}
							]
						},
						"method": "GET",
						"header": [],
						"url": {
							"raw": "localhost:3000/api/products?page=1&resultsPerPage=10&sortBy=addedOn&sortType=DESC",
							"host": [
								"localhost"
							],
							"port": "3000",
							"path": [
								"api",
								"products"
							],
							"query": [
								{
									"key": "page",
									"value": "1"
								},
								{
									"key": "resultsPerPage",
									"value": "10"
								},
								{
									"key": "sortBy",
									"value": "addedOn"
								},
								{
									"key": "sortType",
									"value": "DESC"
								}
							]
						}
					},
					"response": []
				},
				{
					"name": "GET all products - sort by ASC product",
					"request": {
						"auth": {
							"type": "bearer",
							"bearer": [
								{
									"key": "token",
									"value": "{{token}}",
									"type": "string"
								}
							]
						},
						"method": "GET",
						"header": [],
						"url": {
							"raw": "localhost:3000/api/products?page=1&resultsPerPage=10&sortBy=product&sortType=ASC",
							"host": [
								"localhost"
							],
							"port": "3000",
							"path": [
								"api",
								"products"
							],
							"query": [
								{
									"key": "page",
									"value": "1"
								},
								{
									"key": "resultsPerPage",
									"value": "10"
								},
								{
									"key": "sortBy",
									"value": "product"
								},
								{
									"key": "sortType",
									"value": "ASC"
								}
							]
						}
					},
					"response": []
				},
				{
					"name": "GET CPEs for Product (Matching algorithm)",
					"request": {
						"auth": {
							"type": "bearer",
							"bearer": [
								{
									"key": "token",
									"value": "{{token}}",
									"type": "string"
								}
							]
						},
						"method": "GET",
						"header": [],
						"url": {
							"raw": "localhost:3000/api/products/2/matchingCPEs",
							"host": [
								"localhost"
							],
							"port": "3000",
							"path": [
								"api",
								"products",
								"2",
								"matchingCPEs"
							]
						}
					},
					"response": []
				},
				{
					"name": "SEARCH by Vendor",
					"request": {
						"auth": {
							"type": "bearer",
							"bearer": [
								{
									"key": "token",
									"value": "{{token}}",
									"type": "string"
								}
							]
						},
						"method": "GET",
						"header": [],
						"url": {
							"raw": "localhost:3000/api/products/search/byVendor?page=1&resultsPerPage=10&sortBy=product&sortType=ASC&searchString=micro*",
							"host": [
								"localhost"
							],
							"port": "3000",
							"path": [
								"api",
								"products",
								"search",
								"byVendor"
							],
							"query": [
								{
									"key": "page",
									"value": "1"
								},
								{
									"key": "resultsPerPage",
									"value": "10"
								},
								{
									"key": "sortBy",
									"value": "product"
								},
								{
									"key": "sortType",
									"value": "ASC"
								},
								{
									"key": "searchString",
									"value": "micro*"
								}
							]
						}
					},
					"response": []
				},
				{
					"name": "SEARCH by Product",
					"request": {
						"auth": {
							"type": "bearer",
							"bearer": [
								{
									"key": "token",
									"value": "{{token}}",
									"type": "string"
								}
							]
						},
						"method": "GET",
						"header": [],
						"url": {
							"raw": "localhost:3000/api/products/search/byProduct?page=1&resultsPerPage=10&sortBy=product&sortType=ASC&searchString=p*",
							"host": [
								"localhost"
							],
							"port": "3000",
							"path": [
								"api",
								"products",
								"search",
								"byProduct"
							],
							"query": [
								{
									"key": "page",
									"value": "1"
								},
								{
									"key": "resultsPerPage",
									"value": "10"
								},
								{
									"key": "sortBy",
									"value": "product"
								},
								{
									"key": "sortType",
									"value": "ASC"
								},
								{
									"key": "searchString",
									"value": "p*"
								}
							]
						}
					},
					"response": []
				},
				{
					"name": "SEARCH by CPE",
					"request": {
						"auth": {
							"type": "bearer",
							"bearer": [
								{
									"key": "token",
									"value": "{{token}}",
									"type": "string"
								}
							]
						},
						"method": "GET",
						"header": [],
						"url": {
							"raw": "localhost:3000/api/products/search/byCPE?page=1&resultsPerPage=10&sortBy=product&sortType=ASC&searchString=p*",
							"host": [
								"localhost"
							],
							"port": "3000",
							"path": [
								"api",
								"products",
								"search",
								"byCPE"
							],
							"query": [
								{
									"key": "page",
									"value": "1"
								},
								{
									"key": "resultsPerPage",
									"value": "10"
								},
								{
									"key": "sortBy",
									"value": "product"
								},
								{
									"key": "sortType",
									"value": "ASC"
								},
								{
									"key": "searchString",
									"value": "p*"
								}
							]
						}
					},
					"response": []
				},
				{
					"name": "SEARCH by CVE Id",
					"request": {
						"auth": {
							"type": "bearer",
							"bearer": [
								{
									"key": "token",
									"value": "{{token}}",
									"type": "string"
								}
							]
						},
						"method": "GET",
						"header": [],
						"url": {
							"raw": "localhost:3000/api/products/search/byCVE?page=1&resultsPerPage=10&sortBy=product&sortType=ASC&searchString=p*",
							"host": [
								"localhost"
							],
							"port": "3000",
							"path": [
								"api",
								"products",
								"search",
								"byCVE"
							],
							"query": [
								{
									"key": "page",
									"value": "1"
								},
								{
									"key": "resultsPerPage",
									"value": "10"
								},
								{
									"key": "sortBy",
									"value": "product"
								},
								{
									"key": "sortType",
									"value": "ASC"
								},
								{
									"key": "searchString",
									"value": "p*"
								}
							]
						}
					},
					"response": []
				},
				{
					"name": "ASSIGN CVE to product",
					"request": {
						"auth": {
							"type": "bearer",
							"bearer": [
								{
									"key": "token",
									"value": "{{token}}",
									"type": "string"
								}
							]
						},
						"method": "PUT",
						"header": [],
						"body": {
							"mode": "raw",
							"raw": "",
							"options": {
								"raw": {
									"language": "json"
								}
							}
						},
						"url": {
							"raw": "localhost:3000/api/products/3/cpe/141879",
							"host": [
								"localhost"
							],
							"port": "3000",
							"path": [
								"api",
								"products",
								"3",
								"cpe",
								"141879"
							]
						}
					},
					"response": []
				},
				{
					"name": "ASSIGN CPE to product",
					"request": {
						"auth": {
							"type": "bearer",
							"bearer": [
								{
									"key": "token",
									"value": "{{token}}",
									"type": "string"
								}
							]
						},
						"method": "PUT",
						"header": [],
						"body": {
							"mode": "raw",
							"raw": "",
							"options": {
								"raw": {
									"language": "json"
								}
							}
						},
						"url": {
							"raw": "localhost:3000/api/products/3/cpe/141879",
							"host": [
								"localhost"
							],
							"port": "3000",
							"path": [
								"api",
								"products",
								"3",
								"cpe",
								"141879"
							]
						}
					},
					"response": []
				},
				{
					"name": "UPDATE product",
					"request": {
						"auth": {
							"type": "bearer",
							"bearer": [
								{
									"key": "token",
									"value": "{{token}}",
									"type": "string"
								}
							]
						},
						"method": "PUT",
						"header": [],
						"body": {
							"mode": "raw",
							"raw": "{\n\t\"version\": \"83.0.4103.61\"\n}",
							"options": {
								"raw": {
									"language": "json"
								}
							}
						},
						"url": {
							"raw": "localhost:3000/api/products/11/",
							"host": [
								"localhost"
							],
							"port": "3000",
							"path": [
								"api",
								"products",
								"11",
								""
							]
						}
					},
					"response": []
				},
				{
					"name": "CREATE product",
					"request": {
						"auth": {
							"type": "bearer",
							"bearer": [
								{
									"key": "token",
									"value": "{{token}}",
									"type": "string"
								}
							]
						},
						"method": "POST",
						"header": [],
						"body": {
							"mode": "raw",
							"raw": "{\n\t\"product\": \"Postman\",\n\t\"vendor\": \"Postman\",\n\t\"version\": \"5.8.7\"\n}",
							"options": {
								"raw": {
									"language": "json"
								}
							}
						},
						"url": {
							"raw": "localhost:3000/api/products",
							"host": [
								"localhost"
							],
							"port": "3000",
							"path": [
								"api",
								"products"
							]
						}
					},
					"response": []
				},
				{
					"name": "SEND Email to system admins",
					"request": {
						"auth": {
							"type": "bearer",
							"bearer": [
								{
									"key": "token",
									"value": "{{token}}",
									"type": "string"
								}
							]
						},
						"method": "POST",
						"header": [],
						"body": {
							"mode": "raw",
							"raw": "{\n\t\"product\": \"Postman\",\n\t\"vendor\": \"Postman\",\n\t\"version\": \"5.8.7\"\n}",
							"options": {
								"raw": {
									"language": "json"
								}
							}
						},
						"url": {
							"raw": "localhost:3000/api/products/3/email",
							"host": [
								"localhost"
							],
							"port": "3000",
							"path": [
								"api",
								"products",
								"3",
								"email"
							]
						}
					},
					"response": []
				},
				{
					"name": "DELETE Product",
					"request": {
						"auth": {
							"type": "bearer",
							"bearer": [
								{
									"key": "token",
									"value": "{{token}}",
									"type": "string"
								}
							]
						},
						"method": "DELETE",
						"header": [],
						"url": {
							"raw": "localhost:3000/api/products/16",
							"host": [
								"localhost"
							],
							"port": "3000",
							"path": [
								"api",
								"products",
								"16"
							]
						}
					},
					"response": []
				}
			],
			"protocolProfileBehavior": {}
		}
	],
	"protocolProfileBehavior": {}
}