<?xml version="1.0" encoding="UTF-8"?>
<graphml xmlns="http://graphml.graphdrawing.org/xmlns">
<key attr.name="label" attr.type="string" for="node" id="label"/>
<key attr.name="Edge Label" attr.type="string" for="edge" id="edgelabel"/>
<key attr.name="weight" attr.type="double" for="edge" id="weight"/>
<key attr.name="Edge Id" attr.type="string" for="edge" id="edgeid"/>
<key attr.name="r" attr.type="int" for="node" id="r"/>
<key attr.name="g" attr.type="int" for="node" id="g"/>
<key attr.name="b" attr.type="int" for="node" id="b"/>
<key attr.name="x" attr.type="float" for="node" id="x"/>
<key attr.name="y" attr.type="float" for="node" id="y"/>
<key attr.name="size" attr.type="float" for="node" id="size"/>
<key attr.name="value" attr.type="double" for="node" id="value"/>
<graph edgedefault="undirected">
<node id="0.0">
<data key="label">BrighamYoung</data>
<data key="value">7.0</data>
<data key="size">4.0</data>
<data key="r">192</data>
<data key="g">192</data>
<data key="b">192</data>
<data key="x">124.75224</data>
<data key="y">-42.66656</data>
</node>
<node id="1.0">
<data key="label">FloridaState</data>
<data key="value">0.0</data>
<data key="size">4.0</data>
<data key="r">192</data>
<data key="g">192</data>
<data key="b">192</data>
<data key="x">96.92259</data>
<data key="y">193.28336</data>
</node>
<node id="2.0">
<data key="label">Iowa</data>
<data key="value">2.0</data>
<data key="size">4.0</data>
<data key="r">192</data>
<data key="g">192</data>
<data key="b">192</data>
<data key="x">-217.48045</data>
<data key="y">-38.194523</data>
</node>
<node id="3.0">
<data key="label">KansasState</data>
<data key="value">3.0</data>
<data key="size">4.0</data>
<data key="r">192</data>
<data key="g">192</data>
<data key="b">192</data>
<data key="x">-111.76805</data>
<data key="y">-98.533035</data>
</node>
<node id="4.0">
<data key="label">NewMexico</data>
<data key="value">7.0</data>
<data key="size">4.0</data>
<data key="r">192</data>
<data key="g">192</data>
<data key="b">192</data>
<data key="x">135.67444</data>
<data key="y">-208.01517</data>
</node>
<node id="5.0">
<data key="label">TexasTech</data>
<data key="value">3.0</data>
<data key="size">4.0</data>
<data key="r">192</data>
<data key="g">192</data>
<data key="b">192</data>
<data key="x">-14.203727</data>
<data key="y">-187.31189</data>
</node>
<node id="6.0">
<data key="label">PennState</data>
<data key="value">2.0</data>
<data key="size">4.0</data>
<data key="r">192</data>
<data key="g">192</data>
<data key="b">192</data>
<data key="x">-176.49832</data>
<data key="y">-1.9781609</data>
</node>
<node id="7.0">
<data key="label">SouthernCalifornia</data>
<data key="value">8.0</data>
<data key="size">4.0</data>
<data key="r">192</data>
<data key="g">192</data>
<data key="b">192</data>
<data key="x">-86.44361</data>
<data key="y">-249.60114</data>
</node>
<node id="8.0">
<data key="label">ArizonaState</data>
<data key="value">8.0</data>
<data key="size">4.0</data>
<data key="r">192</data>
<data key="g">192</data>
<data key="b">192</data>
<data key="x">38.814896</data>
<data key="y">-324.13348</data>
</node>
<node id="9.0">
<data key="label">SanDiegoState</data>
<data key="value">7.0</data>
<data key="size">4.0</data>
<data key="r">192</data>
<data key="g">192</data>
<data key="b">192</data>
<data key="x">63.540264</data>
<data key="y">-226.46538</data>
</node>
<node id="10.0">
<data key="label">Baylor</data>
<data key="value">3.0</data>
<data key="size">4.0</data>
<data key="r">192</data>
<data key="g">192</data>
<data key="b">192</data>
<data key="x">-137.15227</data>
<data key="y">-168.84872</data>
</node>
<node id="11.0">
<data key="label">NorthTexas</data>
<data key="value">10.0</data>
<data key="size">4.0</data>
<data key="r">192</data>
<data key="g">192</data>
<data key="b">192</data>
<data key="x">61.04507</data>
<data key="y">-158.67203</data>
</node>
<node id="12.0">
<data key="label">NorthernIllinois</data>
<data key="value">6.0</data>
<data key="size">4.0</data>
<data key="r">192</data>
<data key="g">192</data>
<data key="b">192</data>
<data key="x">-90.029434</data>
<data key="y">184.25629</data>
</node>
<node id="13.0">
<data key="label">Northwestern</data>
<data key="value">2.0</data>
<data key="size">4.0</data>
<data key="r">192</data>
<data key="g">192</data>
<data key="b">192</data>
<data key="x">-139.47487</data>
<data key="y">55.916267</data>
</node>
<node id="14.0">
<data key="label">WesternMichigan</data>
<data key="value">6.0</data>
<data key="size">4.0</data>
<data key="r">192</data>
<data key="g">192</data>
<data key="b">192</data>
<data key="x">-206.51749</data>
<data key="y">119.88578</data>
</node>
<node id="15.0">
<data key="label">Wisconsin</data>
<data key="value">2.0</data>
<data key="size">4.0</data>
<data key="r">192</data>
<data key="g">192</data>
<data key="b">192</data>
<data key="x">-137.66989</data>
<data key="y">-36.101498</data>
</node>
<node id="16.0">
<data key="label">Wyoming</data>
<data key="value">7.0</data>
<data key="size">4.0</data>
<data key="r">192</data>
<data key="g">192</data>
<data key="b">192</data>
<data key="x">64.90572</data>
<data key="y">-113.850815</data>
</node>
<node id="17.0">
<data key="label">Auburn</data>
<data key="value">9.0</data>
<data key="size">4.0</data>
<data key="r">192</data>
<data key="g">192</data>
<data key="b">192</data>
<data key="x">155.40329</data>
<data key="y">89.66198</data>
</node>
<node id="18.0">
<data key="label">Akron</data>
<data key="value">6.0</data>
<data key="size">4.0</data>
<data key="r">192</data>
<data key="g">192</data>
<data key="b">192</data>
<data key="x">-156.48595</data>
<data key="y">231.77469</data>
</node>
<node id="19.0">
<data key="label">VirginiaTech</data>
<data key="value">1.0</data>
<data key="size">4.0</data>
<data key="r">192</data>
<data key="g">192</data>
<data key="b">192</data>
<data key="x">-39.11366</data>
<data key="y">231.772</data>
</node>
<node id="20.0">
<data key="label">Alabama</data>
<data key="value">9.0</data>
<data key="size">4.0</data>
<data key="r">192</data>
<data key="g">192</data>
<data key="b">192</data>
<data key="x">186.89027</data>
<data key="y">31.979958</data>
</node>
<node id="21.0">
<data key="label">UCLA</data>
<data key="value">8.0</data>
<data key="size">4.0</data>
<data key="r">192</data>
<data key="g">192</data>
<data key="b">192</data>
<data key="x">7.534657</data>
<data key="y">-218.58047</data>
</node>
<node id="22.0">
<data key="label">Arizona</data>
<data key="value">8.0</data>
<data key="size">4.0</data>
<data key="r">192</data>
<data key="g">192</data>
<data key="b">192</data>
<data key="x">-43.650646</data>
<data key="y">-307.02014</data>
</node>
<node id="23.0">
<data key="label">Utah</data>
<data key="value">7.0</data>
<data key="size">4.0</data>
<data key="r">192</data>
<data key="g">192</data>
<data key="b">192</data>
<data key="x">115.76946</data>
<data key="y">-248.65901</data>
</node>
<node id="24.0">
<data key="label">ArkansasState</data>
<data key="value">10.0</data>
<data key="size">4.0</data>
<data key="r">192</data>
<data key="g">192</data>
<data key="b">192</data>
<data key="x">127.70289</data>
<data key="y">-73.704506</data>
</node>
<node id="25.0">
<data key="label">NorthCarolinaState</data>
<data key="value">0.0</data>
<data key="size">4.0</data>
<data key="r">192</data>
<data key="g">192</data>
<data key="b">192</data>
<data key="x">64.880264</data>
<data key="y">145.93109</data>
</node>
<node id="26.0">
<data key="label">BallState</data>
<data key="value">6.0</data>
<data key="size">4.0</data>
<data key="r">192</data>
<data key="g">192</data>
<data key="b">192</data>
<data key="x">-84.48222</data>
<data key="y">145.7518</data>
</node>
<node id="27.0">
<data key="label">Florida</data>
<data key="value">9.0</data>
<data key="size">4.0</data>
<data key="r">192</data>
<data key="g">192</data>
<data key="b">192</data>
<data key="x">182.03368</data>
<data key="y">183.8497</data>
</node>
<node id="28.0">
<data key="label">BoiseState</data>
<data key="value">11.0</data>
<data key="size">4.0</data>
<data key="r">192</data>
<data key="g">192</data>
<data key="b">192</data>
<data key="x">140.19054</data>
<data key="y">-113.89191</data>
</node>
<node id="29.0">
<data key="label">BostonCollege</data>
<data key="value">1.0</data>
<data key="size">4.0</data>
<data key="r">192</data>
<data key="g">192</data>
<data key="b">192</data>
<data key="x">-53.844936</data>
<data key="y">156.46223</data>
</node>
<node id="30.0">
<data key="label">WestVirginia</data>
<data key="value">1.0</data>
<data key="size">4.0</data>
<data key="r">192</data>
<data key="g">192</data>
<data key="b">192</data>
<data key="x">-25.483593</data>
<data key="y">113.27782</data>
</node>
<node id="31.0">
<data key="label">BowlingGreenState</data>
<data key="value">6.0</data>
<data key="size">4.0</data>
<data key="r">192</data>
<data key="g">192</data>
<data key="b">192</data>
<data key="x">-214.2712</data>
<data key="y">181.53227</data>
</node>
<node id="32.0">
<data key="label">Michigan</data>
<data key="value">2.0</data>
<data key="size">4.0</data>
<data key="r">192</data>
<data key="g">192</data>
<data key="b">192</data>
<data key="x">-172.27512</data>
<data key="y">-36.838177</data>
</node>
<node id="33.0">
<data key="label">Virginia</data>
<data key="value">0.0</data>
<data key="size">4.0</data>
<data key="r">192</data>
<data key="g">192</data>
<data key="b">192</data>
<data key="x">97.28242</data>
<data key="y">223.82237</data>
</node>
<node id="34.0">
<data key="label">Buffalo</data>
<data key="value">6.0</data>
<data key="size">4.0</data>
<data key="r">192</data>
<data key="g">192</data>
<data key="b">192</data>
<data key="x">-181.04268</data>
<data key="y">234.99469</data>
</node>
<node id="35.0">
<data key="label">Syracuse</data>
<data key="value">1.0</data>
<data key="size">4.0</data>
<data key="r">192</data>
<data key="g">192</data>
<data key="b">192</data>
<data key="x">-24.589485</data>
<data key="y">161.14714</data>
</node>
<node id="36.0">
<data key="label">CentralFlorida</data>
<data key="value">5.0</data>
<data key="size">4.0</data>
<data key="r">192</data>
<data key="g">192</data>
<data key="b">192</data>
<data key="x">18.12995</data>
<data key="y">187.30795</data>
</node>
<node id="37.0">
<data key="label">GeorgiaTech</data>
<data key="value">0.0</data>
<data key="size">4.0</data>
<data key="r">192</data>
<data key="g">192</data>
<data key="b">192</data>
<data key="x">113.91275</data>
<data key="y">253.50586</data>
</node>
<node id="38.0">
<data key="label">CentralMichigan</data>
<data key="value">6.0</data>
<data key="size">4.0</data>
<data key="r">192</data>
<data key="g">192</data>
<data key="b">192</data>
<data key="x">-104.70904</data>
<data key="y">76.0199</data>
</node>
<node id="39.0">
<data key="label">Purdue</data>
<data key="value">2.0</data>
<data key="size">4.0</data>
<data key="r">192</data>
<data key="g">192</data>
<data key="b">192</data>
<data key="x">-218.8449</data>
<data key="y">32.55639</data>
</node>
<node id="40.0">
<data key="label">Colorado</data>
<data key="value">3.0</data>
<data key="size">4.0</data>
<data key="r">192</data>
<data key="g">192</data>
<data key="b">192</data>
<data key="x">-120.71485</data>
<data key="y">-217.31723</data>
</node>
<node id="41.0">
<data key="label">ColoradoState</data>
<data key="value">7.0</data>
<data key="size">4.0</data>
<data key="r">192</data>
<data key="g">192</data>
<data key="b">192</data>
<data key="x">91.92447</data>
<data key="y">-230.42484</data>
</node>
<node id="42.0">
<data key="label">Connecticut</data>
<data key="value">5.0</data>
<data key="size">4.0</data>
<data key="r">192</data>
<data key="g">192</data>
<data key="b">192</data>
<data key="x">-42.117107</data>
<data key="y">266.63483</data>
</node>
<node id="43.0">
<data key="label">EasternMichigan</data>
<data key="value">6.0</data>
<data key="size">4.0</data>
<data key="r">192</data>
<data key="g">192</data>
<data key="b">192</data>
<data key="x">-81.67245</data>
<data key="y">211.34386</data>
</node>
<node id="44.0">
<data key="label">EastCarolina</data>
<data key="value">4.0</data>
<data key="size">4.0</data>
<data key="r">192</data>
<data key="g">192</data>
<data key="b">192</data>
<data key="x">97.07093</data>
<data key="y">133.43733</data>
</node>
<node id="45.0">
<data key="label">Duke</data>
<data key="value">0.0</data>
<data key="size">4.0</data>
<data key="r">192</data>
<data key="g">192</data>
<data key="b">192</data>
<data key="x">42.25444</data>
<data key="y">236.52977</data>
</node>
<node id="46.0">
<data key="label">FresnoState</data>
<data key="value">11.0</data>
<data key="size">4.0</data>
<data key="r">192</data>
<data key="g">192</data>
<data key="b">192</data>
<data key="x">-43.56697</data>
<data key="y">-176.27287</data>
</node>
<node id="47.0">
<data key="label">OhioState</data>
<data key="value">2.0</data>
<data key="size">4.0</data>
<data key="r">192</data>
<data key="g">192</data>
<data key="b">192</data>
<data key="x">-189.70506</data>
<data key="y">-86.325165</data>
</node>
<node id="48.0">
<data key="label">Houston</data>
<data key="value">4.0</data>
<data key="size">4.0</data>
<data key="r">192</data>
<data key="g">192</data>
<data key="b">192</data>
<data key="x">110.93478</data>
<data key="y">-3.0732336</data>
</node>
<node id="49.0">
<data key="label">Rice</data>
<data key="value">11.0</data>
<data key="size">4.0</data>
<data key="r">192</data>
<data key="g">192</data>
<data key="b">192</data>
<data key="x">-24.996866</data>
<data key="y">-116.38979</data>
</node>
<node id="50.0">
<data key="label">Idaho</data>
<data key="value">10.0</data>
<data key="size">4.0</data>
<data key="r">192</data>
<data key="g">192</data>
<data key="b">192</data>
<data key="x">87.57811</data>
<data key="y">-152.5697</data>
</node>
<node id="51.0">
<data key="label">Washington</data>
<data key="value">8.0</data>
<data key="size">4.0</data>
<data key="r">192</data>
<data key="g">192</data>
<data key="b">192</data>
<data key="x">-20.282904</data>
<data key="y">-234.35349</data>
</node>
<node id="52.0">
<data key="label">Kansas</data>
<data key="value">3.0</data>
<data key="size">4.0</data>
<data key="r">192</data>
<data key="g">192</data>
<data key="b">192</data>
<data key="x">-82.9974</data>
<data key="y">-127.43126</data>
</node>
<node id="53.0">
<data key="label">SouthernMethodist</data>
<data key="value">11.0</data>
<data key="size">4.0</data>
<data key="r">192</data>
<data key="g">192</data>
<data key="b">192</data>
<data key="x">36.58752</data>
<data key="y">-73.80364</data>
</node>
<node id="54.0">
<data key="label">Kent</data>
<data key="value">6.0</data>
<data key="size">4.0</data>
<data key="r">192</data>
<data key="g">192</data>
<data key="b">192</data>
<data key="x">-253.27908</data>
<data key="y">170.80061</data>
</node>
<node id="55.0">
<data key="label">Pittsburgh</data>
<data key="value">1.0</data>
<data key="size">4.0</data>
<data key="r">192</data>
<data key="g">192</data>
<data key="b">192</data>
<data key="x">-137.71873</data>
<data key="y">187.95274</data>
</node>
<node id="56.0">
<data key="label">Kentucky</data>
<data key="value">9.0</data>
<data key="size">4.0</data>
<data key="r">192</data>
<data key="g">192</data>
<data key="b">192</data>
<data key="x">202.3194</data>
<data key="y">130.96211</data>
</node>
<node id="57.0">
<data key="label">Louisville</data>
<data key="value">4.0</data>
<data key="size">4.0</data>
<data key="r">192</data>
<data key="g">192</data>
<data key="b">192</data>
<data key="x">128.09386</data>
<data key="y">138.93803</data>
</node>
<node id="58.0">
<data key="label">LouisianaTech</data>
<data key="value">11.0</data>
<data key="size">4.0</data>
<data key="r">192</data>
<data key="g">192</data>
<data key="b">192</data>
<data key="x">-3.0086749</data>
<data key="y">26.027761</data>
</node>
<node id="59.0">
<data key="label">LouisianaMonroe</data>
<data key="value">10.0</data>
<data key="size">4.0</data>
<data key="r">192</data>
<data key="g">192</data>
<data key="b">192</data>
<data key="x">98.15017</data>
<data key="y">79.935394</data>
</node>
<node id="60.0">
<data key="label">Minnesota</data>
<data key="value">2.0</data>
<data key="size">4.0</data>
<data key="r">192</data>
<data key="g">192</data>
<data key="b">192</data>
<data key="x">-147.37233</data>
<data key="y">6.646675</data>
</node>
<node id="61.0">
<data key="label">MiamiOhio</data>
<data key="value">6.0</data>
<data key="size">4.0</data>
<data key="r">192</data>
<data key="g">192</data>
<data key="b">192</data>
<data key="x">-133.89294</data>
<data key="y">140.50793</data>
</node>
<node id="62.0">
<data key="label">Vanderbilt</data>
<data key="value">9.0</data>
<data key="size">4.0</data>
<data key="r">192</data>
<data key="g">192</data>
<data key="b">192</data>
<data key="x">149.71907</data>
<data key="y">177.26627</data>
</node>
<node id="63.0">
<data key="label">MiddleTennesseeState</data>
<data key="value">10.0</data>
<data key="size">4.0</data>
<data key="r">192</data>
<data key="g">192</data>
<data key="b">192</data>
<data key="x">61.05836</data>
<data key="y">110.67067</data>
</node>
<node id="64.0">
<data key="label">Illinois</data>
<data key="value">2.0</data>
<data key="size">4.0</data>
<data key="r">192</data>
<data key="g">192</data>
<data key="b">192</data>
<data key="x">-98.65777</data>
<data key="y">-68.44999</data>
</node>
<node id="65.0">
<data key="label">MississippiState</data>
<data key="value">9.0</data>
<data key="size">4.0</data>
<data key="r">192</data>
<data key="g">192</data>
<data key="b">192</data>
<data key="x">236.54207</data>
<data key="y">89.92804</data>
</node>
<node id="66.0">
<data key="label">Memphis</data>
<data key="value">4.0</data>
<data key="size">4.0</data>
<data key="r">192</data>
<data key="g">192</data>
<data key="b">192</data>
<data key="x">191.77011</data>
<data key="y">58.692535</data>
</node>
<node id="67.0">
<data key="label">Nevada</data>
<data key="value">11.0</data>
<data key="size">4.0</data>
<data key="r">192</data>
<data key="g">192</data>
<data key="b">192</data>
<data key="x">36.55442</data>
<data key="y">-189.97752</data>
</node>
<node id="68.0">
<data key="label">Oregon</data>
<data key="value">8.0</data>
<data key="size">4.0</data>
<data key="r">192</data>
<data key="g">192</data>
<data key="b">192</data>
<data key="x">-26.743082</data>
<data key="y">-268.54688</data>
</node>
<node id="69.0">
<data key="label">NewMexicoState</data>
<data key="value">10.0</data>
<data key="size">4.0</data>
<data key="r">192</data>
<data key="g">192</data>
<data key="b">192</data>
<data key="x">173.05127</data>
<data key="y">-65.48503</data>
</node>
<node id="70.0">
<data key="label">SouthCarolina</data>
<data key="value">9.0</data>
<data key="size">4.0</data>
<data key="r">192</data>
<data key="g">192</data>
<data key="b">192</data>
<data key="x">176.06023</data>
<data key="y">140.3342</data>
</node>
<node id="71.0">
<data key="label">Ohio</data>
<data key="value">6.0</data>
<data key="size">4.0</data>
<data key="r">192</data>
<data key="g">192</data>
<data key="b">192</data>
<data key="x">-237.86937</data>
<data key="y">107.2926</data>
</node>
<node id="72.0">
<data key="label">IowaState</data>
<data key="value">3.0</data>
<data key="size">4.0</data>
<data key="r">192</data>
<data key="g">192</data>
<data key="b">192</data>
<data key="x">-157.6913</data>
<data key="y">-119.58107</data>
</node>
<node id="73.0">
<data key="label">SanJoseState</data>
<data key="value">11.0</data>
<data key="size">4.0</data>
<data key="r">192</data>
<data key="g">192</data>
<data key="b">192</data>
<data key="x">-47.428284</data>
<data key="y">-201.06976</data>
</node>
<node id="74.0">
<data key="label">Nebraska</data>
<data key="value">3.0</data>
<data key="size">4.0</data>
<data key="r">192</data>
<data key="g">192</data>
<data key="b">192</data>
<data key="x">-174.0036</data>
<data key="y">-169.5375</data>
</node>
<node id="75.0">
<data key="label">SouthernMississippi</data>
<data key="value">4.0</data>
<data key="size">4.0</data>
<data key="r">192</data>
<data key="g">192</data>
<data key="b">192</data>
<data key="x">153.07375</data>
<data key="y">20.178982</data>
</node>
<node id="76.0">
<data key="label">Tennessee</data>
<data key="value">9.0</data>
<data key="size">4.0</data>
<data key="r">192</data>
<data key="g">192</data>
<data key="b">192</data>
<data key="x">259.56415</data>
<data key="y">121.24259</data>
</node>
<node id="77.0">
<data key="label">Stanford</data>
<data key="value">8.0</data>
<data key="size">4.0</data>
<data key="r">192</data>
<data key="g">192</data>
<data key="b">192</data>
<data key="x">-66.29765</data>
<data key="y">-284.25717</data>
</node>
<node id="78.0">
<data key="label">WashingtonState</data>
<data key="value">8.0</data>
<data key="size">4.0</data>
<data key="r">192</data>
<data key="g">192</data>
<data key="b">192</data>
<data key="x">50.33392</data>
<data key="y">-296.59668</data>
</node>
<node id="79.0">
<data key="label">Temple</data>
<data key="value">1.0</data>
<data key="size">4.0</data>
<data key="r">192</data>
<data key="g">192</data>
<data key="b">192</data>
<data key="x">-86.77198</data>
<data key="y">237.91019</data>
</node>
<node id="80.0">
<data key="label">Navy</data>
<data key="value">5.0</data>
<data key="size">4.0</data>
<data key="r">192</data>
<data key="g">192</data>
<data key="b">192</data>
<data key="x">5.2164693</data>
<data key="y">107.68996</data>
</node>
<node id="81.0">
<data key="label">TexasA&amp;M</data>
<data key="value">3.0</data>
<data key="size">4.0</data>
<data key="r">192</data>
<data key="g">192</data>
<data key="b">192</data>
<data key="x">-105.372025</data>
<data key="y">-181.312</data>
</node>
<node id="82.0">
<data key="label">NotreDame</data>
<data key="value">5.0</data>
<data key="size">4.0</data>
<data key="r">192</data>
<data key="g">192</data>
<data key="b">192</data>
<data key="x">-92.86347</data>
<data key="y">-39.20769</data>
</node>
<node id="83.0">
<data key="label">TexasElPaso</data>
<data key="value">11.0</data>
<data key="size">4.0</data>
<data key="r">192</data>
<data key="g">192</data>
<data key="b">192</data>
<data key="x">21.015842</data>
<data key="y">-159.50287</data>
</node>
<node id="84.0">
<data key="label">Oklahoma</data>
<data key="value">3.0</data>
<data key="size">4.0</data>
<data key="r">192</data>
<data key="g">192</data>
<data key="b">192</data>
<data key="x">-74.40649</data>
<data key="y">-189.53325</data>
</node>
<node id="85.0">
<data key="label">Toledo</data>
<data key="value">6.0</data>
<data key="size">4.0</data>
<data key="r">192</data>
<data key="g">192</data>
<data key="b">192</data>
<data key="x">-176.26987</data>
<data key="y">157.28882</data>
</node>
<node id="86.0">
<data key="label">Tulane</data>
<data key="value">4.0</data>
<data key="size">4.0</data>
<data key="r">192</data>
<data key="g">192</data>
<data key="b">192</data>
<data key="x">140.57028</data>
<data key="y">49.907936</data>
</node>
<node id="87.0">
<data key="label">Mississippi</data>
<data key="value">9.0</data>
<data key="size">4.0</data>
<data key="r">192</data>
<data key="g">192</data>
<data key="b">192</data>
<data key="x">238.30142</data>
<data key="y">22.950054</data>
</node>
<node id="88.0">
<data key="label">Tulsa</data>
<data key="value">11.0</data>
<data key="size">4.0</data>
<data key="r">192</data>
<data key="g">192</data>
<data key="b">192</data>
<data key="x">11.558917</data>
<data key="y">-54.56632</data>
</node>
<node id="89.0">
<data key="label">NorthCarolina</data>
<data key="value">0.0</data>
<data key="size">4.0</data>
<data key="r">192</data>
<data key="g">192</data>
<data key="b">192</data>
<data key="x">-7.311025</data>
<data key="y">214.95995</data>
</node>
<node id="90.0">
<data key="label">UtahState</data>
<data key="value">5.0</data>
<data key="size">4.0</data>
<data key="r">192</data>
<data key="g">192</data>
<data key="b">192</data>
<data key="x">160.62766</data>
<data key="y">-196.475</data>
</node>
<node id="91.0">
<data key="label">Army</data>
<data key="value">4.0</data>
<data key="size">4.0</data>
<data key="r">192</data>
<data key="g">192</data>
<data key="b">192</data>
<data key="x">101.6608</data>
<data key="y">54.79824</data>
</node>
<node id="92.0">
<data key="label">Cincinnati</data>
<data key="value">4.0</data>
<data key="size">4.0</data>
<data key="r">192</data>
<data key="g">192</data>
<data key="b">192</data>
<data key="x">35.784626</data>
<data key="y">64.29311</data>
</node>
<node id="93.0">
<data key="label">AirForce</data>
<data key="value">7.0</data>
<data key="size">4.0</data>
<data key="r">192</data>
<data key="g">192</data>
<data key="b">192</data>
<data key="x">93.72138</data>
<data key="y">-102.67963</data>
</node>
<node id="94.0">
<data key="label">Rutgers</data>
<data key="value">1.0</data>
<data key="size">4.0</data>
<data key="r">192</data>
<data key="g">192</data>
<data key="b">192</data>
<data key="x">-111.2237</data>
<data key="y">162.39996</data>
</node>
<node id="95.0">
<data key="label">Georgia</data>
<data key="value">9.0</data>
<data key="size">4.0</data>
<data key="r">192</data>
<data key="g">192</data>
<data key="b">192</data>
<data key="x">252.09666</data>
<data key="y">144.52057</data>
</node>
<node id="96.0">
<data key="label">LouisianaState</data>
<data key="value">9.0</data>
<data key="size">4.0</data>
<data key="r">192</data>
<data key="g">192</data>
<data key="b">192</data>
<data key="x">267.87286</data>
<data key="y">79.37855</data>
</node>
<node id="97.0">
<data key="label">LouisianaLafayette</data>
<data key="value">10.0</data>
<data key="size">4.0</data>
<data key="r">192</data>
<data key="g">192</data>
<data key="b">192</data>
<data key="x">65.62932</data>
<data key="y">-39.322678</data>
</node>
<node id="98.0">
<data key="label">Texas</data>
<data key="value">3.0</data>
<data key="size">4.0</data>
<data key="r">192</data>
<data key="g">192</data>
<data key="b">192</data>
<data key="x">-51.826653</data>
<data key="y">-151.84007</data>
</node>
<node id="99.0">
<data key="label">Marshall</data>
<data key="value">6.0</data>
<data key="size">4.0</data>
<data key="r">192</data>
<data key="g">192</data>
<data key="b">192</data>
<data key="x">-230.79288</data>
<data key="y">201.20502</data>
</node>
<node id="100.0">
<data key="label">MichiganState</data>
<data key="value">2.0</data>
<data key="size">4.0</data>
<data key="r">192</data>
<data key="g">192</data>
<data key="b">192</data>
<data key="x">-236.07037</data>
<data key="y">2.625467</data>
</node>
<node id="101.0">
<data key="label">MiamiFlorida</data>
<data key="value">1.0</data>
<data key="size">4.0</data>
<data key="r">192</data>
<data key="g">192</data>
<data key="b">192</data>
<data key="x">-50.488914</data>
<data key="y">86.60491</data>
</node>
<node id="102.0">
<data key="label">Missouri</data>
<data key="value">3.0</data>
<data key="size">4.0</data>
<data key="r">192</data>
<data key="g">192</data>
<data key="b">192</data>
<data key="x">-134.5453</data>
<data key="y">-67.23183</data>
</node>
<node id="103.0">
<data key="label">Clemson</data>
<data key="value">0.0</data>
<data key="size">4.0</data>
<data key="r">192</data>
<data key="g">192</data>
<data key="b">192</data>
<data key="x">43.059486</data>
<data key="y">185.93668</data>
</node>
<node id="104.0">
<data key="label">NevadaLasVegas</data>
<data key="value">7.0</data>
<data key="size">4.0</data>
<data key="r">192</data>
<data key="g">192</data>
<data key="b">192</data>
<data key="x">110.69472</data>
<data key="y">-156.0011</data>
</node>
<node id="105.0">
<data key="label">WakeForest</data>
<data key="value">0.0</data>
<data key="size">4.0</data>
<data key="r">192</data>
<data key="g">192</data>
<data key="b">192</data>
<data key="x">85.87181</data>
<data key="y">277.46545</data>
</node>
<node id="106.0">
<data key="label">Indiana</data>
<data key="value">2.0</data>
<data key="size">4.0</data>
<data key="r">192</data>
<data key="g">192</data>
<data key="b">192</data>
<data key="x">-71.91984</data>
<data key="y">40.666412</data>
</node>
<node id="107.0">
<data key="label">OklahomaState</data>
<data key="value">3.0</data>
<data key="size">4.0</data>
<data key="r">192</data>
<data key="g">192</data>
<data key="b">192</data>
<data key="x">-56.853203</data>
<data key="y">-118.991684</data>
</node>
<node id="108.0">
<data key="label">OregonState</data>
<data key="value">8.0</data>
<data key="size">4.0</data>
<data key="r">192</data>
<data key="g">192</data>
<data key="b">192</data>
<data key="x">12.532512</data>
<data key="y">-339.79007</data>
</node>
<node id="109.0">
<data key="label">Maryland</data>
<data key="value">0.0</data>
<data key="size">4.0</data>
<data key="r">192</data>
<data key="g">192</data>
<data key="b">192</data>
<data key="x">40.450886</data>
<data key="y">268.9987</data>
</node>
<node id="110.0">
<data key="label">TexasChristian</data>
<data key="value">4.0</data>
<data key="size">4.0</data>
<data key="r">192</data>
<data key="g">192</data>
<data key="b">192</data>
<data key="x">-17.367054</data>
<data key="y">-72.135475</data>
</node>
<node id="111.0">
<data key="label">California</data>
<data key="value">8.0</data>
<data key="size">4.0</data>
<data key="r">192</data>
<data key="g">192</data>
<data key="b">192</data>
<data key="x">-16.121363</data>
<data key="y">-296.77216</data>
</node>
<node id="112.0">
<data key="label">AlabamaBirmingham</data>
<data key="value">4.0</data>
<data key="size">4.0</data>
<data key="r">192</data>
<data key="g">192</data>
<data key="b">192</data>
<data key="x">113.26626</data>
<data key="y">26.293497</data>
</node>
<node id="113.0">
<data key="label">Arkansas</data>
<data key="value">9.0</data>
<data key="size">4.0</data>
<data key="r">192</data>
<data key="g">192</data>
<data key="b">192</data>
<data key="x">267.13745</data>
<data key="y">44.758045</data>
</node>
<node id="114.0">
<data key="label">Hawaii</data>
<data key="value">11.0</data>
<data key="size">4.0</data>
<data key="r">192</data>
<data key="g">192</data>
<data key="b">192</data>
<data key="x">0.75219953</data>
<data key="y">-119.947205</data>
</node>
<edge source="1.0" target="0.0">
<data key="edgeid">1467</data>
<data key="weight">1.0</data>
</edge>
<edge source="3.0" target="2.0">
<data key="edgeid">1468</data>
<data key="weight">1.0</data>
</edge>
<edge source="4.0" target="0.0">
<data key="edgeid">1469</data>
<data key="weight">1.0</data>
</edge>
<edge source="5.0" target="4.0">
<data key="edgeid">1470</data>
<data key="weight">1.0</data>
</edge>
<edge source="5.0" target="3.0">
<data key="edgeid">1471</data>
<data key="weight">1.0</data>
</edge>
<edge source="6.0" target="2.0">
<data key="edgeid">1472</data>
<data key="weight">1.0</data>
</edge>
<edge source="7.0" target="6.0">
<data key="edgeid">1473</data>
<data key="weight">1.0</data>
</edge>
<edge source="8.0" target="7.0">
<data key="edgeid">1474</data>
<data key="weight">1.0</data>
</edge>
<edge source="9.0" target="8.0">
<data key="edgeid">1475</data>
<data key="weight">1.0</data>
</edge>
<edge source="9.0" target="0.0">
<data key="edgeid">1476</data>
<data key="weight">1.0</data>
</edge>
<edge source="9.0" target="4.0">
<data key="edgeid">1477</data>
<data key="weight">1.0</data>
</edge>
<edge source="10.0" target="5.0">
<data key="edgeid">1478</data>
<data key="weight">1.0</data>
</edge>
<edge source="11.0" target="10.0">
<data key="edgeid">1479</data>
<data key="weight">1.0</data>
</edge>
<edge source="11.0" target="5.0">
<data key="edgeid">1480</data>
<data key="weight">1.0</data>
</edge>
<edge source="11.0" target="3.0">
<data key="edgeid">1481</data>
<data key="weight">1.0</data>
</edge>
<edge source="13.0" target="12.0">
<data key="edgeid">1482</data>
<data key="weight">1.0</data>
</edge>
<edge source="13.0" target="2.0">
<data key="edgeid">1483</data>
<data key="weight">1.0</data>
</edge>
<edge source="14.0" target="2.0">
<data key="edgeid">1484</data>
<data key="weight">1.0</data>
</edge>
<edge source="14.0" target="12.0">
<data key="edgeid">1485</data>
<data key="weight">1.0</data>
</edge>
<edge source="15.0" target="14.0">
<data key="edgeid">1486</data>
<data key="weight">1.0</data>
</edge>
<edge source="15.0" target="13.0">
<data key="edgeid">1487</data>
<data key="weight">1.0</data>
</edge>
<edge source="15.0" target="2.0">
<data key="edgeid">1488</data>
<data key="weight">1.0</data>
</edge>
<edge source="16.0" target="4.0">
<data key="edgeid">1489</data>
<data key="weight">1.0</data>
</edge>
<edge source="16.0" target="9.0">
<data key="edgeid">1490</data>
<data key="weight">1.0</data>
</edge>
<edge source="16.0" target="0.0">
<data key="edgeid">1491</data>
<data key="weight">1.0</data>
</edge>
<edge source="17.0" target="16.0">
<data key="edgeid">1492</data>
<data key="weight">1.0</data>
</edge>
<edge source="17.0" target="12.0">
<data key="edgeid">1493</data>
<data key="weight">1.0</data>
</edge>
<edge source="18.0" target="12.0">
<data key="edgeid">1494</data>
<data key="weight">1.0</data>
</edge>
<edge source="19.0" target="18.0">
<data key="edgeid">1495</data>
<data key="weight">1.0</data>
</edge>
<edge source="20.0" target="17.0">
<data key="edgeid">1496</data>
<data key="weight">1.0</data>
</edge>
<edge source="21.0" target="20.0">
<data key="edgeid">1497</data>
<data key="weight">1.0</data>
</edge>
<edge source="21.0" target="8.0">
<data key="edgeid">1498</data>
<data key="weight">1.0</data>
</edge>
<edge source="21.0" target="7.0">
<data key="edgeid">1499</data>
<data key="weight">1.0</data>
</edge>
<edge source="22.0" target="9.0">
<data key="edgeid">1500</data>
<data key="weight">1.0</data>
</edge>
<edge source="22.0" target="7.0">
<data key="edgeid">1501</data>
<data key="weight">1.0</data>
</edge>
<edge source="22.0" target="21.0">
<data key="edgeid">1502</data>
<data key="weight">1.0</data>
</edge>
<edge source="22.0" target="8.0">
<data key="edgeid">1503</data>
<data key="weight">1.0</data>
</edge>
<edge source="23.0" target="22.0">
<data key="edgeid">1504</data>
<data key="weight">1.0</data>
</edge>
<edge source="23.0" target="9.0">
<data key="edgeid">1505</data>
<data key="weight">1.0</data>
</edge>
<edge source="23.0" target="4.0">
<data key="edgeid">1506</data>
<data key="weight">1.0</data>
</edge>
<edge source="23.0" target="16.0">
<data key="edgeid">1507</data>
<data key="weight">1.0</data>
</edge>
<edge source="23.0" target="0.0">
<data key="edgeid">1508</data>
<data key="weight">1.0</data>
</edge>
<edge source="24.0" target="11.0">
<data key="edgeid">1509</data>
<data key="weight">1.0</data>
</edge>
<edge source="25.0" target="24.0">
<data key="edgeid">1510</data>
<data key="weight">1.0</data>
</edge>
<edge source="25.0" target="1.0">
<data key="edgeid">1511</data>
<data key="weight">1.0</data>
</edge>
<edge source="26.0" target="3.0">
<data key="edgeid">1512</data>
<data key="weight">1.0</data>
</edge>
<edge source="26.0" target="12.0">
<data key="edgeid">1513</data>
<data key="weight">1.0</data>
</edge>
<edge source="26.0" target="14.0">
<data key="edgeid">1514</data>
<data key="weight">1.0</data>
</edge>
<edge source="27.0" target="26.0">
<data key="edgeid">1515</data>
<data key="weight">1.0</data>
</edge>
<edge source="27.0" target="17.0">
<data key="edgeid">1516</data>
<data key="weight">1.0</data>
</edge>
<edge source="27.0" target="1.0">
<data key="edgeid">1517</data>
<data key="weight">1.0</data>
</edge>
<edge source="28.0" target="4.0">
<data key="edgeid">1518</data>
<data key="weight">1.0</data>
</edge>
<edge source="28.0" target="11.0">
<data key="edgeid">1519</data>
<data key="weight">1.0</data>
</edge>
<edge source="28.0" target="24.0">
<data key="edgeid">1520</data>
<data key="weight">1.0</data>
</edge>
<edge source="29.0" target="19.0">
<data key="edgeid">1521</data>
<data key="weight">1.0</data>
</edge>
<edge source="30.0" target="29.0">
<data key="edgeid">1522</data>
<data key="weight">1.0</data>
</edge>
<edge source="30.0" target="19.0">
<data key="edgeid">1523</data>
<data key="weight">1.0</data>
</edge>
<edge source="31.0" target="18.0">
<data key="edgeid">1524</data>
<data key="weight">1.0</data>
</edge>
<edge source="32.0" target="31.0">
<data key="edgeid">1525</data>
<data key="weight">1.0</data>
</edge>
<edge source="32.0" target="21.0">
<data key="edgeid">1526</data>
<data key="weight">1.0</data>
</edge>
<edge source="32.0" target="15.0">
<data key="edgeid">1527</data>
<data key="weight">1.0</data>
</edge>
<edge source="32.0" target="13.0">
<data key="edgeid">1528</data>
<data key="weight">1.0</data>
</edge>
<edge source="32.0" target="6.0">
<data key="edgeid">1529</data>
<data key="weight">1.0</data>
</edge>
<edge source="33.0" target="0.0">
<data key="edgeid">1530</data>
<data key="weight">1.0</data>
</edge>
<edge source="33.0" target="1.0">
<data key="edgeid">1531</data>
<data key="weight">1.0</data>
</edge>
<edge source="33.0" target="25.0">
<data key="edgeid">1532</data>
<data key="weight">1.0</data>
</edge>
<edge source="33.0" target="19.0">
<data key="edgeid">1533</data>
<data key="weight">1.0</data>
</edge>
<edge source="34.0" target="31.0">
<data key="edgeid">1534</data>
<data key="weight">1.0</data>
</edge>
<edge source="34.0" target="26.0">
<data key="edgeid">1535</data>
<data key="weight">1.0</data>
</edge>
<edge source="34.0" target="12.0">
<data key="edgeid">1536</data>
<data key="weight">1.0</data>
</edge>
<edge source="34.0" target="18.0">
<data key="edgeid">1537</data>
<data key="weight">1.0</data>
</edge>
<edge source="35.0" target="34.0">
<data key="edgeid">1538</data>
<data key="weight">1.0</data>
</edge>
<edge source="35.0" target="0.0">
<data key="edgeid">1539</data>
<data key="weight">1.0</data>
</edge>
<edge source="35.0" target="29.0">
<data key="edgeid">1540</data>
<data key="weight">1.0</data>
</edge>
<edge source="35.0" target="19.0">
<data key="edgeid">1541</data>
<data key="weight">1.0</data>
</edge>
<edge source="35.0" target="30.0">
<data key="edgeid">1542</data>
<data key="weight">1.0</data>
</edge>
<edge source="36.0" target="18.0">
<data key="edgeid">1543</data>
<data key="weight">1.0</data>
</edge>
<edge source="36.0" target="12.0">
<data key="edgeid">1544</data>
<data key="weight">1.0</data>
</edge>
<edge source="36.0" target="20.0">
<data key="edgeid">1545</data>
<data key="weight">1.0</data>
</edge>
<edge source="36.0" target="19.0">
<data key="edgeid">1546</data>
<data key="weight">1.0</data>
</edge>
<edge source="37.0" target="36.0">
<data key="edgeid">1547</data>
<data key="weight">1.0</data>
</edge>
<edge source="37.0" target="1.0">
<data key="edgeid">1548</data>
<data key="weight">1.0</data>
</edge>
<edge source="37.0" target="25.0">
<data key="edgeid">1549</data>
<data key="weight">1.0</data>
</edge>
<edge source="37.0" target="33.0">
<data key="edgeid">1550</data>
<data key="weight">1.0</data>
</edge>
<edge source="38.0" target="18.0">
<data key="edgeid">1551</data>
<data key="weight">1.0</data>
</edge>
<edge source="38.0" target="16.0">
<data key="edgeid">1552</data>
<data key="weight">1.0</data>
</edge>
<edge source="38.0" target="28.0">
<data key="edgeid">1553</data>
<data key="weight">1.0</data>
</edge>
<edge source="38.0" target="26.0">
<data key="edgeid">1554</data>
<data key="weight">1.0</data>
</edge>
<edge source="38.0" target="14.0">
<data key="edgeid">1555</data>
<data key="weight">1.0</data>
</edge>
<edge source="38.0" target="12.0">
<data key="edgeid">1556</data>
<data key="weight">1.0</data>
</edge>
<edge source="39.0" target="38.0">
<data key="edgeid">1557</data>
<data key="weight">1.0</data>
</edge>
<edge source="39.0" target="6.0">
<data key="edgeid">1558</data>
<data key="weight">1.0</data>
</edge>
<edge source="39.0" target="32.0">
<data key="edgeid">1559</data>
<data key="weight">1.0</data>
</edge>
<edge source="39.0" target="13.0">
<data key="edgeid">1560</data>
<data key="weight">1.0</data>
</edge>
<edge source="39.0" target="15.0">
<data key="edgeid">1561</data>
<data key="weight">1.0</data>
</edge>
<edge source="40.0" target="7.0">
<data key="edgeid">1562</data>
<data key="weight">1.0</data>
</edge>
<edge source="40.0" target="3.0">
<data key="edgeid">1563</data>
<data key="weight">1.0</data>
</edge>
<edge source="41.0" target="40.0">
<data key="edgeid">1564</data>
<data key="weight">1.0</data>
</edge>
<edge source="41.0" target="8.0">
<data key="edgeid">1565</data>
<data key="weight">1.0</data>
</edge>
<edge source="41.0" target="4.0">
<data key="edgeid">1566</data>
<data key="weight">1.0</data>
</edge>
<edge source="41.0" target="23.0">
<data key="edgeid">1567</data>
<data key="weight">1.0</data>
</edge>
<edge source="41.0" target="9.0">
<data key="edgeid">1568</data>
<data key="weight">1.0</data>
</edge>
<edge source="41.0" target="0.0">
<data key="edgeid">1569</data>
<data key="weight">1.0</data>
</edge>
<edge source="41.0" target="16.0">
<data key="edgeid">1570</data>
<data key="weight">1.0</data>
</edge>
<edge source="42.0" target="34.0">
<data key="edgeid">1571</data>
<data key="weight">1.0</data>
</edge>
<edge source="42.0" target="29.0">
<data key="edgeid">1572</data>
<data key="weight">1.0</data>
</edge>
<edge source="42.0" target="18.0">
<data key="edgeid">1573</data>
<data key="weight">1.0</data>
</edge>
<edge source="42.0" target="26.0">
<data key="edgeid">1574</data>
<data key="weight">1.0</data>
</edge>
<edge source="43.0" target="42.0">
<data key="edgeid">1575</data>
<data key="weight">1.0</data>
</edge>
<edge source="43.0" target="36.0">
<data key="edgeid">1576</data>
<data key="weight">1.0</data>
</edge>
<edge source="43.0" target="26.0">
<data key="edgeid">1577</data>
<data key="weight">1.0</data>
</edge>
<edge source="43.0" target="31.0">
<data key="edgeid">1578</data>
<data key="weight">1.0</data>
</edge>
<edge source="43.0" target="38.0">
<data key="edgeid">1579</data>
<data key="weight">1.0</data>
</edge>
<edge source="43.0" target="12.0">
<data key="edgeid">1580</data>
<data key="weight">1.0</data>
</edge>
<edge source="43.0" target="14.0">
<data key="edgeid">1581</data>
<data key="weight">1.0</data>
</edge>
<edge source="44.0" target="19.0">
<data key="edgeid">1582</data>
<data key="weight">1.0</data>
</edge>
<edge source="44.0" target="35.0">
<data key="edgeid">1583</data>
<data key="weight">1.0</data>
</edge>
<edge source="44.0" target="30.0">
<data key="edgeid">1584</data>
<data key="weight">1.0</data>
</edge>
<edge source="45.0" target="44.0">
<data key="edgeid">1585</data>
<data key="weight">1.0</data>
</edge>
<edge source="45.0" target="13.0">
<data key="edgeid">1586</data>
<data key="weight">1.0</data>
</edge>
<edge source="45.0" target="33.0">
<data key="edgeid">1587</data>
<data key="weight">1.0</data>
</edge>
<edge source="45.0" target="1.0">
<data key="edgeid">1588</data>
<data key="weight">1.0</data>
</edge>
<edge source="45.0" target="37.0">
<data key="edgeid">1589</data>
<data key="weight">1.0</data>
</edge>
<edge source="45.0" target="25.0">
<data key="edgeid">1590</data>
<data key="weight">1.0</data>
</edge>
<edge source="46.0" target="21.0">
<data key="edgeid">1591</data>
<data key="weight">1.0</data>
</edge>
<edge source="47.0" target="46.0">
<data key="edgeid">1592</data>
<data key="weight">1.0</data>
</edge>
<edge source="47.0" target="22.0">
<data key="edgeid">1593</data>
<data key="weight">1.0</data>
</edge>
<edge source="47.0" target="6.0">
<data key="edgeid">1594</data>
<data key="weight">1.0</data>
</edge>
<edge source="47.0" target="15.0">
<data key="edgeid">1595</data>
<data key="weight">1.0</data>
</edge>
<edge source="47.0" target="2.0">
<data key="edgeid">1596</data>
<data key="weight">1.0</data>
</edge>
<edge source="47.0" target="39.0">
<data key="edgeid">1597</data>
<data key="weight">1.0</data>
</edge>
<edge source="47.0" target="32.0">
<data key="edgeid">1598</data>
<data key="weight">1.0</data>
</edge>
<edge source="48.0" target="44.0">
<data key="edgeid">1599</data>
<data key="weight">1.0</data>
</edge>
<edge source="49.0" target="48.0">
<data key="edgeid">1600</data>
<data key="weight">1.0</data>
</edge>
<edge source="49.0" target="32.0">
<data key="edgeid">1601</data>
<data key="weight">1.0</data>
</edge>
<edge source="49.0" target="46.0">
<data key="edgeid">1602</data>
<data key="weight">1.0</data>
</edge>
<edge source="50.0" target="30.0">
<data key="edgeid">1603</data>
<data key="weight">1.0</data>
</edge>
<edge source="50.0" target="24.0">
<data key="edgeid">1604</data>
<data key="weight">1.0</data>
</edge>
<edge source="50.0" target="11.0">
<data key="edgeid">1605</data>
<data key="weight">1.0</data>
</edge>
<edge source="50.0" target="28.0">
<data key="edgeid">1606</data>
<data key="weight">1.0</data>
</edge>
<edge source="51.0" target="50.0">
<data key="edgeid">1607</data>
<data key="weight">1.0</data>
</edge>
<edge source="51.0" target="40.0">
<data key="edgeid">1608</data>
<data key="weight">1.0</data>
</edge>
<edge source="51.0" target="8.0">
<data key="edgeid">1609</data>
<data key="weight">1.0</data>
</edge>
<edge source="51.0" target="22.0">
<data key="edgeid">1610</data>
<data key="weight">1.0</data>
</edge>
<edge source="51.0" target="21.0">
<data key="edgeid">1611</data>
<data key="weight">1.0</data>
</edge>
<edge source="52.0" target="3.0">
<data key="edgeid">1612</data>
<data key="weight">1.0</data>
</edge>
<edge source="52.0" target="40.0">
<data key="edgeid">1613</data>
<data key="weight">1.0</data>
</edge>
<edge source="52.0" target="5.0">
<data key="edgeid">1614</data>
<data key="weight">1.0</data>
</edge>
<edge source="53.0" target="52.0">
<data key="edgeid">1615</data>
<data key="weight">1.0</data>
</edge>
<edge source="53.0" target="25.0">
<data key="edgeid">1616</data>
<data key="weight">1.0</data>
</edge>
<edge source="53.0" target="48.0">
<data key="edgeid">1617</data>
<data key="weight">1.0</data>
</edge>
<edge source="53.0" target="49.0">
<data key="edgeid">1618</data>
<data key="weight">1.0</data>
</edge>
<edge source="53.0" target="46.0">
<data key="edgeid">1619</data>
<data key="weight">1.0</data>
</edge>
<edge source="54.0" target="39.0">
<data key="edgeid">1620</data>
<data key="weight">1.0</data>
</edge>
<edge source="54.0" target="31.0">
<data key="edgeid">1621</data>
<data key="weight">1.0</data>
</edge>
<edge source="54.0" target="38.0">
<data key="edgeid">1622</data>
<data key="weight">1.0</data>
</edge>
<edge source="54.0" target="14.0">
<data key="edgeid">1623</data>
<data key="weight">1.0</data>
</edge>
<edge source="54.0" target="34.0">
<data key="edgeid">1624</data>
<data key="weight">1.0</data>
</edge>
<edge source="54.0" target="18.0">
<data key="edgeid">1625</data>
<data key="weight">1.0</data>
</edge>
<edge source="55.0" target="54.0">
<data key="edgeid">1626</data>
<data key="weight">1.0</data>
</edge>
<edge source="55.0" target="31.0">
<data key="edgeid">1627</data>
<data key="weight">1.0</data>
</edge>
<edge source="55.0" target="6.0">
<data key="edgeid">1628</data>
<data key="weight">1.0</data>
</edge>
<edge source="55.0" target="35.0">
<data key="edgeid">1629</data>
<data key="weight">1.0</data>
</edge>
<edge source="55.0" target="29.0">
<data key="edgeid">1630</data>
<data key="weight">1.0</data>
</edge>
<edge source="55.0" target="19.0">
<data key="edgeid">1631</data>
<data key="weight">1.0</data>
</edge>
<edge source="55.0" target="30.0">
<data key="edgeid">1632</data>
<data key="weight">1.0</data>
</edge>
<edge source="56.0" target="27.0">
<data key="edgeid">1633</data>
<data key="weight">1.0</data>
</edge>
<edge source="57.0" target="56.0">
<data key="edgeid">1634</data>
<data key="weight">1.0</data>
</edge>
<edge source="57.0" target="1.0">
<data key="edgeid">1635</data>
<data key="weight">1.0</data>
</edge>
<edge source="57.0" target="42.0">
<data key="edgeid">1636</data>
<data key="weight">1.0</data>
</edge>
<edge source="57.0" target="44.0">
<data key="edgeid">1637</data>
<data key="weight">1.0</data>
</edge>
<edge source="57.0" target="48.0">
<data key="edgeid">1638</data>
<data key="weight">1.0</data>
</edge>
<edge source="58.0" target="3.0">
<data key="edgeid">1639</data>
<data key="weight">1.0</data>
</edge>
<edge source="58.0" target="6.0">
<data key="edgeid">1640</data>
<data key="weight">1.0</data>
</edge>
<edge source="58.0" target="17.0">
<data key="edgeid">1641</data>
<data key="weight">1.0</data>
</edge>
<edge source="58.0" target="36.0">
<data key="edgeid">1642</data>
<data key="weight">1.0</data>
</edge>
<edge source="59.0" target="36.0">
<data key="edgeid">1643</data>
<data key="weight">1.0</data>
</edge>
<edge source="59.0" target="58.0">
<data key="edgeid">1644</data>
<data key="weight">1.0</data>
</edge>
<edge source="60.0" target="59.0">
<data key="edgeid">1645</data>
<data key="weight">1.0</data>
</edge>
<edge source="60.0" target="10.0">
<data key="edgeid">1646</data>
<data key="weight">1.0</data>
</edge>
<edge source="60.0" target="39.0">
<data key="edgeid">1647</data>
<data key="weight">1.0</data>
</edge>
<edge source="60.0" target="6.0">
<data key="edgeid">1648</data>
<data key="weight">1.0</data>
</edge>
<edge source="60.0" target="47.0">
<data key="edgeid">1649</data>
<data key="weight">1.0</data>
</edge>
<edge source="60.0" target="13.0">
<data key="edgeid">1650</data>
<data key="weight">1.0</data>
</edge>
<edge source="60.0" target="15.0">
<data key="edgeid">1651</data>
<data key="weight">1.0</data>
</edge>
<edge source="60.0" target="2.0">
<data key="edgeid">1652</data>
<data key="weight">1.0</data>
</edge>
<edge source="61.0" target="43.0">
<data key="edgeid">1653</data>
<data key="weight">1.0</data>
</edge>
<edge source="61.0" target="47.0">
<data key="edgeid">1654</data>
<data key="weight">1.0</data>
</edge>
<edge source="61.0" target="54.0">
<data key="edgeid">1655</data>
<data key="weight">1.0</data>
</edge>
<edge source="61.0" target="18.0">
<data key="edgeid">1656</data>
<data key="weight">1.0</data>
</edge>
<edge source="61.0" target="26.0">
<data key="edgeid">1657</data>
<data key="weight">1.0</data>
</edge>
<edge source="61.0" target="31.0">
<data key="edgeid">1658</data>
<data key="weight">1.0</data>
</edge>
<edge source="61.0" target="34.0">
<data key="edgeid">1659</data>
<data key="weight">1.0</data>
</edge>
<edge source="62.0" target="61.0">
<data key="edgeid">1660</data>
<data key="weight">1.0</data>
</edge>
<edge source="62.0" target="20.0">
<data key="edgeid">1661</data>
<data key="weight">1.0</data>
</edge>
<edge source="62.0" target="45.0">
<data key="edgeid">1662</data>
<data key="weight">1.0</data>
</edge>
<edge source="62.0" target="17.0">
<data key="edgeid">1663</data>
<data key="weight">1.0</data>
</edge>
<edge source="62.0" target="27.0">
<data key="edgeid">1664</data>
<data key="weight">1.0</data>
</edge>
<edge source="62.0" target="56.0">
<data key="edgeid">1665</data>
<data key="weight">1.0</data>
</edge>
<edge source="63.0" target="27.0">
<data key="edgeid">1666</data>
<data key="weight">1.0</data>
</edge>
<edge source="63.0" target="58.0">
<data key="edgeid">1667</data>
<data key="weight">1.0</data>
</edge>
<edge source="63.0" target="59.0">
<data key="edgeid">1668</data>
<data key="weight">1.0</data>
</edge>
<edge source="63.0" target="42.0">
<data key="edgeid">1669</data>
<data key="weight">1.0</data>
</edge>
<edge source="64.0" target="63.0">
<data key="edgeid">1670</data>
<data key="weight">1.0</data>
</edge>
<edge source="64.0" target="9.0">
<data key="edgeid">1671</data>
<data key="weight">1.0</data>
</edge>
<edge source="64.0" target="32.0">
<data key="edgeid">1672</data>
<data key="weight">1.0</data>
</edge>
<edge source="64.0" target="60.0">
<data key="edgeid">1673</data>
<data key="weight">1.0</data>
</edge>
<edge source="64.0" target="2.0">
<data key="edgeid">1674</data>
<data key="weight">1.0</data>
</edge>
<edge source="64.0" target="6.0">
<data key="edgeid">1675</data>
<data key="weight">1.0</data>
</edge>
<edge source="64.0" target="47.0">
<data key="edgeid">1676</data>
<data key="weight">1.0</data>
</edge>
<edge source="64.0" target="13.0">
<data key="edgeid">1677</data>
<data key="weight">1.0</data>
</edge>
<edge source="65.0" target="0.0">
<data key="edgeid">1678</data>
<data key="weight">1.0</data>
</edge>
<edge source="65.0" target="27.0">
<data key="edgeid">1679</data>
<data key="weight">1.0</data>
</edge>
<edge source="65.0" target="17.0">
<data key="edgeid">1680</data>
<data key="weight">1.0</data>
</edge>
<edge source="65.0" target="63.0">
<data key="edgeid">1681</data>
<data key="weight">1.0</data>
</edge>
<edge source="65.0" target="56.0">
<data key="edgeid">1682</data>
<data key="weight">1.0</data>
</edge>
<edge source="65.0" target="20.0">
<data key="edgeid">1683</data>
<data key="weight">1.0</data>
</edge>
<edge source="66.0" target="65.0">
<data key="edgeid">1684</data>
<data key="weight">1.0</data>
</edge>
<edge source="66.0" target="59.0">
<data key="edgeid">1685</data>
<data key="weight">1.0</data>
</edge>
<edge source="66.0" target="24.0">
<data key="edgeid">1686</data>
<data key="weight">1.0</data>
</edge>
<edge source="66.0" target="44.0">
<data key="edgeid">1687</data>
<data key="weight">1.0</data>
</edge>
<edge source="66.0" target="48.0">
<data key="edgeid">1688</data>
<data key="weight">1.0</data>
</edge>
<edge source="67.0" target="16.0">
<data key="edgeid">1689</data>
<data key="weight">1.0</data>
</edge>
<edge source="67.0" target="41.0">
<data key="edgeid">1690</data>
<data key="weight">1.0</data>
</edge>
<edge source="67.0" target="46.0">
<data key="edgeid">1691</data>
<data key="weight">1.0</data>
</edge>
<edge source="67.0" target="53.0">
<data key="edgeid">1692</data>
<data key="weight">1.0</data>
</edge>
<edge source="67.0" target="49.0">
<data key="edgeid">1693</data>
<data key="weight">1.0</data>
</edge>
<edge source="68.0" target="67.0">
<data key="edgeid">1694</data>
<data key="weight">1.0</data>
</edge>
<edge source="68.0" target="15.0">
<data key="edgeid">1695</data>
<data key="weight">1.0</data>
</edge>
<edge source="68.0" target="50.0">
<data key="edgeid">1696</data>
<data key="weight">1.0</data>
</edge>
<edge source="68.0" target="21.0">
<data key="edgeid">1697</data>
<data key="weight">1.0</data>
</edge>
<edge source="68.0" target="51.0">
<data key="edgeid">1698</data>
<data key="weight">1.0</data>
</edge>
<edge source="68.0" target="7.0">
<data key="edgeid">1699</data>
<data key="weight">1.0</data>
</edge>
<edge source="68.0" target="22.0">
<data key="edgeid">1700</data>
<data key="weight">1.0</data>
</edge>
<edge source="68.0" target="8.0">
<data key="edgeid">1701</data>
<data key="weight">1.0</data>
</edge>
<edge source="69.0" target="4.0">
<data key="edgeid">1702</data>
<data key="weight">1.0</data>
</edge>
<edge source="69.0" target="24.0">
<data key="edgeid">1703</data>
<data key="weight">1.0</data>
</edge>
<edge source="69.0" target="28.0">
<data key="edgeid">1704</data>
<data key="weight">1.0</data>
</edge>
<edge source="69.0" target="50.0">
<data key="edgeid">1705</data>
<data key="weight">1.0</data>
</edge>
<edge source="69.0" target="11.0">
<data key="edgeid">1706</data>
<data key="weight">1.0</data>
</edge>
<edge source="70.0" target="69.0">
<data key="edgeid">1707</data>
<data key="weight">1.0</data>
</edge>
<edge source="70.0" target="43.0">
<data key="edgeid">1708</data>
<data key="weight">1.0</data>
</edge>
<edge source="70.0" target="65.0">
<data key="edgeid">1709</data>
<data key="weight">1.0</data>
</edge>
<edge source="70.0" target="20.0">
<data key="edgeid">1710</data>
<data key="weight">1.0</data>
</edge>
<edge source="70.0" target="56.0">
<data key="edgeid">1711</data>
<data key="weight">1.0</data>
</edge>
<edge source="70.0" target="62.0">
<data key="edgeid">1712</data>
<data key="weight">1.0</data>
</edge>
<edge source="70.0" target="27.0">
<data key="edgeid">1713</data>
<data key="weight">1.0</data>
</edge>
<edge source="71.0" target="60.0">
<data key="edgeid">1714</data>
<data key="weight">1.0</data>
</edge>
<edge source="71.0" target="18.0">
<data key="edgeid">1715</data>
<data key="weight">1.0</data>
</edge>
<edge source="71.0" target="14.0">
<data key="edgeid">1716</data>
<data key="weight">1.0</data>
</edge>
<edge source="71.0" target="34.0">
<data key="edgeid">1717</data>
<data key="weight">1.0</data>
</edge>
<edge source="71.0" target="54.0">
<data key="edgeid">1718</data>
<data key="weight">1.0</data>
</edge>
<edge source="71.0" target="38.0">
<data key="edgeid">1719</data>
<data key="weight">1.0</data>
</edge>
<edge source="71.0" target="61.0">
<data key="edgeid">1720</data>
<data key="weight">1.0</data>
</edge>
<edge source="71.0" target="31.0">
<data key="edgeid">1721</data>
<data key="weight">1.0</data>
</edge>
<edge source="72.0" target="71.0">
<data key="edgeid">1722</data>
<data key="weight">1.0</data>
</edge>
<edge source="72.0" target="2.0">
<data key="edgeid">1723</data>
<data key="weight">1.0</data>
</edge>
<edge source="72.0" target="10.0">
<data key="edgeid">1724</data>
<data key="weight">1.0</data>
</edge>
<edge source="72.0" target="3.0">
<data key="edgeid">1725</data>
<data key="weight">1.0</data>
</edge>
<edge source="72.0" target="40.0">
<data key="edgeid">1726</data>
<data key="weight">1.0</data>
</edge>
<edge source="72.0" target="52.0">
<data key="edgeid">1727</data>
<data key="weight">1.0</data>
</edge>
<edge source="73.0" target="7.0">
<data key="edgeid">1728</data>
<data key="weight">1.0</data>
</edge>
<edge source="73.0" target="49.0">
<data key="edgeid">1729</data>
<data key="weight">1.0</data>
</edge>
<edge source="73.0" target="53.0">
<data key="edgeid">1730</data>
<data key="weight">1.0</data>
</edge>
<edge source="73.0" target="67.0">
<data key="edgeid">1731</data>
<data key="weight">1.0</data>
</edge>
<edge source="73.0" target="46.0">
<data key="edgeid">1732</data>
<data key="weight">1.0</data>
</edge>
<edge source="74.0" target="73.0">
<data key="edgeid">1733</data>
<data key="weight">1.0</data>
</edge>
<edge source="74.0" target="2.0">
<data key="edgeid">1734</data>
<data key="weight">1.0</data>
</edge>
<edge source="74.0" target="72.0">
<data key="edgeid">1735</data>
<data key="weight">1.0</data>
</edge>
<edge source="74.0" target="5.0">
<data key="edgeid">1736</data>
<data key="weight">1.0</data>
</edge>
<edge source="74.0" target="10.0">
<data key="edgeid">1737</data>
<data key="weight">1.0</data>
</edge>
<edge source="74.0" target="52.0">
<data key="edgeid">1738</data>
<data key="weight">1.0</data>
</edge>
<edge source="74.0" target="3.0">
<data key="edgeid">1739</data>
<data key="weight">1.0</data>
</edge>
<edge source="74.0" target="40.0">
<data key="edgeid">1740</data>
<data key="weight">1.0</data>
</edge>
<edge source="75.0" target="20.0">
<data key="edgeid">1741</data>
<data key="weight">1.0</data>
</edge>
<edge source="75.0" target="66.0">
<data key="edgeid">1742</data>
<data key="weight">1.0</data>
</edge>
<edge source="75.0" target="48.0">
<data key="edgeid">1743</data>
<data key="weight">1.0</data>
</edge>
<edge source="75.0" target="57.0">
<data key="edgeid">1744</data>
<data key="weight">1.0</data>
</edge>
<edge source="75.0" target="44.0">
<data key="edgeid">1745</data>
<data key="weight">1.0</data>
</edge>
<edge source="76.0" target="75.0">
<data key="edgeid">1746</data>
<data key="weight">1.0</data>
</edge>
<edge source="76.0" target="27.0">
<data key="edgeid">1747</data>
<data key="weight">1.0</data>
</edge>
<edge source="76.0" target="59.0">
<data key="edgeid">1748</data>
<data key="weight">1.0</data>
</edge>
<edge source="76.0" target="20.0">
<data key="edgeid">1749</data>
<data key="weight">1.0</data>
</edge>
<edge source="76.0" target="70.0">
<data key="edgeid">1750</data>
<data key="weight">1.0</data>
</edge>
<edge source="76.0" target="66.0">
<data key="edgeid">1751</data>
<data key="weight">1.0</data>
</edge>
<edge source="76.0" target="56.0">
<data key="edgeid">1752</data>
<data key="weight">1.0</data>
</edge>
<edge source="76.0" target="62.0">
<data key="edgeid">1753</data>
<data key="weight">1.0</data>
</edge>
<edge source="77.0" target="73.0">
<data key="edgeid">1754</data>
<data key="weight">1.0</data>
</edge>
<edge source="77.0" target="22.0">
<data key="edgeid">1755</data>
<data key="weight">1.0</data>
</edge>
<edge source="77.0" target="7.0">
<data key="edgeid">1756</data>
<data key="weight">1.0</data>
</edge>
<edge source="77.0" target="51.0">
<data key="edgeid">1757</data>
<data key="weight">1.0</data>
</edge>
<edge source="77.0" target="21.0">
<data key="edgeid">1758</data>
<data key="weight">1.0</data>
</edge>
<edge source="77.0" target="8.0">
<data key="edgeid">1759</data>
<data key="weight">1.0</data>
</edge>
<edge source="78.0" target="77.0">
<data key="edgeid">1760</data>
<data key="weight">1.0</data>
</edge>
<edge source="78.0" target="23.0">
<data key="edgeid">1761</data>
<data key="weight">1.0</data>
</edge>
<edge source="78.0" target="50.0">
<data key="edgeid">1762</data>
<data key="weight">1.0</data>
</edge>
<edge source="78.0" target="28.0">
<data key="edgeid">1763</data>
<data key="weight">1.0</data>
</edge>
<edge source="78.0" target="22.0">
<data key="edgeid">1764</data>
<data key="weight">1.0</data>
</edge>
<edge source="78.0" target="8.0">
<data key="edgeid">1765</data>
<data key="weight">1.0</data>
</edge>
<edge source="78.0" target="68.0">
<data key="edgeid">1766</data>
<data key="weight">1.0</data>
</edge>
<edge source="78.0" target="7.0">
<data key="edgeid">1767</data>
<data key="weight">1.0</data>
</edge>
<edge source="78.0" target="51.0">
<data key="edgeid">1768</data>
<data key="weight">1.0</data>
</edge>
<edge source="79.0" target="31.0">
<data key="edgeid">1769</data>
<data key="weight">1.0</data>
</edge>
<edge source="79.0" target="43.0">
<data key="edgeid">1770</data>
<data key="weight">1.0</data>
</edge>
<edge source="79.0" target="30.0">
<data key="edgeid">1771</data>
<data key="weight">1.0</data>
</edge>
<edge source="79.0" target="19.0">
<data key="edgeid">1772</data>
<data key="weight">1.0</data>
</edge>
<edge source="79.0" target="29.0">
<data key="edgeid">1773</data>
<data key="weight">1.0</data>
</edge>
<edge source="79.0" target="35.0">
<data key="edgeid">1774</data>
<data key="weight">1.0</data>
</edge>
<edge source="79.0" target="55.0">
<data key="edgeid">1775</data>
<data key="weight">1.0</data>
</edge>
<edge source="80.0" target="79.0">
<data key="edgeid">1776</data>
<data key="weight">1.0</data>
</edge>
<edge source="80.0" target="37.0">
<data key="edgeid">1777</data>
<data key="weight">1.0</data>
</edge>
<edge source="80.0" target="29.0">
<data key="edgeid">1778</data>
<data key="weight">1.0</data>
</edge>
<edge source="81.0" target="16.0">
<data key="edgeid">1779</data>
<data key="weight">1.0</data>
</edge>
<edge source="81.0" target="5.0">
<data key="edgeid">1780</data>
<data key="weight">1.0</data>
</edge>
<edge source="81.0" target="40.0">
<data key="edgeid">1781</data>
<data key="weight">1.0</data>
</edge>
<edge source="81.0" target="10.0">
<data key="edgeid">1782</data>
<data key="weight">1.0</data>
</edge>
<edge source="81.0" target="72.0">
<data key="edgeid">1783</data>
<data key="weight">1.0</data>
</edge>
<edge source="81.0" target="3.0">
<data key="edgeid">1784</data>
<data key="weight">1.0</data>
</edge>
<edge source="82.0" target="81.0">
<data key="edgeid">1785</data>
<data key="weight">1.0</data>
</edge>
<edge source="82.0" target="74.0">
<data key="edgeid">1786</data>
<data key="weight">1.0</data>
</edge>
<edge source="82.0" target="39.0">
<data key="edgeid">1787</data>
<data key="weight">1.0</data>
</edge>
<edge source="82.0" target="77.0">
<data key="edgeid">1788</data>
<data key="weight">1.0</data>
</edge>
<edge source="82.0" target="80.0">
<data key="edgeid">1789</data>
<data key="weight">1.0</data>
</edge>
<edge source="82.0" target="30.0">
<data key="edgeid">1790</data>
<data key="weight">1.0</data>
</edge>
<edge source="82.0" target="29.0">
<data key="edgeid">1791</data>
<data key="weight">1.0</data>
</edge>
<edge source="82.0" target="7.0">
<data key="edgeid">1792</data>
<data key="weight">1.0</data>
</edge>
<edge source="83.0" target="53.0">
<data key="edgeid">1793</data>
<data key="weight">1.0</data>
</edge>
<edge source="83.0" target="81.0">
<data key="edgeid">1794</data>
<data key="weight">1.0</data>
</edge>
<edge source="83.0" target="69.0">
<data key="edgeid">1795</data>
<data key="weight">1.0</data>
</edge>
<edge source="83.0" target="73.0">
<data key="edgeid">1796</data>
<data key="weight">1.0</data>
</edge>
<edge source="83.0" target="46.0">
<data key="edgeid">1797</data>
<data key="weight">1.0</data>
</edge>
<edge source="83.0" target="67.0">
<data key="edgeid">1798</data>
<data key="weight">1.0</data>
</edge>
<edge source="83.0" target="49.0">
<data key="edgeid">1799</data>
<data key="weight">1.0</data>
</edge>
<edge source="84.0" target="83.0">
<data key="edgeid">1800</data>
<data key="weight">1.0</data>
</edge>
<edge source="84.0" target="24.0">
<data key="edgeid">1801</data>
<data key="weight">1.0</data>
</edge>
<edge source="84.0" target="49.0">
<data key="edgeid">1802</data>
<data key="weight">1.0</data>
</edge>
<edge source="84.0" target="52.0">
<data key="edgeid">1803</data>
<data key="weight">1.0</data>
</edge>
<edge source="84.0" target="3.0">
<data key="edgeid">1804</data>
<data key="weight">1.0</data>
</edge>
<edge source="84.0" target="74.0">
<data key="edgeid">1805</data>
<data key="weight">1.0</data>
</edge>
<edge source="84.0" target="10.0">
<data key="edgeid">1806</data>
<data key="weight">1.0</data>
</edge>
<edge source="84.0" target="81.0">
<data key="edgeid">1807</data>
<data key="weight">1.0</data>
</edge>
<edge source="84.0" target="5.0">
<data key="edgeid">1808</data>
<data key="weight">1.0</data>
</edge>
<edge source="85.0" target="6.0">
<data key="edgeid">1809</data>
<data key="weight">1.0</data>
</edge>
<edge source="85.0" target="14.0">
<data key="edgeid">1810</data>
<data key="weight">1.0</data>
</edge>
<edge source="85.0" target="38.0">
<data key="edgeid">1811</data>
<data key="weight">1.0</data>
</edge>
<edge source="85.0" target="43.0">
<data key="edgeid">1812</data>
<data key="weight">1.0</data>
</edge>
<edge source="85.0" target="80.0">
<data key="edgeid">1813</data>
<data key="weight">1.0</data>
</edge>
<edge source="85.0" target="12.0">
<data key="edgeid">1814</data>
<data key="weight">1.0</data>
</edge>
<edge source="85.0" target="26.0">
<data key="edgeid">1815</data>
<data key="weight">1.0</data>
</edge>
<edge source="85.0" target="31.0">
<data key="edgeid">1816</data>
<data key="weight">1.0</data>
</edge>
<edge source="86.0" target="44.0">
<data key="edgeid">1817</data>
<data key="weight">1.0</data>
</edge>
<edge source="86.0" target="53.0">
<data key="edgeid">1818</data>
<data key="weight">1.0</data>
</edge>
<edge source="86.0" target="75.0">
<data key="edgeid">1819</data>
<data key="weight">1.0</data>
</edge>
<edge source="86.0" target="57.0">
<data key="edgeid">1820</data>
<data key="weight">1.0</data>
</edge>
<edge source="86.0" target="48.0">
<data key="edgeid">1821</data>
<data key="weight">1.0</data>
</edge>
<edge source="86.0" target="80.0">
<data key="edgeid">1822</data>
<data key="weight">1.0</data>
</edge>
<edge source="86.0" target="66.0">
<data key="edgeid">1823</data>
<data key="weight">1.0</data>
</edge>
<edge source="87.0" target="86.0">
<data key="edgeid">1824</data>
<data key="weight">1.0</data>
</edge>
<edge source="87.0" target="17.0">
<data key="edgeid">1825</data>
<data key="weight">1.0</data>
</edge>
<edge source="87.0" target="62.0">
<data key="edgeid">1826</data>
<data key="weight">1.0</data>
</edge>
<edge source="87.0" target="56.0">
<data key="edgeid">1827</data>
<data key="weight">1.0</data>
</edge>
<edge source="87.0" target="24.0">
<data key="edgeid">1828</data>
<data key="weight">1.0</data>
</edge>
<edge source="87.0" target="20.0">
<data key="edgeid">1829</data>
<data key="weight">1.0</data>
</edge>
<edge source="87.0" target="65.0">
<data key="edgeid">1830</data>
<data key="weight">1.0</data>
</edge>
<edge source="88.0" target="49.0">
<data key="edgeid">1831</data>
<data key="weight">1.0</data>
</edge>
<edge source="88.0" target="58.0">
<data key="edgeid">1832</data>
<data key="weight">1.0</data>
</edge>
<edge source="88.0" target="83.0">
<data key="edgeid">1833</data>
<data key="weight">1.0</data>
</edge>
<edge source="88.0" target="69.0">
<data key="edgeid">1834</data>
<data key="weight">1.0</data>
</edge>
<edge source="88.0" target="46.0">
<data key="edgeid">1835</data>
<data key="weight">1.0</data>
</edge>
<edge source="88.0" target="53.0">
<data key="edgeid">1836</data>
<data key="weight">1.0</data>
</edge>
<edge source="88.0" target="73.0">
<data key="edgeid">1837</data>
<data key="weight">1.0</data>
</edge>
<edge source="88.0" target="67.0">
<data key="edgeid">1838</data>
<data key="weight">1.0</data>
</edge>
<edge source="89.0" target="88.0">
<data key="edgeid">1839</data>
<data key="weight">1.0</data>
</edge>
<edge source="89.0" target="1.0">
<data key="edgeid">1840</data>
<data key="weight">1.0</data>
</edge>
<edge source="89.0" target="37.0">
<data key="edgeid">1841</data>
<data key="weight">1.0</data>
</edge>
<edge source="89.0" target="25.0">
<data key="edgeid">1842</data>
<data key="weight">1.0</data>
</edge>
<edge source="89.0" target="33.0">
<data key="edgeid">1843</data>
<data key="weight">1.0</data>
</edge>
<edge source="89.0" target="55.0">
<data key="edgeid">1844</data>
<data key="weight">1.0</data>
</edge>
<edge source="89.0" target="45.0">
<data key="edgeid">1845</data>
<data key="weight">1.0</data>
</edge>
<edge source="90.0" target="5.0">
<data key="edgeid">1846</data>
<data key="weight">1.0</data>
</edge>
<edge source="90.0" target="8.0">
<data key="edgeid">1847</data>
<data key="weight">1.0</data>
</edge>
<edge source="90.0" target="23.0">
<data key="edgeid">1848</data>
<data key="weight">1.0</data>
</edge>
<edge source="90.0" target="0.0">
<data key="edgeid">1849</data>
<data key="weight">1.0</data>
</edge>
<edge source="90.0" target="11.0">
<data key="edgeid">1850</data>
<data key="weight">1.0</data>
</edge>
<edge source="90.0" target="50.0">
<data key="edgeid">1851</data>
<data key="weight">1.0</data>
</edge>
<edge source="90.0" target="24.0">
<data key="edgeid">1852</data>
<data key="weight">1.0</data>
</edge>
<edge source="90.0" target="69.0">
<data key="edgeid">1853</data>
<data key="weight">1.0</data>
</edge>
<edge source="90.0" target="28.0">
<data key="edgeid">1854</data>
<data key="weight">1.0</data>
</edge>
<edge source="91.0" target="29.0">
<data key="edgeid">1855</data>
<data key="weight">1.0</data>
</edge>
<edge source="91.0" target="48.0">
<data key="edgeid">1856</data>
<data key="weight">1.0</data>
</edge>
<edge source="91.0" target="66.0">
<data key="edgeid">1857</data>
<data key="weight">1.0</data>
</edge>
<edge source="91.0" target="69.0">
<data key="edgeid">1858</data>
<data key="weight">1.0</data>
</edge>
<edge source="91.0" target="44.0">
<data key="edgeid">1859</data>
<data key="weight">1.0</data>
</edge>
<edge source="91.0" target="86.0">
<data key="edgeid">1860</data>
<data key="weight">1.0</data>
</edge>
<edge source="91.0" target="57.0">
<data key="edgeid">1861</data>
<data key="weight">1.0</data>
</edge>
<edge source="91.0" target="80.0">
<data key="edgeid">1862</data>
<data key="weight">1.0</data>
</edge>
<edge source="92.0" target="91.0">
<data key="edgeid">1863</data>
<data key="weight">1.0</data>
</edge>
<edge source="92.0" target="35.0">
<data key="edgeid">1864</data>
<data key="weight">1.0</data>
</edge>
<edge source="92.0" target="15.0">
<data key="edgeid">1865</data>
<data key="weight">1.0</data>
</edge>
<edge source="92.0" target="86.0">
<data key="edgeid">1866</data>
<data key="weight">1.0</data>
</edge>
<edge source="92.0" target="48.0">
<data key="edgeid">1867</data>
<data key="weight">1.0</data>
</edge>
<edge source="92.0" target="57.0">
<data key="edgeid">1868</data>
<data key="weight">1.0</data>
</edge>
<edge source="92.0" target="61.0">
<data key="edgeid">1869</data>
<data key="weight">1.0</data>
</edge>
<edge source="92.0" target="66.0">
<data key="edgeid">1870</data>
<data key="weight">1.0</data>
</edge>
<edge source="92.0" target="75.0">
<data key="edgeid">1871</data>
<data key="weight">1.0</data>
</edge>
<edge source="93.0" target="0.0">
<data key="edgeid">1872</data>
<data key="weight">1.0</data>
</edge>
<edge source="93.0" target="23.0">
<data key="edgeid">1873</data>
<data key="weight">1.0</data>
</edge>
<edge source="93.0" target="80.0">
<data key="edgeid">1874</data>
<data key="weight">1.0</data>
</edge>
<edge source="93.0" target="16.0">
<data key="edgeid">1875</data>
<data key="weight">1.0</data>
</edge>
<edge source="93.0" target="4.0">
<data key="edgeid">1876</data>
<data key="weight">1.0</data>
</edge>
<edge source="93.0" target="82.0">
<data key="edgeid">1877</data>
<data key="weight">1.0</data>
</edge>
<edge source="93.0" target="91.0">
<data key="edgeid">1878</data>
<data key="weight">1.0</data>
</edge>
<edge source="93.0" target="41.0">
<data key="edgeid">1879</data>
<data key="weight">1.0</data>
</edge>
<edge source="93.0" target="9.0">
<data key="edgeid">1880</data>
<data key="weight">1.0</data>
</edge>
<edge source="94.0" target="34.0">
<data key="edgeid">1881</data>
<data key="weight">1.0</data>
</edge>
<edge source="94.0" target="19.0">
<data key="edgeid">1882</data>
<data key="weight">1.0</data>
</edge>
<edge source="94.0" target="55.0">
<data key="edgeid">1883</data>
<data key="weight">1.0</data>
</edge>
<edge source="94.0" target="79.0">
<data key="edgeid">1884</data>
<data key="weight">1.0</data>
</edge>
<edge source="94.0" target="80.0">
<data key="edgeid">1885</data>
<data key="weight">1.0</data>
</edge>
<edge source="94.0" target="29.0">
<data key="edgeid">1886</data>
<data key="weight">1.0</data>
</edge>
<edge source="94.0" target="30.0">
<data key="edgeid">1887</data>
<data key="weight">1.0</data>
</edge>
<edge source="94.0" target="82.0">
<data key="edgeid">1888</data>
<data key="weight">1.0</data>
</edge>
<edge source="94.0" target="35.0">
<data key="edgeid">1889</data>
<data key="weight">1.0</data>
</edge>
<edge source="95.0" target="70.0">
<data key="edgeid">1890</data>
<data key="weight">1.0</data>
</edge>
<edge source="95.0" target="69.0">
<data key="edgeid">1891</data>
<data key="weight">1.0</data>
</edge>
<edge source="95.0" target="76.0">
<data key="edgeid">1892</data>
<data key="weight">1.0</data>
</edge>
<edge source="95.0" target="62.0">
<data key="edgeid">1893</data>
<data key="weight">1.0</data>
</edge>
<edge source="95.0" target="56.0">
<data key="edgeid">1894</data>
<data key="weight">1.0</data>
</edge>
<edge source="95.0" target="27.0">
<data key="edgeid">1895</data>
<data key="weight">1.0</data>
</edge>
<edge source="95.0" target="17.0">
<data key="edgeid">1896</data>
<data key="weight">1.0</data>
</edge>
<edge source="95.0" target="87.0">
<data key="edgeid">1897</data>
<data key="weight">1.0</data>
</edge>
<edge source="95.0" target="37.0">
<data key="edgeid">1898</data>
<data key="weight">1.0</data>
</edge>
<edge source="96.0" target="48.0">
<data key="edgeid">1899</data>
<data key="weight">1.0</data>
</edge>
<edge source="96.0" target="17.0">
<data key="edgeid">1900</data>
<data key="weight">1.0</data>
</edge>
<edge source="96.0" target="76.0">
<data key="edgeid">1901</data>
<data key="weight">1.0</data>
</edge>
<edge source="96.0" target="27.0">
<data key="edgeid">1902</data>
<data key="weight">1.0</data>
</edge>
<edge source="96.0" target="56.0">
<data key="edgeid">1903</data>
<data key="weight">1.0</data>
</edge>
<edge source="96.0" target="65.0">
<data key="edgeid">1904</data>
<data key="weight">1.0</data>
</edge>
<edge source="96.0" target="20.0">
<data key="edgeid">1905</data>
<data key="weight">1.0</data>
</edge>
<edge source="96.0" target="87.0">
<data key="edgeid">1906</data>
<data key="weight">1.0</data>
</edge>
<edge source="97.0" target="5.0">
<data key="edgeid">1907</data>
<data key="weight">1.0</data>
</edge>
<edge source="97.0" target="86.0">
<data key="edgeid">1908</data>
<data key="weight">1.0</data>
</edge>
<edge source="97.0" target="58.0">
<data key="edgeid">1909</data>
<data key="weight">1.0</data>
</edge>
<edge source="97.0" target="11.0">
<data key="edgeid">1910</data>
<data key="weight">1.0</data>
</edge>
<edge source="97.0" target="59.0">
<data key="edgeid">1911</data>
<data key="weight">1.0</data>
</edge>
<edge source="97.0" target="63.0">
<data key="edgeid">1912</data>
<data key="weight">1.0</data>
</edge>
<edge source="98.0" target="97.0">
<data key="edgeid">1913</data>
<data key="weight">1.0</data>
</edge>
<edge source="98.0" target="77.0">
<data key="edgeid">1914</data>
<data key="weight">1.0</data>
</edge>
<edge source="98.0" target="48.0">
<data key="edgeid">1915</data>
<data key="weight">1.0</data>
</edge>
<edge source="98.0" target="84.0">
<data key="edgeid">1916</data>
<data key="weight">1.0</data>
</edge>
<edge source="98.0" target="40.0">
<data key="edgeid">1917</data>
<data key="weight">1.0</data>
</edge>
<edge source="98.0" target="10.0">
<data key="edgeid">1918</data>
<data key="weight">1.0</data>
</edge>
<edge source="98.0" target="5.0">
<data key="edgeid">1919</data>
<data key="weight">1.0</data>
</edge>
<edge source="98.0" target="52.0">
<data key="edgeid">1920</data>
<data key="weight">1.0</data>
</edge>
<edge source="98.0" target="81.0">
<data key="edgeid">1921</data>
<data key="weight">1.0</data>
</edge>
<edge source="99.0" target="89.0">
<data key="edgeid">1922</data>
<data key="weight">1.0</data>
</edge>
<edge source="99.0" target="34.0">
<data key="edgeid">1923</data>
<data key="weight">1.0</data>
</edge>
<edge source="99.0" target="14.0">
<data key="edgeid">1924</data>
<data key="weight">1.0</data>
</edge>
<edge source="99.0" target="85.0">
<data key="edgeid">1925</data>
<data key="weight">1.0</data>
</edge>
<edge source="99.0" target="54.0">
<data key="edgeid">1926</data>
<data key="weight">1.0</data>
</edge>
<edge source="99.0" target="18.0">
<data key="edgeid">1927</data>
<data key="weight">1.0</data>
</edge>
<edge source="99.0" target="31.0">
<data key="edgeid">1928</data>
<data key="weight">1.0</data>
</edge>
<edge source="99.0" target="61.0">
<data key="edgeid">1929</data>
<data key="weight">1.0</data>
</edge>
<edge source="99.0" target="71.0">
<data key="edgeid">1930</data>
<data key="weight">1.0</data>
</edge>
<edge source="100.0" target="99.0">
<data key="edgeid">1931</data>
<data key="weight">1.0</data>
</edge>
<edge source="100.0" target="82.0">
<data key="edgeid">1932</data>
<data key="weight">1.0</data>
</edge>
<edge source="100.0" target="13.0">
<data key="edgeid">1933</data>
<data key="weight">1.0</data>
</edge>
<edge source="100.0" target="2.0">
<data key="edgeid">1934</data>
<data key="weight">1.0</data>
</edge>
<edge source="100.0" target="15.0">
<data key="edgeid">1935</data>
<data key="weight">1.0</data>
</edge>
<edge source="100.0" target="32.0">
<data key="edgeid">1936</data>
<data key="weight">1.0</data>
</edge>
<edge source="100.0" target="64.0">
<data key="edgeid">1937</data>
<data key="weight">1.0</data>
</edge>
<edge source="100.0" target="47.0">
<data key="edgeid">1938</data>
<data key="weight">1.0</data>
</edge>
<edge source="100.0" target="39.0">
<data key="edgeid">1939</data>
<data key="weight">1.0</data>
</edge>
<edge source="100.0" target="6.0">
<data key="edgeid">1940</data>
<data key="weight">1.0</data>
</edge>
<edge source="101.0" target="51.0">
<data key="edgeid">1941</data>
<data key="weight">1.0</data>
</edge>
<edge source="101.0" target="30.0">
<data key="edgeid">1942</data>
<data key="weight">1.0</data>
</edge>
<edge source="101.0" target="94.0">
<data key="edgeid">1943</data>
<data key="weight">1.0</data>
</edge>
<edge source="101.0" target="1.0">
<data key="edgeid">1944</data>
<data key="weight">1.0</data>
</edge>
<edge source="101.0" target="79.0">
<data key="edgeid">1945</data>
<data key="weight">1.0</data>
</edge>
<edge source="101.0" target="58.0">
<data key="edgeid">1946</data>
<data key="weight">1.0</data>
</edge>
<edge source="101.0" target="19.0">
<data key="edgeid">1947</data>
<data key="weight">1.0</data>
</edge>
<edge source="101.0" target="55.0">
<data key="edgeid">1948</data>
<data key="weight">1.0</data>
</edge>
<edge source="101.0" target="35.0">
<data key="edgeid">1949</data>
<data key="weight">1.0</data>
</edge>
<edge source="101.0" target="29.0">
<data key="edgeid">1950</data>
<data key="weight">1.0</data>
</edge>
<edge source="102.0" target="100.0">
<data key="edgeid">1951</data>
<data key="weight">1.0</data>
</edge>
<edge source="102.0" target="74.0">
<data key="edgeid">1952</data>
<data key="weight">1.0</data>
</edge>
<edge source="102.0" target="52.0">
<data key="edgeid">1953</data>
<data key="weight">1.0</data>
</edge>
<edge source="102.0" target="98.0">
<data key="edgeid">1954</data>
<data key="weight">1.0</data>
</edge>
<edge source="102.0" target="72.0">
<data key="edgeid">1955</data>
<data key="weight">1.0</data>
</edge>
<edge source="102.0" target="40.0">
<data key="edgeid">1956</data>
<data key="weight">1.0</data>
</edge>
<edge source="102.0" target="10.0">
<data key="edgeid">1957</data>
<data key="weight">1.0</data>
</edge>
<edge source="102.0" target="3.0">
<data key="edgeid">1958</data>
<data key="weight">1.0</data>
</edge>
<edge source="103.0" target="102.0">
<data key="edgeid">1959</data>
<data key="weight">1.0</data>
</edge>
<edge source="103.0" target="33.0">
<data key="edgeid">1960</data>
<data key="weight">1.0</data>
</edge>
<edge source="103.0" target="45.0">
<data key="edgeid">1961</data>
<data key="weight">1.0</data>
</edge>
<edge source="103.0" target="25.0">
<data key="edgeid">1962</data>
<data key="weight">1.0</data>
</edge>
<edge source="103.0" target="89.0">
<data key="edgeid">1963</data>
<data key="weight">1.0</data>
</edge>
<edge source="103.0" target="37.0">
<data key="edgeid">1964</data>
<data key="weight">1.0</data>
</edge>
<edge source="103.0" target="1.0">
<data key="edgeid">1965</data>
<data key="weight">1.0</data>
</edge>
<edge source="103.0" target="70.0">
<data key="edgeid">1966</data>
<data key="weight">1.0</data>
</edge>
<edge source="104.0" target="72.0">
<data key="edgeid">1967</data>
<data key="weight">1.0</data>
</edge>
<edge source="104.0" target="11.0">
<data key="edgeid">1968</data>
<data key="weight">1.0</data>
</edge>
<edge source="104.0" target="0.0">
<data key="edgeid">1969</data>
<data key="weight">1.0</data>
</edge>
<edge source="104.0" target="93.0">
<data key="edgeid">1970</data>
<data key="weight">1.0</data>
</edge>
<edge source="104.0" target="67.0">
<data key="edgeid">1971</data>
<data key="weight">1.0</data>
</edge>
<edge source="104.0" target="41.0">
<data key="edgeid">1972</data>
<data key="weight">1.0</data>
</edge>
<edge source="104.0" target="16.0">
<data key="edgeid">1973</data>
<data key="weight">1.0</data>
</edge>
<edge source="104.0" target="87.0">
<data key="edgeid">1974</data>
<data key="weight">1.0</data>
</edge>
<edge source="104.0" target="23.0">
<data key="edgeid">1975</data>
<data key="weight">1.0</data>
</edge>
<edge source="104.0" target="4.0">
<data key="edgeid">1976</data>
<data key="weight">1.0</data>
</edge>
<edge source="104.0" target="9.0">
<data key="edgeid">1977</data>
<data key="weight">1.0</data>
</edge>
<edge source="105.0" target="89.0">
<data key="edgeid">1978</data>
<data key="weight">1.0</data>
</edge>
<edge source="105.0" target="103.0">
<data key="edgeid">1979</data>
<data key="weight">1.0</data>
</edge>
<edge source="105.0" target="33.0">
<data key="edgeid">1980</data>
<data key="weight">1.0</data>
</edge>
<edge source="105.0" target="62.0">
<data key="edgeid">1981</data>
<data key="weight">1.0</data>
</edge>
<edge source="105.0" target="37.0">
<data key="edgeid">1982</data>
<data key="weight">1.0</data>
</edge>
<edge source="105.0" target="45.0">
<data key="edgeid">1983</data>
<data key="weight">1.0</data>
</edge>
<edge source="105.0" target="1.0">
<data key="edgeid">1984</data>
<data key="weight">1.0</data>
</edge>
<edge source="105.0" target="80.0">
<data key="edgeid">1985</data>
<data key="weight">1.0</data>
</edge>
<edge source="105.0" target="25.0">
<data key="edgeid">1986</data>
<data key="weight">1.0</data>
</edge>
<edge source="106.0" target="25.0">
<data key="edgeid">1987</data>
<data key="weight">1.0</data>
</edge>
<edge source="106.0" target="56.0">
<data key="edgeid">1988</data>
<data key="weight">1.0</data>
</edge>
<edge source="106.0" target="92.0">
<data key="edgeid">1989</data>
<data key="weight">1.0</data>
</edge>
<edge source="106.0" target="2.0">
<data key="edgeid">1990</data>
<data key="weight">1.0</data>
</edge>
<edge source="106.0" target="13.0">
<data key="edgeid">1991</data>
<data key="weight">1.0</data>
</edge>
<edge source="106.0" target="32.0">
<data key="edgeid">1992</data>
<data key="weight">1.0</data>
</edge>
<edge source="106.0" target="60.0">
<data key="edgeid">1993</data>
<data key="weight">1.0</data>
</edge>
<edge source="106.0" target="6.0">
<data key="edgeid">1994</data>
<data key="weight">1.0</data>
</edge>
<edge source="106.0" target="64.0">
<data key="edgeid">1995</data>
<data key="weight">1.0</data>
</edge>
<edge source="106.0" target="15.0">
<data key="edgeid">1996</data>
<data key="weight">1.0</data>
</edge>
<edge source="106.0" target="39.0">
<data key="edgeid">1997</data>
<data key="weight">1.0</data>
</edge>
<edge source="107.0" target="88.0">
<data key="edgeid">1998</data>
<data key="weight">1.0</data>
</edge>
<edge source="107.0" target="75.0">
<data key="edgeid">1999</data>
<data key="weight">1.0</data>
</edge>
<edge source="107.0" target="98.0">
<data key="edgeid">2000</data>
<data key="weight">1.0</data>
</edge>
<edge source="107.0" target="102.0">
<data key="edgeid">2001</data>
<data key="weight">1.0</data>
</edge>
<edge source="107.0" target="72.0">
<data key="edgeid">2002</data>
<data key="weight">1.0</data>
</edge>
<edge source="107.0" target="40.0">
<data key="edgeid">2003</data>
<data key="weight">1.0</data>
</edge>
<edge source="107.0" target="81.0">
<data key="edgeid">2004</data>
<data key="weight">1.0</data>
</edge>
<edge source="107.0" target="5.0">
<data key="edgeid">2005</data>
<data key="weight">1.0</data>
</edge>
<edge source="107.0" target="10.0">
<data key="edgeid">2006</data>
<data key="weight">1.0</data>
</edge>
<edge source="107.0" target="84.0">
<data key="edgeid">2007</data>
<data key="weight">1.0</data>
</edge>
<edge source="108.0" target="4.0">
<data key="edgeid">2008</data>
<data key="weight">1.0</data>
</edge>
<edge source="108.0" target="9.0">
<data key="edgeid">2009</data>
<data key="weight">1.0</data>
</edge>
<edge source="108.0" target="7.0">
<data key="edgeid">2010</data>
<data key="weight">1.0</data>
</edge>
<edge source="108.0" target="51.0">
<data key="edgeid">2011</data>
<data key="weight">1.0</data>
</edge>
<edge source="108.0" target="77.0">
<data key="edgeid">2012</data>
<data key="weight">1.0</data>
</edge>
<edge source="108.0" target="21.0">
<data key="edgeid">2013</data>
<data key="weight">1.0</data>
</edge>
<edge source="108.0" target="78.0">
<data key="edgeid">2014</data>
<data key="weight">1.0</data>
</edge>
<edge source="108.0" target="22.0">
<data key="edgeid">2015</data>
<data key="weight">1.0</data>
</edge>
<edge source="108.0" target="68.0">
<data key="edgeid">2016</data>
<data key="weight">1.0</data>
</edge>
<edge source="109.0" target="79.0">
<data key="edgeid">2017</data>
<data key="weight">1.0</data>
</edge>
<edge source="109.0" target="30.0">
<data key="edgeid">2018</data>
<data key="weight">1.0</data>
</edge>
<edge source="109.0" target="63.0">
<data key="edgeid">2019</data>
<data key="weight">1.0</data>
</edge>
<edge source="109.0" target="1.0">
<data key="edgeid">2020</data>
<data key="weight">1.0</data>
</edge>
<edge source="109.0" target="33.0">
<data key="edgeid">2021</data>
<data key="weight">1.0</data>
</edge>
<edge source="109.0" target="103.0">
<data key="edgeid">2022</data>
<data key="weight">1.0</data>
</edge>
<edge source="109.0" target="105.0">
<data key="edgeid">2023</data>
<data key="weight">1.0</data>
</edge>
<edge source="109.0" target="45.0">
<data key="edgeid">2024</data>
<data key="weight">1.0</data>
</edge>
<edge source="109.0" target="25.0">
<data key="edgeid">2025</data>
<data key="weight">1.0</data>
</edge>
<edge source="109.0" target="89.0">
<data key="edgeid">2026</data>
<data key="weight">1.0</data>
</edge>
<edge source="109.0" target="37.0">
<data key="edgeid">2027</data>
<data key="weight">1.0</data>
</edge>
<edge source="110.0" target="67.0">
<data key="edgeid">2028</data>
<data key="weight">1.0</data>
</edge>
<edge source="110.0" target="13.0">
<data key="edgeid">2029</data>
<data key="weight">1.0</data>
</edge>
<edge source="110.0" target="24.0">
<data key="edgeid">2030</data>
<data key="weight">1.0</data>
</edge>
<edge source="110.0" target="80.0">
<data key="edgeid">2031</data>
<data key="weight">1.0</data>
</edge>
<edge source="110.0" target="88.0">
<data key="edgeid">2032</data>
<data key="weight">1.0</data>
</edge>
<edge source="110.0" target="49.0">
<data key="edgeid">2033</data>
<data key="weight">1.0</data>
</edge>
<edge source="110.0" target="73.0">
<data key="edgeid">2034</data>
<data key="weight">1.0</data>
</edge>
<edge source="110.0" target="46.0">
<data key="edgeid">2035</data>
<data key="weight">1.0</data>
</edge>
<edge source="110.0" target="83.0">
<data key="edgeid">2036</data>
<data key="weight">1.0</data>
</edge>
<edge source="110.0" target="53.0">
<data key="edgeid">2037</data>
<data key="weight">1.0</data>
</edge>
<edge source="111.0" target="23.0">
<data key="edgeid">2038</data>
<data key="weight">1.0</data>
</edge>
<edge source="111.0" target="64.0">
<data key="edgeid">2039</data>
<data key="weight">1.0</data>
</edge>
<edge source="111.0" target="46.0">
<data key="edgeid">2040</data>
<data key="weight">1.0</data>
</edge>
<edge source="111.0" target="78.0">
<data key="edgeid">2041</data>
<data key="weight">1.0</data>
</edge>
<edge source="111.0" target="8.0">
<data key="edgeid">2042</data>
<data key="weight">1.0</data>
</edge>
<edge source="111.0" target="21.0">
<data key="edgeid">2043</data>
<data key="weight">1.0</data>
</edge>
<edge source="111.0" target="51.0">
<data key="edgeid">2044</data>
<data key="weight">1.0</data>
</edge>
<edge source="111.0" target="7.0">
<data key="edgeid">2045</data>
<data key="weight">1.0</data>
</edge>
<edge source="111.0" target="108.0">
<data key="edgeid">2046</data>
<data key="weight">1.0</data>
</edge>
<edge source="111.0" target="68.0">
<data key="edgeid">2047</data>
<data key="weight">1.0</data>
</edge>
<edge source="111.0" target="77.0">
<data key="edgeid">2048</data>
<data key="weight">1.0</data>
</edge>
<edge source="112.0" target="52.0">
<data key="edgeid">2049</data>
<data key="weight">1.0</data>
</edge>
<edge source="112.0" target="96.0">
<data key="edgeid">2050</data>
<data key="weight">1.0</data>
</edge>
<edge source="112.0" target="97.0">
<data key="edgeid">2051</data>
<data key="weight">1.0</data>
</edge>
<edge source="112.0" target="57.0">
<data key="edgeid">2052</data>
<data key="weight">1.0</data>
</edge>
<edge source="112.0" target="66.0">
<data key="edgeid">2053</data>
<data key="weight">1.0</data>
</edge>
<edge source="112.0" target="63.0">
<data key="edgeid">2054</data>
<data key="weight">1.0</data>
</edge>
<edge source="112.0" target="44.0">
<data key="edgeid">2055</data>
<data key="weight">1.0</data>
</edge>
<edge source="112.0" target="92.0">
<data key="edgeid">2056</data>
<data key="weight">1.0</data>
</edge>
<edge source="112.0" target="75.0">
<data key="edgeid">2057</data>
<data key="weight">1.0</data>
</edge>
<edge source="112.0" target="91.0">
<data key="edgeid">2058</data>
<data key="weight">1.0</data>
</edge>
<edge source="113.0" target="28.0">
<data key="edgeid">2059</data>
<data key="weight">1.0</data>
</edge>
<edge source="113.0" target="20.0">
<data key="edgeid">2060</data>
<data key="weight">1.0</data>
</edge>
<edge source="113.0" target="95.0">
<data key="edgeid">2061</data>
<data key="weight">1.0</data>
</edge>
<edge source="113.0" target="59.0">
<data key="edgeid">2062</data>
<data key="weight">1.0</data>
</edge>
<edge source="113.0" target="70.0">
<data key="edgeid">2063</data>
<data key="weight">1.0</data>
</edge>
<edge source="113.0" target="17.0">
<data key="edgeid">2064</data>
<data key="weight">1.0</data>
</edge>
<edge source="113.0" target="87.0">
<data key="edgeid">2065</data>
<data key="weight">1.0</data>
</edge>
<edge source="113.0" target="76.0">
<data key="edgeid">2066</data>
<data key="weight">1.0</data>
</edge>
<edge source="113.0" target="65.0">
<data key="edgeid">2067</data>
<data key="weight">1.0</data>
</edge>
<edge source="113.0" target="96.0">
<data key="edgeid">2068</data>
<data key="weight">1.0</data>
</edge>
<edge source="114.0" target="83.0">
<data key="edgeid">2069</data>
<data key="weight">1.0</data>
</edge>
<edge source="114.0" target="88.0">
<data key="edgeid">2070</data>
<data key="weight">1.0</data>
</edge>
<edge source="114.0" target="110.0">
<data key="edgeid">2071</data>
<data key="weight">1.0</data>
</edge>
<edge source="114.0" target="53.0">
<data key="edgeid">2072</data>
<data key="weight">1.0</data>
</edge>
<edge source="114.0" target="49.0">
<data key="edgeid">2073</data>
<data key="weight">1.0</data>
</edge>
<edge source="114.0" target="73.0">
<data key="edgeid">2074</data>
<data key="weight">1.0</data>
</edge>
<edge source="114.0" target="46.0">
<data key="edgeid">2075</data>
<data key="weight">1.0</data>
</edge>
<edge source="114.0" target="67.0">
<data key="edgeid">2076</data>
<data key="weight">1.0</data>
</edge>
<edge source="114.0" target="58.0">
<data key="edgeid">2077</data>
<data key="weight">1.0</data>
</edge>
<edge source="114.0" target="15.0">
<data key="edgeid">2078</data>
<data key="weight">1.0</data>
</edge>
<edge source="114.0" target="104.0">
<data key="edgeid">2079</data>
<data key="weight">1.0</data>
</edge>
</graph>
</graphml>
