<?xml version="1.0" encoding="UTF-8"?>
<graphml xmlns="http://graphml.graphdrawing.org/xmlns">
<key attr.name="label" attr.type="string" for="node" id="label"/>
<key attr.name="Edge Label" attr.type="string" for="edge" id="edgelabel"/>
<key attr.name="weight" attr.type="double" for="edge" id="weight"/>
<key attr.name="Edge Id" attr.type="string" for="edge" id="edgeid"/>
<key attr.name="r" attr.type="int" for="node" id="r"/>
<key attr.name="g" attr.type="int" for="node" id="g"/>
<key attr.name="b" attr.type="int" for="node" id="b"/>
<key attr.name="x" attr.type="float" for="node" id="x"/>
<key attr.name="y" attr.type="float" for="node" id="y"/>
<key attr.name="size" attr.type="float" for="node" id="size"/>
<graph edgedefault="directed">
<node id="0">
<data key="label">0</data>
<data key="size">10.0</data>
<data key="r">0</data>
<data key="g">0</data>
<data key="b">0</data>
<data key="x">61.577866</data>
<data key="y">12.816651</data>
</node>
<node id="1">
<data key="label">1</data>
<data key="size">10.0</data>
<data key="r">0</data>
<data key="g">0</data>
<data key="b">0</data>
<data key="x">-83.14921</data>
<data key="y">-31.649832</data>
</node>
<node id="2">
<data key="label">2</data>
<data key="size">10.0</data>
<data key="r">0</data>
<data key="g">0</data>
<data key="b">0</data>
<data key="x">-225.43973</data>
<data key="y">-115.197655</data>
</node>
<node id="3">
<data key="label">3</data>
<data key="size">10.0</data>
<data key="r">0</data>
<data key="g">0</data>
<data key="b">0</data>
<data key="x">45.945923</data>
<data key="y">64.48558</data>
</node>
<node id="4">
<data key="label">4</data>
<data key="size">10.0</data>
<data key="r">0</data>
<data key="g">0</data>
<data key="b">0</data>
<data key="x">-256.93524</data>
<data key="y">-113.40989</data>
</node>
<node id="5">
<data key="label">5</data>
<data key="size">10.0</data>
<data key="r">0</data>
<data key="g">0</data>
<data key="b">0</data>
<data key="x">-82.661835</data>
<data key="y">168.62407</data>
</node>
<node id="6">
<data key="label">6</data>
<data key="size">10.0</data>
<data key="r">0</data>
<data key="g">0</data>
<data key="b">0</data>
<data key="x">89.955376</data>
<data key="y">-19.625395</data>
</node>
<node id="7">
<data key="label">7</data>
<data key="size">10.0</data>
<data key="r">0</data>
<data key="g">0</data>
<data key="b">0</data>
<data key="x">115.701645</data>
<data key="y">-24.280869</data>
</node>
<node id="8">
<data key="label">8</data>
<data key="size">10.0</data>
<data key="r">0</data>
<data key="g">0</data>
<data key="b">0</data>
<data key="x">-55.82979</data>
<data key="y">-45.555565</data>
</node>
<node id="9">
<data key="label">9</data>
<data key="size">10.0</data>
<data key="r">0</data>
<data key="g">0</data>
<data key="b">0</data>
<data key="x">44.210155</data>
<data key="y">-96.33823</data>
</node>
<node id="10">
<data key="label">10</data>
<data key="size">10.0</data>
<data key="r">0</data>
<data key="g">0</data>
<data key="b">0</data>
<data key="x">-87.61897</data>
<data key="y">-64.752815</data>
</node>
<node id="11">
<data key="label">11</data>
<data key="size">10.0</data>
<data key="r">0</data>
<data key="g">0</data>
<data key="b">0</data>
<data key="x">7.664203</data>
<data key="y">124.71081</data>
</node>
<node id="12">
<data key="label">12</data>
<data key="size">10.0</data>
<data key="r">0</data>
<data key="g">0</data>
<data key="b">0</data>
<data key="x">-29.113636</data>
<data key="y">-116.59008</data>
</node>
<node id="13">
<data key="label">13</data>
<data key="size">10.0</data>
<data key="r">0</data>
<data key="g">0</data>
<data key="b">0</data>
<data key="x">85.19281</data>
<data key="y">-148.44237</data>
</node>
<node id="14">
<data key="label">14</data>
<data key="size">10.0</data>
<data key="r">0</data>
<data key="g">0</data>
<data key="b">0</data>
<data key="x">-14.071848</data>
<data key="y">42.545868</data>
</node>
<node id="15">
<data key="label">15</data>
<data key="size">10.0</data>
<data key="r">0</data>
<data key="g">0</data>
<data key="b">0</data>
<data key="x">156.912</data>
<data key="y">68.71464</data>
</node>
<node id="16">
<data key="label">16</data>
<data key="size">10.0</data>
<data key="r">0</data>
<data key="g">0</data>
<data key="b">0</data>
<data key="x">-28.155483</data>
<data key="y">68.18155</data>
</node>
<node id="17">
<data key="label">17</data>
<data key="size">10.0</data>
<data key="r">0</data>
<data key="g">0</data>
<data key="b">0</data>
<data key="x">-83.05751</data>
<data key="y">-43.69377</data>
</node>
<node id="18">
<data key="label">18</data>
<data key="size">10.0</data>
<data key="r">0</data>
<data key="g">0</data>
<data key="b">0</data>
<data key="x">-81.38794</data>
<data key="y">-56.2158</data>
</node>
<node id="19">
<data key="label">19</data>
<data key="size">10.0</data>
<data key="r">0</data>
<data key="g">0</data>
<data key="b">0</data>
<data key="x">29.885748</data>
<data key="y">-117.474236</data>
</node>
<node id="20">
<data key="label">20</data>
<data key="size">10.0</data>
<data key="r">0</data>
<data key="g">0</data>
<data key="b">0</data>
<data key="x">-51.23576</data>
<data key="y">122.72979</data>
</node>
<node id="21">
<data key="label">21</data>
<data key="size">10.0</data>
<data key="r">0</data>
<data key="g">0</data>
<data key="b">0</data>
<data key="x">-24.054934</data>
<data key="y">15.411114</data>
</node>
<node id="22">
<data key="label">22</data>
<data key="size">10.0</data>
<data key="r">0</data>
<data key="g">0</data>
<data key="b">0</data>
<data key="x">26.655102</data>
<data key="y">-148.17603</data>
</node>
<node id="23">
<data key="label">23</data>
<data key="size">10.0</data>
<data key="r">0</data>
<data key="g">0</data>
<data key="b">0</data>
<data key="x">90.67384</data>
<data key="y">110.00647</data>
</node>
<node id="24">
<data key="label">24</data>
<data key="size">10.0</data>
<data key="r">0</data>
<data key="g">0</data>
<data key="b">0</data>
<data key="x">67.944534</data>
<data key="y">-159.07599</data>
</node>
<node id="25">
<data key="label">25</data>
<data key="size">10.0</data>
<data key="r">0</data>
<data key="g">0</data>
<data key="b">0</data>
<data key="x">14.256595</data>
<data key="y">-138.68462</data>
</node>
<node id="26">
<data key="label">26</data>
<data key="size">10.0</data>
<data key="r">0</data>
<data key="g">0</data>
<data key="b">0</data>
<data key="x">151.05882</data>
<data key="y">90.43499</data>
</node>
<node id="27">
<data key="label">27</data>
<data key="size">10.0</data>
<data key="r">0</data>
<data key="g">0</data>
<data key="b">0</data>
<data key="x">-92.57181</data>
<data key="y">-52.9219</data>
</node>
<node id="28">
<data key="label">28</data>
<data key="size">10.0</data>
<data key="r">0</data>
<data key="g">0</data>
<data key="b">0</data>
<data key="x">28.159382</data>
<data key="y">-86.14063</data>
</node>
<node id="29">
<data key="label">29</data>
<data key="size">10.0</data>
<data key="r">0</data>
<data key="g">0</data>
<data key="b">0</data>
<data key="x">2.5602622</data>
<data key="y">57.4847</data>
</node>
<node id="30">
<data key="label">30</data>
<data key="size">10.0</data>
<data key="r">0</data>
<data key="g">0</data>
<data key="b">0</data>
<data key="x">77.60605</data>
<data key="y">181.26414</data>
</node>
<node id="31">
<data key="label">31</data>
<data key="size">10.0</data>
<data key="r">0</data>
<data key="g">0</data>
<data key="b">0</data>
<data key="x">-7.0184197</data>
<data key="y">-26.908787</data>
</node>
<node id="32">
<data key="label">32</data>
<data key="size">10.0</data>
<data key="r">0</data>
<data key="g">0</data>
<data key="b">0</data>
<data key="x">56.796947</data>
<data key="y">176.65434</data>
</node>
<node id="33">
<data key="label">33</data>
<data key="size">10.0</data>
<data key="r">0</data>
<data key="g">0</data>
<data key="b">0</data>
<data key="x">-92.492424</data>
<data key="y">-40.460663</data>
</node>
<node id="34">
<data key="label">34</data>
<data key="size">10.0</data>
<data key="r">0</data>
<data key="g">0</data>
<data key="b">0</data>
<data key="x">111.07455</data>
<data key="y">95.66903</data>
</node>
<node id="35">
<data key="label">35</data>
<data key="size">10.0</data>
<data key="r">0</data>
<data key="g">0</data>
<data key="b">0</data>
<data key="x">-27.85993</data>
<data key="y">-100.34332</data>
</node>
<node id="36">
<data key="label">36</data>
<data key="size">10.0</data>
<data key="r">0</data>
<data key="g">0</data>
<data key="b">0</data>
<data key="x">38.71461</data>
<data key="y">-55.67427</data>
</node>
<node id="37">
<data key="label">37</data>
<data key="size">10.0</data>
<data key="r">0</data>
<data key="g">0</data>
<data key="b">0</data>
<data key="x">85.03101</data>
<data key="y">-120.21233</data>
</node>
<node id="38">
<data key="label">38</data>
<data key="size">10.0</data>
<data key="r">0</data>
<data key="g">0</data>
<data key="b">0</data>
<data key="x">73.82204</data>
<data key="y">71.78037</data>
</node>
<node id="39">
<data key="label">39</data>
<data key="size">10.0</data>
<data key="r">0</data>
<data key="g">0</data>
<data key="b">0</data>
<data key="x">30.960007</data>
<data key="y">169.88345</data>
</node>
<node id="40">
<data key="label">40</data>
<data key="size">10.0</data>
<data key="r">0</data>
<data key="g">0</data>
<data key="b">0</data>
<data key="x">-42.43178</data>
<data key="y">-123.78245</data>
</node>
<node id="41">
<data key="label">41</data>
<data key="size">10.0</data>
<data key="r">0</data>
<data key="g">0</data>
<data key="b">0</data>
<data key="x">56.92832</data>
<data key="y">85.03748</data>
</node>
<node id="42">
<data key="label">42</data>
<data key="size">10.0</data>
<data key="r">0</data>
<data key="g">0</data>
<data key="b">0</data>
<data key="x">-63.777443</data>
<data key="y">77.14642</data>
</node>
<node id="43">
<data key="label">43</data>
<data key="size">10.0</data>
<data key="r">0</data>
<data key="g">0</data>
<data key="b">0</data>
<data key="x">64.426186</data>
<data key="y">-125.4063</data>
</node>
<node id="44">
<data key="label">44</data>
<data key="size">10.0</data>
<data key="r">0</data>
<data key="g">0</data>
<data key="b">0</data>
<data key="x">-27.103607</data>
<data key="y">35.12835</data>
</node>
<node id="45">
<data key="label">45</data>
<data key="size">10.0</data>
<data key="r">0</data>
<data key="g">0</data>
<data key="b">0</data>
<data key="x">-230.29297</data>
<data key="y">-101.898476</data>
</node>
<node id="46">
<data key="label">46</data>
<data key="size">10.0</data>
<data key="r">0</data>
<data key="g">0</data>
<data key="b">0</data>
<data key="x">-13.344246</data>
<data key="y">-86.75241</data>
</node>
<node id="47">
<data key="label">47</data>
<data key="size">10.0</data>
<data key="r">0</data>
<data key="g">0</data>
<data key="b">0</data>
<data key="x">-76.32811</data>
<data key="y">-67.802284</data>
</node>
<node id="48">
<data key="label">48</data>
<data key="size">10.0</data>
<data key="r">0</data>
<data key="g">0</data>
<data key="b">0</data>
<data key="x">9.316401</data>
<data key="y">45.137093</data>
</node>
<node id="49">
<data key="label">49</data>
<data key="size">10.0</data>
<data key="r">0</data>
<data key="g">0</data>
<data key="b">0</data>
<data key="x">23.92861</data>
<data key="y">78.604294</data>
</node>
<node id="50">
<data key="label">50</data>
<data key="size">10.0</data>
<data key="r">0</data>
<data key="g">0</data>
<data key="b">0</data>
<data key="x">-2.5055969</data>
<data key="y">2.8959484</data>
</node>
<node id="51">
<data key="label">51</data>
<data key="size">10.0</data>
<data key="r">0</data>
<data key="g">0</data>
<data key="b">0</data>
<data key="x">-87.5571</data>
<data key="y">91.08566</data>
</node>
<node id="52">
<data key="label">52</data>
<data key="size">10.0</data>
<data key="r">0</data>
<data key="g">0</data>
<data key="b">0</data>
<data key="x">-253.15778</data>
<data key="y">-123.85904</data>
</node>
<node id="53">
<data key="label">53</data>
<data key="size">10.0</data>
<data key="r">0</data>
<data key="g">0</data>
<data key="b">0</data>
<data key="x">-13.764117</data>
<data key="y">-110.18736</data>
</node>
<node id="54">
<data key="label">54</data>
<data key="size">10.0</data>
<data key="r">0</data>
<data key="g">0</data>
<data key="b">0</data>
<data key="x">-95.70151</data>
<data key="y">187.89917</data>
</node>
<node id="55">
<data key="label">55</data>
<data key="size">10.0</data>
<data key="r">0</data>
<data key="g">0</data>
<data key="b">0</data>
<data key="x">51.672318</data>
<data key="y">128.32811</data>
</node>
<node id="56">
<data key="label">56</data>
<data key="size">10.0</data>
<data key="r">0</data>
<data key="g">0</data>
<data key="b">0</data>
<data key="x">95.35309</data>
<data key="y">-135.51126</data>
</node>
<node id="57">
<data key="label">57</data>
<data key="size">10.0</data>
<data key="r">0</data>
<data key="g">0</data>
<data key="b">0</data>
<data key="x">-6.523772</data>
<data key="y">109.11193</data>
</node>
<node id="58">
<data key="label">58</data>
<data key="size">10.0</data>
<data key="r">0</data>
<data key="g">0</data>
<data key="b">0</data>
<data key="x">-180.9647</data>
<data key="y">-91.237976</data>
</node>
<node id="59">
<data key="label">59</data>
<data key="size">10.0</data>
<data key="r">0</data>
<data key="g">0</data>
<data key="b">0</data>
<data key="x">126.485954</data>
<data key="y">41.68731</data>
</node>
<node id="60">
<data key="label">60</data>
<data key="size">10.0</data>
<data key="r">0</data>
<data key="g">0</data>
<data key="b">0</data>
<data key="x">58.97119</data>
<data key="y">-60.43656</data>
</node>
<node id="61">
<data key="label">61</data>
<data key="size">10.0</data>
<data key="r">0</data>
<data key="g">0</data>
<data key="b">0</data>
<data key="x">78.38185</data>
<data key="y">148.85062</data>
</node>
<node id="62">
<data key="label">62</data>
<data key="size">10.0</data>
<data key="r">0</data>
<data key="g">0</data>
<data key="b">0</data>
<data key="x">-1.619744</data>
<data key="y">27.685493</data>
</node>
<node id="63">
<data key="label">63</data>
<data key="size">10.0</data>
<data key="r">0</data>
<data key="g">0</data>
<data key="b">0</data>
<data key="x">-55.48189</data>
<data key="y">-94.37205</data>
</node>
<node id="64">
<data key="label">64</data>
<data key="size">10.0</data>
<data key="r">0</data>
<data key="g">0</data>
<data key="b">0</data>
<data key="x">-5.3263316</data>
<data key="y">-156.51996</data>
</node>
<node id="65">
<data key="label">65</data>
<data key="size">10.0</data>
<data key="r">0</data>
<data key="g">0</data>
<data key="b">0</data>
<data key="x">80.87099</data>
<data key="y">-185.50565</data>
</node>
<edge source="38" target="23">
<data key="edgeid">74327</data>
<data key="weight">1.0</data>
</edge>
<edge source="2" target="52">
<data key="edgeid">74328</data>
<data key="weight">1.0</data>
</edge>
<edge source="49" target="38">
<data key="edgeid">74329</data>
<data key="weight">1.0</data>
</edge>
<edge source="57" target="55">
<data key="edgeid">74330</data>
<data key="weight">1.0</data>
</edge>
<edge source="57" target="11">
<data key="edgeid">74331</data>
<data key="weight">1.0</data>
</edge>
<edge source="4" target="52">
<data key="edgeid">74332</data>
<data key="weight">1.0</data>
</edge>
<edge source="5" target="54">
<data key="edgeid">74333</data>
<data key="weight">1.0</data>
</edge>
<edge source="37" target="6">
<data key="edgeid">74334</data>
<data key="weight">1.0</data>
</edge>
<edge source="37" target="56">
<data key="edgeid">74335</data>
<data key="weight">1.0</data>
</edge>
<edge source="8" target="58">
<data key="edgeid">74336</data>
<data key="weight">1.0</data>
</edge>
<edge source="8" target="10">
<data key="edgeid">74337</data>
<data key="weight">1.0</data>
</edge>
<edge source="8" target="53">
<data key="edgeid">74338</data>
<data key="weight">1.0</data>
</edge>
<edge source="8" target="46">
<data key="edgeid">74339</data>
<data key="weight">1.0</data>
</edge>
<edge source="8" target="33">
<data key="edgeid">74340</data>
<data key="weight">1.0</data>
</edge>
<edge source="8" target="17">
<data key="edgeid">74341</data>
<data key="weight">1.0</data>
</edge>
<edge source="8" target="27">
<data key="edgeid">74342</data>
<data key="weight">1.0</data>
</edge>
<edge source="8" target="47">
<data key="edgeid">74343</data>
<data key="weight">1.0</data>
</edge>
<edge source="8" target="18">
<data key="edgeid">74344</data>
<data key="weight">1.0</data>
</edge>
<edge source="8" target="1">
<data key="edgeid">74345</data>
<data key="weight">1.0</data>
</edge>
<edge source="8" target="35">
<data key="edgeid">74346</data>
<data key="weight">1.0</data>
</edge>
<edge source="0" target="59">
<data key="edgeid">74347</data>
<data key="weight">1.0</data>
</edge>
<edge source="0" target="38">
<data key="edgeid">74348</data>
<data key="weight">1.0</data>
</edge>
<edge source="20" target="11">
<data key="edgeid">74349</data>
<data key="weight">1.0</data>
</edge>
<edge source="20" target="5">
<data key="edgeid">74350</data>
<data key="weight">1.0</data>
</edge>
<edge source="21" target="29">
<data key="edgeid">74351</data>
<data key="weight">1.0</data>
</edge>
<edge source="24" target="65">
<data key="edgeid">74352</data>
<data key="weight">1.0</data>
</edge>
<edge source="24" target="37">
<data key="edgeid">74353</data>
<data key="weight">1.0</data>
</edge>
<edge source="24" target="43">
<data key="edgeid">74354</data>
<data key="weight">1.0</data>
</edge>
<edge source="31" target="28">
<data key="edgeid">74355</data>
<data key="weight">1.0</data>
</edge>
<edge source="31" target="29">
<data key="edgeid">74356</data>
<data key="weight">1.0</data>
</edge>
<edge source="22" target="64">
<data key="edgeid">74357</data>
<data key="weight">1.0</data>
</edge>
<edge source="25" target="64">
<data key="edgeid">74358</data>
<data key="weight">1.0</data>
</edge>
<edge source="25" target="24">
<data key="edgeid">74359</data>
<data key="weight">1.0</data>
</edge>
<edge source="25" target="28">
<data key="edgeid">74360</data>
<data key="weight">1.0</data>
</edge>
<edge source="28" target="9">
<data key="edgeid">74361</data>
<data key="weight">1.0</data>
</edge>
<edge source="28" target="43">
<data key="edgeid">74362</data>
<data key="weight">1.0</data>
</edge>
<edge source="28" target="12">
<data key="edgeid">74363</data>
<data key="weight">1.0</data>
</edge>
<edge source="29" target="57">
<data key="edgeid">74364</data>
<data key="weight">1.0</data>
</edge>
<edge source="30" target="61">
<data key="edgeid">74365</data>
<data key="weight">1.0</data>
</edge>
<edge source="32" target="30">
<data key="edgeid">74366</data>
<data key="weight">1.0</data>
</edge>
<edge source="32" target="39">
<data key="edgeid">74367</data>
<data key="weight">1.0</data>
</edge>
<edge source="11" target="49">
<data key="edgeid">74368</data>
<data key="weight">1.0</data>
</edge>
<edge source="11" target="3">
<data key="edgeid">74369</data>
<data key="weight">1.0</data>
</edge>
<edge source="26" target="34">
<data key="edgeid">74370</data>
<data key="weight">1.0</data>
</edge>
<edge source="59" target="15">
<data key="edgeid">74371</data>
<data key="weight">1.0</data>
</edge>
<edge source="35" target="25">
<data key="edgeid">74372</data>
<data key="weight">1.0</data>
</edge>
<edge source="36" target="43">
<data key="edgeid">74373</data>
<data key="weight">1.0</data>
</edge>
<edge source="36" target="60">
<data key="edgeid">74374</data>
<data key="weight">1.0</data>
</edge>
<edge source="15" target="26">
<data key="edgeid">74375</data>
<data key="weight">1.0</data>
</edge>
<edge source="40" target="64">
<data key="edgeid">74376</data>
<data key="weight">1.0</data>
</edge>
<edge source="6" target="0">
<data key="edgeid">74377</data>
<data key="weight">1.0</data>
</edge>
<edge source="6" target="3">
<data key="edgeid">74378</data>
<data key="weight">1.0</data>
</edge>
<edge source="6" target="7">
<data key="edgeid">74379</data>
<data key="weight">1.0</data>
</edge>
<edge source="41" target="0">
<data key="edgeid">74380</data>
<data key="weight">1.0</data>
</edge>
<edge source="42" target="57">
<data key="edgeid">74381</data>
<data key="weight">1.0</data>
</edge>
<edge source="42" target="51">
<data key="edgeid">74382</data>
<data key="weight">1.0</data>
</edge>
<edge source="42" target="20">
<data key="edgeid">74383</data>
<data key="weight">1.0</data>
</edge>
<edge source="43" target="56">
<data key="edgeid">74384</data>
<data key="weight">1.0</data>
</edge>
<edge source="43" target="13">
<data key="edgeid">74385</data>
<data key="weight">1.0</data>
</edge>
<edge source="44" target="3">
<data key="edgeid">74386</data>
<data key="weight">1.0</data>
</edge>
<edge source="44" target="16">
<data key="edgeid">74387</data>
<data key="weight">1.0</data>
</edge>
<edge source="44" target="14">
<data key="edgeid">74388</data>
<data key="weight">1.0</data>
</edge>
<edge source="45" target="4">
<data key="edgeid">74389</data>
<data key="weight">1.0</data>
</edge>
<edge source="46" target="19">
<data key="edgeid">74390</data>
<data key="weight">1.0</data>
</edge>
<edge source="48" target="0">
<data key="edgeid">74391</data>
<data key="weight">1.0</data>
</edge>
<edge source="48" target="16">
<data key="edgeid">74392</data>
<data key="weight">1.0</data>
</edge>
<edge source="48" target="14">
<data key="edgeid">74393</data>
<data key="weight">1.0</data>
</edge>
<edge source="48" target="49">
<data key="edgeid">74394</data>
<data key="weight">1.0</data>
</edge>
<edge source="53" target="22">
<data key="edgeid">74395</data>
<data key="weight">1.0</data>
</edge>
<edge source="55" target="3">
<data key="edgeid">74396</data>
<data key="weight">1.0</data>
</edge>
<edge source="55" target="32">
<data key="edgeid">74397</data>
<data key="weight">1.0</data>
</edge>
<edge source="58" target="45">
<data key="edgeid">74398</data>
<data key="weight">1.0</data>
</edge>
<edge source="62" target="0">
<data key="edgeid">74399</data>
<data key="weight">1.0</data>
</edge>
<edge source="62" target="16">
<data key="edgeid">74400</data>
<data key="weight">1.0</data>
</edge>
<edge source="62" target="14">
<data key="edgeid">74401</data>
<data key="weight">1.0</data>
</edge>
<edge source="62" target="49">
<data key="edgeid">74402</data>
<data key="weight">1.0</data>
</edge>
<edge source="3" target="34">
<data key="edgeid">74403</data>
<data key="weight">1.0</data>
</edge>
<edge source="8" target="36">
<data key="edgeid">74404</data>
<data key="weight">1.0</data>
</edge>
<edge source="8" target="63">
<data key="edgeid">74405</data>
<data key="weight">1.0</data>
</edge>
<edge source="8" target="40">
<data key="edgeid">74406</data>
<data key="weight">1.0</data>
</edge>
<edge source="8" target="31">
<data key="edgeid">74407</data>
<data key="weight">1.0</data>
</edge>
<edge source="8" target="44">
<data key="edgeid">74408</data>
<data key="weight">1.0</data>
</edge>
<edge source="8" target="21">
<data key="edgeid">74409</data>
<data key="weight">1.0</data>
</edge>
<edge source="8" target="42">
<data key="edgeid">74410</data>
<data key="weight">1.0</data>
</edge>
<edge source="8" target="62">
<data key="edgeid">74411</data>
<data key="weight">1.0</data>
</edge>
<edge source="8" target="50">
<data key="edgeid">74412</data>
<data key="weight">1.0</data>
</edge>
<edge source="19" target="43">
<data key="edgeid">74413</data>
<data key="weight">1.0</data>
</edge>
<edge source="20" target="16">
<data key="edgeid">74414</data>
<data key="weight">1.0</data>
</edge>
<edge source="21" target="48">
<data key="edgeid">74415</data>
<data key="weight">1.0</data>
</edge>
<edge source="22" target="37">
<data key="edgeid">74416</data>
<data key="weight">1.0</data>
</edge>
<edge source="23" target="34">
<data key="edgeid">74417</data>
<data key="weight">1.0</data>
</edge>
<edge source="28" target="0">
<data key="edgeid">74418</data>
<data key="weight">1.0</data>
</edge>
<edge source="29" target="41">
<data key="edgeid">74419</data>
<data key="weight">1.0</data>
</edge>
<edge source="11" target="39">
<data key="edgeid">74420</data>
<data key="weight">1.0</data>
</edge>
<edge source="36" target="0">
<data key="edgeid">74421</data>
<data key="weight">1.0</data>
</edge>
<edge source="40" target="12">
<data key="edgeid">74422</data>
<data key="weight">1.0</data>
</edge>
<edge source="41" target="61">
<data key="edgeid">74423</data>
<data key="weight">1.0</data>
</edge>
<edge source="50" target="3">
<data key="edgeid">74424</data>
<data key="weight">1.0</data>
</edge>
<edge source="55" target="23">
<data key="edgeid">74425</data>
<data key="weight">1.0</data>
</edge>
<edge source="58" target="2">
<data key="edgeid">74426</data>
<data key="weight">1.0</data>
</edge>
<edge source="63" target="12">
<data key="edgeid">74427</data>
<data key="weight">1.0</data>
</edge>
</graph>
</graphml>
