<?xml version="1.0" encoding="UTF-8"?>
<graphml xmlns="http://graphml.graphdrawing.org/xmlns">
<key attr.name="label" attr.type="string" for="node" id="label"/>
<key attr.name="Edge Label" attr.type="string" for="edge" id="edgelabel"/>
<key attr.name="weight" attr.type="double" for="edge" id="weight"/>
<key attr.name="Edge Id" attr.type="string" for="edge" id="edgeid"/>
<key attr.name="r" attr.type="int" for="node" id="r"/>
<key attr.name="g" attr.type="int" for="node" id="g"/>
<key attr.name="b" attr.type="int" for="node" id="b"/>
<key attr.name="x" attr.type="float" for="node" id="x"/>
<key attr.name="y" attr.type="float" for="node" id="y"/>
<key attr.name="size" attr.type="float" for="node" id="size"/>
<key attr.name="value" attr.type="double" for="node" id="value"/>
<graph edgedefault="directed">
<node id="0.0">
<data key="label">agreeable</data>
<data key="value">0.0</data>
<data key="size">10.0</data>
<data key="r">0</data>
<data key="g">0</data>
<data key="b">0</data>
<data key="x">-155.65967</data>
<data key="y">-271.1324</data>
</node>
<node id="1.0">
<data key="label">man</data>
<data key="value">1.0</data>
<data key="size">10.0</data>
<data key="r">0</data>
<data key="g">0</data>
<data key="b">0</data>
<data key="x">-57.39076</data>
<data key="y">-174.63074</data>
</node>
<node id="2.0">
<data key="label">old</data>
<data key="value">0.0</data>
<data key="size">10.0</data>
<data key="r">0</data>
<data key="g">0</data>
<data key="b">0</data>
<data key="x">-99.08468</data>
<data key="y">-133.31317</data>
</node>
<node id="3.0">
<data key="label">person</data>
<data key="value">1.0</data>
<data key="size">10.0</data>
<data key="r">0</data>
<data key="g">0</data>
<data key="b">0</data>
<data key="x">-167.60037</data>
<data key="y">-190.10416</data>
</node>
<node id="4.0">
<data key="label">anything</data>
<data key="value">1.0</data>
<data key="size">10.0</data>
<data key="r">0</data>
<data key="g">0</data>
<data key="b">0</data>
<data key="x">-117.0557</data>
<data key="y">363.98846</data>
</node>
<node id="5.0">
<data key="label">short</data>
<data key="value">0.0</data>
<data key="size">10.0</data>
<data key="r">0</data>
<data key="g">0</data>
<data key="b">0</data>
<data key="x">-99.40557</data>
<data key="y">226.04436</data>
</node>
<node id="6.0">
<data key="label">arm</data>
<data key="value">1.0</data>
<data key="size">10.0</data>
<data key="r">0</data>
<data key="g">0</data>
<data key="b">0</data>
<data key="x">34.606857</data>
<data key="y">277.21533</data>
</node>
<node id="7.0">
<data key="label">round</data>
<data key="value">0.0</data>
<data key="size">10.0</data>
<data key="r">0</data>
<data key="g">0</data>
<data key="b">0</data>
<data key="x">188.84319</data>
<data key="y">140.70114</data>
</node>
<node id="8.0">
<data key="label">aunt</data>
<data key="value">1.0</data>
<data key="size">10.0</data>
<data key="r">0</data>
<data key="g">0</data>
<data key="b">0</data>
<data key="x">-40.22695</data>
<data key="y">-391.61746</data>
</node>
<node id="9.0">
<data key="label">first</data>
<data key="value">0.0</data>
<data key="size">10.0</data>
<data key="r">0</data>
<data key="g">0</data>
<data key="b">0</data>
<data key="x">-26.49845</data>
<data key="y">-237.98567</data>
</node>
<node id="10.0">
<data key="label">bad</data>
<data key="value">0.0</data>
<data key="size">10.0</data>
<data key="r">0</data>
<data key="g">0</data>
<data key="b">0</data>
<data key="x">-226.57156</data>
<data key="y">-175.53488</data>
</node>
<node id="11.0">
<data key="label">air</data>
<data key="value">1.0</data>
<data key="size">10.0</data>
<data key="r">0</data>
<data key="g">0</data>
<data key="b">0</data>
<data key="x">-194.43314</data>
<data key="y">-292.5375</data>
</node>
<node id="12.0">
<data key="label">boy</data>
<data key="value">1.0</data>
<data key="size">10.0</data>
<data key="r">0</data>
<data key="g">0</data>
<data key="b">0</data>
<data key="x">-40.583267</data>
<data key="y">-43.78957</data>
</node>
<node id="13.0">
<data key="label">beautiful</data>
<data key="value">0.0</data>
<data key="size">10.0</data>
<data key="r">0</data>
<data key="g">0</data>
<data key="b">0</data>
<data key="x">203.59605</data>
<data key="y">5.586933</data>
</node>
<node id="14.0">
<data key="label">black</data>
<data key="value">0.0</data>
<data key="size">10.0</data>
<data key="r">0</data>
<data key="g">0</data>
<data key="b">0</data>
<data key="x">209.30687</data>
<data key="y">-175.28323</data>
</node>
<node id="15.0">
<data key="label">face</data>
<data key="value">1.0</data>
<data key="size">10.0</data>
<data key="r">0</data>
<data key="g">0</data>
<data key="b">0</data>
<data key="x">127.20913</data>
<data key="y">113.28229</data>
</node>
<node id="16.0">
<data key="label">letter</data>
<data key="value">1.0</data>
<data key="size">10.0</data>
<data key="r">0</data>
<data key="g">0</data>
<data key="b">0</data>
<data key="x">346.53775</data>
<data key="y">-91.63621</data>
</node>
<node id="17.0">
<data key="label">little</data>
<data key="value">0.0</data>
<data key="size">10.0</data>
<data key="r">0</data>
<data key="g">0</data>
<data key="b">0</data>
<data key="x">16.383913</data>
<data key="y">30.104372</data>
</node>
<node id="18.0">
<data key="label">young</data>
<data key="value">0.0</data>
<data key="size">10.0</data>
<data key="r">0</data>
<data key="g">0</data>
<data key="b">0</data>
<data key="x">-1.4103261</data>
<data key="y">108.13845</data>
</node>
<node id="19.0">
<data key="label">best</data>
<data key="value">0.0</data>
<data key="size">10.0</data>
<data key="r">0</data>
<data key="g">0</data>
<data key="b">0</data>
<data key="x">-139.06789</data>
<data key="y">-90.69598</data>
</node>
<node id="20.0">
<data key="label">course</data>
<data key="value">1.0</data>
<data key="size">10.0</data>
<data key="r">0</data>
<data key="g">0</data>
<data key="b">0</data>
<data key="x">-311.0373</data>
<data key="y">5.069825</data>
</node>
<node id="21.0">
<data key="label">friend</data>
<data key="value">1.0</data>
<data key="size">10.0</data>
<data key="r">0</data>
<data key="g">0</data>
<data key="b">0</data>
<data key="x">-36.80051</data>
<data key="y">81.203606</data>
</node>
<node id="22.0">
<data key="label">love</data>
<data key="value">1.0</data>
<data key="size">10.0</data>
<data key="r">0</data>
<data key="g">0</data>
<data key="b">0</data>
<data key="x">-267.6032</data>
<data key="y">-49.26348</data>
</node>
<node id="23.0">
<data key="label">part</data>
<data key="value">1.0</data>
<data key="size">10.0</data>
<data key="r">0</data>
<data key="g">0</data>
<data key="b">0</data>
<data key="x">31.81967</data>
<data key="y">-253.60362</data>
</node>
<node id="24.0">
<data key="label">room</data>
<data key="value">1.0</data>
<data key="size">10.0</data>
<data key="r">0</data>
<data key="g">0</data>
<data key="b">0</data>
<data key="x">122.90354</data>
<data key="y">-119.4096</data>
</node>
<node id="25.0">
<data key="label">thing</data>
<data key="value">1.0</data>
<data key="size">10.0</data>
<data key="r">0</data>
<data key="g">0</data>
<data key="b">0</data>
<data key="x">87.01409</data>
<data key="y">-169.86627</data>
</node>
<node id="26.0">
<data key="label">time</data>
<data key="value">1.0</data>
<data key="size">10.0</data>
<data key="r">0</data>
<data key="g">0</data>
<data key="b">0</data>
<data key="x">-96.772606</data>
<data key="y">-52.459343</data>
</node>
<node id="27.0">
<data key="label">way</data>
<data key="value">1.0</data>
<data key="size">10.0</data>
<data key="r">0</data>
<data key="g">0</data>
<data key="b">0</data>
<data key="x">-35.187096</data>
<data key="y">133.80458</data>
</node>
<node id="28.0">
<data key="label">better</data>
<data key="value">0.0</data>
<data key="size">10.0</data>
<data key="r">0</data>
<data key="g">0</data>
<data key="b">0</data>
<data key="x">22.393557</data>
<data key="y">239.14886</data>
</node>
<node id="29.0">
<data key="label">heart</data>
<data key="value">1.0</data>
<data key="size">10.0</data>
<data key="r">0</data>
<data key="g">0</data>
<data key="b">0</data>
<data key="x">-22.620075</data>
<data key="y">355.2502</data>
</node>
<node id="30.0">
<data key="label">mind</data>
<data key="value">1.0</data>
<data key="size">10.0</data>
<data key="r">0</data>
<data key="g">0</data>
<data key="b">0</data>
<data key="x">99.73151</data>
<data key="y">216.07481</data>
</node>
<node id="31.0">
<data key="label">place</data>
<data key="value">1.0</data>
<data key="size">10.0</data>
<data key="r">0</data>
<data key="g">0</data>
<data key="b">0</data>
<data key="x">-163.65883</data>
<data key="y">31.359241</data>
</node>
<node id="32.0">
<data key="label">right</data>
<data key="value">0.0</data>
<data key="size">10.0</data>
<data key="r">0</data>
<data key="g">0</data>
<data key="b">0</data>
<data key="x">-50.48728</data>
<data key="y">231.54655</data>
</node>
<node id="33.0">
<data key="label">state</data>
<data key="value">1.0</data>
<data key="size">10.0</data>
<data key="r">0</data>
<data key="g">0</data>
<data key="b">0</data>
<data key="x">243.17772</data>
<data key="y">194.3131</data>
</node>
<node id="34.0">
<data key="label">woman</data>
<data key="value">1.0</data>
<data key="size">10.0</data>
<data key="r">0</data>
<data key="g">0</data>
<data key="b">0</data>
<data key="x">75.34244</data>
<data key="y">190.67291</data>
</node>
<node id="35.0">
<data key="label">word</data>
<data key="value">1.0</data>
<data key="size">10.0</data>
<data key="r">0</data>
<data key="g">0</data>
<data key="b">0</data>
<data key="x">184.19586</data>
<data key="y">-41.822674</data>
</node>
<node id="36.0">
<data key="label">door</data>
<data key="value">1.0</data>
<data key="size">10.0</data>
<data key="r">0</data>
<data key="g">0</data>
<data key="b">0</data>
<data key="x">98.214386</data>
<data key="y">-48.65507</data>
</node>
<node id="37.0">
<data key="label">eye</data>
<data key="value">1.0</data>
<data key="size">10.0</data>
<data key="r">0</data>
<data key="g">0</data>
<data key="b">0</data>
<data key="x">272.35583</data>
<data key="y">-65.47575</data>
</node>
<node id="38.0">
<data key="label">bright</data>
<data key="value">0.0</data>
<data key="size">10.0</data>
<data key="r">0</data>
<data key="g">0</data>
<data key="b">0</data>
<data key="x">30.1372</data>
<data key="y">-86.63127</data>
</node>
<node id="39.0">
<data key="label">evening</data>
<data key="value">1.0</data>
<data key="size">10.0</data>
<data key="r">0</data>
<data key="g">0</data>
<data key="b">0</data>
<data key="x">-52.572495</data>
<data key="y">-80.84797</data>
</node>
<node id="40.0">
<data key="label">morning</data>
<data key="value">1.0</data>
<data key="size">10.0</data>
<data key="r">0</data>
<data key="g">0</data>
<data key="b">0</data>
<data key="x">-189.74905</data>
<data key="y">-260.11563</data>
</node>
<node id="41.0">
<data key="label">certain</data>
<data key="value">0.0</data>
<data key="size">10.0</data>
<data key="r">0</data>
<data key="g">0</data>
<data key="b">0</data>
<data key="x">-173.73203</data>
<data key="y">-160.31009</data>
</node>
<node id="42.0">
<data key="label">day</data>
<data key="value">1.0</data>
<data key="size">10.0</data>
<data key="r">0</data>
<data key="g">0</data>
<data key="b">0</data>
<data key="x">-259.36572</data>
<data key="y">-130.60274</data>
</node>
<node id="43.0">
<data key="label">other</data>
<data key="value">0.0</data>
<data key="size">10.0</data>
<data key="r">0</data>
<data key="g">0</data>
<data key="b">0</data>
<data key="x">-114.351944</data>
<data key="y">14.349837</data>
</node>
<node id="44.0">
<data key="label">child</data>
<data key="value">1.0</data>
<data key="size">10.0</data>
<data key="r">0</data>
<data key="g">0</data>
<data key="b">0</data>
<data key="x">-128.22044</data>
<data key="y">134.81947</data>
</node>
<node id="45.0">
<data key="label">happy</data>
<data key="value">0.0</data>
<data key="size">10.0</data>
<data key="r">0</data>
<data key="g">0</data>
<data key="b">0</data>
<data key="x">-198.82188</data>
<data key="y">-24.57681</data>
</node>
<node id="46.0">
<data key="label">common</data>
<data key="value">0.0</data>
<data key="size">10.0</data>
<data key="r">0</data>
<data key="g">0</data>
<data key="b">0</data>
<data key="x">35.895523</data>
<data key="y">-292.19562</data>
</node>
<node id="47.0">
<data key="label">dark</data>
<data key="value">0.0</data>
<data key="size">10.0</data>
<data key="r">0</data>
<data key="g">0</data>
<data key="b">0</data>
<data key="x">263.16534</data>
<data key="y">-194.33154</data>
</node>
<node id="48.0">
<data key="label">kind</data>
<data key="value">0.0</data>
<data key="size">10.0</data>
<data key="r">0</data>
<data key="g">0</data>
<data key="b">0</data>
<data key="x">156.69151</data>
<data key="y">-11.108317</data>
</node>
<node id="49.0">
<data key="label">night</data>
<data key="value">1.0</data>
<data key="size">10.0</data>
<data key="r">0</data>
<data key="g">0</data>
<data key="b">0</data>
<data key="x">284.58716</data>
<data key="y">-160.61429</data>
</node>
<node id="50.0">
<data key="label">dear</data>
<data key="value">0.0</data>
<data key="size">10.0</data>
<data key="r">0</data>
<data key="g">0</data>
<data key="b">0</data>
<data key="x">-94.33279</data>
<data key="y">87.30565</data>
</node>
<node id="51.0">
<data key="label">good</data>
<data key="value">0.0</data>
<data key="size">10.0</data>
<data key="r">0</data>
<data key="g">0</data>
<data key="b">0</data>
<data key="x">97.851616</data>
<data key="y">10.119655</data>
</node>
<node id="52.0">
<data key="label">home</data>
<data key="value">1.0</data>
<data key="size">10.0</data>
<data key="r">0</data>
<data key="g">0</data>
<data key="b">0</data>
<data key="x">-166.32103</data>
<data key="y">157.1382</data>
</node>
<node id="53.0">
<data key="label">mother</data>
<data key="value">1.0</data>
<data key="size">10.0</data>
<data key="r">0</data>
<data key="g">0</data>
<data key="b">0</data>
<data key="x">-6.403526</data>
<data key="y">187.29861</data>
</node>
<node id="54.0">
<data key="label">pretty</data>
<data key="value">0.0</data>
<data key="size">10.0</data>
<data key="r">0</data>
<data key="g">0</data>
<data key="b">0</data>
<data key="x">83.58059</data>
<data key="y">140.56903</data>
</node>
<node id="55.0">
<data key="label">open</data>
<data key="value">0.0</data>
<data key="size">10.0</data>
<data key="r">0</data>
<data key="g">0</data>
<data key="b">0</data>
<data key="x">161.14287</data>
<data key="y">205.98901</data>
</node>
<node id="56.0">
<data key="label">early</data>
<data key="value">0.0</data>
<data key="size">10.0</data>
<data key="r">0</data>
<data key="g">0</data>
<data key="b">0</data>
<data key="x">-293.40448</data>
<data key="y">-95.967384</data>
</node>
<node id="57.0">
<data key="label">fire</data>
<data key="value">1.0</data>
<data key="size">10.0</data>
<data key="r">0</data>
<data key="g">0</data>
<data key="b">0</data>
<data key="x">345.5314</data>
<data key="y">9.475285</data>
</node>
<node id="58.0">
<data key="label">full</data>
<data key="value">0.0</data>
<data key="size">10.0</data>
<data key="r">0</data>
<data key="g">0</data>
<data key="b">0</data>
<data key="x">190.59549</data>
<data key="y">261.20016</data>
</node>
<node id="59.0">
<data key="label">great</data>
<data key="value">0.0</data>
<data key="size">10.0</data>
<data key="r">0</data>
<data key="g">0</data>
<data key="b">0</data>
<data key="x">176.02083</data>
<data key="y">-208.40845</data>
</node>
<node id="60.0">
<data key="label">master</data>
<data key="value">1.0</data>
<data key="size">10.0</data>
<data key="r">0</data>
<data key="g">0</data>
<data key="b">0</data>
<data key="x">256.81415</data>
<data key="y">-114.35896</data>
</node>
<node id="61.0">
<data key="label">moment</data>
<data key="value">1.0</data>
<data key="size">10.0</data>
<data key="r">0</data>
<data key="g">0</data>
<data key="b">0</data>
<data key="x">-1.7928518</data>
<data key="y">-326.1325</data>
</node>
<node id="62.0">
<data key="label">work</data>
<data key="value">1.0</data>
<data key="size">10.0</data>
<data key="r">0</data>
<data key="g">0</data>
<data key="b">0</data>
<data key="x">163.61002</data>
<data key="y">-304.287</data>
</node>
<node id="63.0">
<data key="label">general</data>
<data key="value">0.0</data>
<data key="size">10.0</data>
<data key="r">0</data>
<data key="g">0</data>
<data key="b">0</data>
<data key="x">-121.77407</data>
<data key="y">-227.19077</data>
</node>
<node id="64.0">
<data key="label">fancy</data>
<data key="value">0.0</data>
<data key="size">10.0</data>
<data key="r">0</data>
<data key="g">0</data>
<data key="b">0</data>
<data key="x">-194.73425</data>
<data key="y">-364.59744</data>
</node>
<node id="65.0">
<data key="label">voice</data>
<data key="value">1.0</data>
<data key="size">10.0</data>
<data key="r">0</data>
<data key="g">0</data>
<data key="b">0</data>
<data key="x">158.1554</data>
<data key="y">-134.18356</data>
</node>
<node id="66.0">
<data key="label">head</data>
<data key="value">1.0</data>
<data key="size">10.0</data>
<data key="r">0</data>
<data key="g">0</data>
<data key="b">0</data>
<data key="x">56.37925</data>
<data key="y">-40.03767</data>
</node>
<node id="67.0">
<data key="label">hope</data>
<data key="value">1.0</data>
<data key="size">10.0</data>
<data key="r">0</data>
<data key="g">0</data>
<data key="b">0</data>
<data key="x">221.00067</data>
<data key="y">108.27512</data>
</node>
<node id="68.0">
<data key="label">long</data>
<data key="value">0.0</data>
<data key="size">10.0</data>
<data key="r">0</data>
<data key="g">0</data>
<data key="b">0</data>
<data key="x">254.59427</data>
<data key="y">-15.320406</data>
</node>
<node id="69.0">
<data key="label">greater</data>
<data key="value">0.0</data>
<data key="size">10.0</data>
<data key="r">0</data>
<data key="g">0</data>
<data key="b">0</data>
<data key="x">-102.14823</data>
<data key="y">-344.00592</data>
</node>
<node id="70.0">
<data key="label">hand</data>
<data key="value">1.0</data>
<data key="size">10.0</data>
<data key="r">0</data>
<data key="g">0</data>
<data key="b">0</data>
<data key="x">169.9139</data>
<data key="y">81.158516</data>
</node>
<node id="71.0">
<data key="label">hard</data>
<data key="value">0.0</data>
<data key="size">10.0</data>
<data key="r">0</data>
<data key="g">0</data>
<data key="b">0</data>
<data key="x">261.6875</data>
<data key="y">-242.24055</data>
</node>
<node id="72.0">
<data key="label">red</data>
<data key="value">0.0</data>
<data key="size">10.0</data>
<data key="r">0</data>
<data key="g">0</data>
<data key="b">0</data>
<data key="x">185.34256</data>
<data key="y">-78.73383</data>
</node>
<node id="73.0">
<data key="label">life</data>
<data key="value">1.0</data>
<data key="size">10.0</data>
<data key="r">0</data>
<data key="g">0</data>
<data key="b">0</data>
<data key="x">138.29279</data>
<data key="y">-61.52117</data>
</node>
<node id="74.0">
<data key="label">glad</data>
<data key="value">0.0</data>
<data key="size">10.0</data>
<data key="r">0</data>
<data key="g">0</data>
<data key="b">0</data>
<data key="x">-28.559544</data>
<data key="y">410.85886</data>
</node>
<node id="75.0">
<data key="label">large</data>
<data key="value">0.0</data>
<data key="size">10.0</data>
<data key="r">0</data>
<data key="g">0</data>
<data key="b">0</data>
<data key="x">289.72382</data>
<data key="y">65.50488</data>
</node>
<node id="76.0">
<data key="label">new</data>
<data key="value">0.0</data>
<data key="size">10.0</data>
<data key="r">0</data>
<data key="g">0</data>
<data key="b">0</data>
<data key="x">251.61087</data>
<data key="y">141.06686</data>
</node>
<node id="77.0">
<data key="label">white</data>
<data key="value">0.0</data>
<data key="size">10.0</data>
<data key="r">0</data>
<data key="g">0</data>
<data key="b">0</data>
<data key="x">234.72226</data>
<data key="y">-58.477154</data>
</node>
<node id="78.0">
<data key="label">late</data>
<data key="value">0.0</data>
<data key="size">10.0</data>
<data key="r">0</data>
<data key="g">0</data>
<data key="b">0</data>
<data key="x">-153.93283</data>
<data key="y">225.81946</data>
</node>
<node id="79.0">
<data key="label">whole</data>
<data key="value">0.0</data>
<data key="size">10.0</data>
<data key="r">0</data>
<data key="g">0</data>
<data key="b">0</data>
<data key="x">-226.93173</data>
<data key="y">172.24557</data>
</node>
<node id="80.0">
<data key="label">light</data>
<data key="value">0.0</data>
<data key="size">10.0</data>
<data key="r">0</data>
<data key="g">0</data>
<data key="b">0</data>
<data key="x">34.771046</data>
<data key="y">131.02377</data>
</node>
<node id="81.0">
<data key="label">manner</data>
<data key="value">1.0</data>
<data key="size">10.0</data>
<data key="r">0</data>
<data key="g">0</data>
<data key="b">0</data>
<data key="x">-252.13577</data>
<data key="y">36.3031</data>
</node>
<node id="82.0">
<data key="label">bed</data>
<data key="value">1.0</data>
<data key="size">10.0</data>
<data key="r">0</data>
<data key="g">0</data>
<data key="b">0</data>
<data key="x">-68.60481</data>
<data key="y">173.1635</data>
</node>
<node id="83.0">
<data key="label">house</data>
<data key="value">1.0</data>
<data key="size">10.0</data>
<data key="r">0</data>
<data key="g">0</data>
<data key="b">0</data>
<data key="x">-155.42523</data>
<data key="y">78.90326</data>
</node>
<node id="84.0">
<data key="label">low</data>
<data key="value">0.0</data>
<data key="size">10.0</data>
<data key="r">0</data>
<data key="g">0</data>
<data key="b">0</data>
<data key="x">235.60507</data>
<data key="y">50.205532</data>
</node>
<node id="85.0">
<data key="label">money</data>
<data key="value">1.0</data>
<data key="size">10.0</data>
<data key="r">0</data>
<data key="g">0</data>
<data key="b">0</data>
<data key="x">-199.24805</data>
<data key="y">-130.85458</data>
</node>
<node id="86.0">
<data key="label">ready</data>
<data key="value">0.0</data>
<data key="size">10.0</data>
<data key="r">0</data>
<data key="g">0</data>
<data key="b">0</data>
<data key="x">-203.9439</data>
<data key="y">81.7735</data>
</node>
<node id="87.0">
<data key="label">small</data>
<data key="value">0.0</data>
<data key="size">10.0</data>
<data key="r">0</data>
<data key="g">0</data>
<data key="b">0</data>
<data key="x">122.01747</data>
<data key="y">61.109837</data>
</node>
<node id="88.0">
<data key="label">strange</data>
<data key="value">0.0</data>
<data key="size">10.0</data>
<data key="r">0</data>
<data key="g">0</data>
<data key="b">0</data>
<data key="x">177.84785</data>
<data key="y">42.923798</data>
</node>
<node id="89.0">
<data key="label">thought</data>
<data key="value">1.0</data>
<data key="size">10.0</data>
<data key="r">0</data>
<data key="g">0</data>
<data key="b">0</data>
<data key="x">-45.07033</data>
<data key="y">280.75354</data>
</node>
<node id="90.0">
<data key="label">lost</data>
<data key="value">0.0</data>
<data key="size">10.0</data>
<data key="r">0</data>
<data key="g">0</data>
<data key="b">0</data>
<data key="x">-389.78833</data>
<data key="y">-184.09143</data>
</node>
<node id="91.0">
<data key="label">alone</data>
<data key="value">0.0</data>
<data key="size">10.0</data>
<data key="r">0</data>
<data key="g">0</data>
<data key="b">0</data>
<data key="x">-90.07792</data>
<data key="y">-276.8366</data>
</node>
<node id="92.0">
<data key="label">nothing</data>
<data key="value">1.0</data>
<data key="size">10.0</data>
<data key="r">0</data>
<data key="g">0</data>
<data key="b">0</data>
<data key="x">132.03998</data>
<data key="y">375.71317</data>
</node>
<node id="93.0">
<data key="label">miserable</data>
<data key="value">0.0</data>
<data key="size">10.0</data>
<data key="r">0</data>
<data key="g">0</data>
<data key="b">0</data>
<data key="x">-162.7291</data>
<data key="y">-68.04591</data>
</node>
<node id="94.0">
<data key="label">natural</data>
<data key="value">0.0</data>
<data key="size">10.0</data>
<data key="r">0</data>
<data key="g">0</data>
<data key="b">0</data>
<data key="x">-382.80832</data>
<data key="y">3.1938496</data>
</node>
<node id="95.0">
<data key="label">half</data>
<data key="value">1.0</data>
<data key="size">10.0</data>
<data key="r">0</data>
<data key="g">0</data>
<data key="b">0</data>
<data key="x">155.88805</data>
<data key="y">423.14313</data>
</node>
<node id="96.0">
<data key="label">wrong</data>
<data key="value">0.0</data>
<data key="size">10.0</data>
<data key="r">0</data>
<data key="g">0</data>
<data key="b">0</data>
<data key="x">143.7401</data>
<data key="y">339.08804</data>
</node>
<node id="97.0">
<data key="label">name</data>
<data key="value">1.0</data>
<data key="size">10.0</data>
<data key="r">0</data>
<data key="g">0</data>
<data key="b">0</data>
<data key="x">-230.07047</data>
<data key="y">-256.58746</data>
</node>
<node id="98.0">
<data key="label">pleasant</data>
<data key="value">0.0</data>
<data key="size">10.0</data>
<data key="r">0</data>
<data key="g">0</data>
<data key="b">0</data>
<data key="x">-229.16766</data>
<data key="y">-91.82798</data>
</node>
<node id="99.0">
<data key="label">possible</data>
<data key="value">0.0</data>
<data key="size">10.0</data>
<data key="r">0</data>
<data key="g">0</data>
<data key="b">0</data>
<data key="x">-155.1133</data>
<data key="y">262.01694</data>
</node>
<node id="100.0">
<data key="label">side</data>
<data key="value">1.0</data>
<data key="size">10.0</data>
<data key="r">0</data>
<data key="g">0</data>
<data key="b">0</data>
<data key="x">-237.50089</data>
<data key="y">257.0601</data>
</node>
<node id="101.0">
<data key="label">perfect</data>
<data key="value">0.0</data>
<data key="size">10.0</data>
<data key="r">0</data>
<data key="g">0</data>
<data key="b">0</data>
<data key="x">314.0433</data>
<data key="y">-93.78266</data>
</node>
<node id="102.0">
<data key="label">poor</data>
<data key="value">0.0</data>
<data key="size">10.0</data>
<data key="r">0</data>
<data key="g">0</data>
<data key="b">0</data>
<data key="x">-41.875057</data>
<data key="y">17.13169</data>
</node>
<node id="103.0">
<data key="label">quiet</data>
<data key="value">0.0</data>
<data key="size">10.0</data>
<data key="r">0</data>
<data key="g">0</data>
<data key="b">0</data>
<data key="x">78.40459</data>
<data key="y">-93.55067</data>
</node>
<node id="104.0">
<data key="label">same</data>
<data key="value">0.0</data>
<data key="size">10.0</data>
<data key="r">0</data>
<data key="g">0</data>
<data key="b">0</data>
<data key="x">29.41881</data>
<data key="y">-141.78185</data>
</node>
<node id="105.0">
<data key="label">strong</data>
<data key="value">0.0</data>
<data key="size">10.0</data>
<data key="r">0</data>
<data key="g">0</data>
<data key="b">0</data>
<data key="x">81.663925</data>
<data key="y">-221.92789</data>
</node>
<node id="106.0">
<data key="label">something</data>
<data key="value">1.0</data>
<data key="size">10.0</data>
<data key="r">0</data>
<data key="g">0</data>
<data key="b">0</data>
<data key="x">215.92366</data>
<data key="y">220.3752</data>
</node>
<node id="107.0">
<data key="label">true</data>
<data key="value">0.0</data>
<data key="size">10.0</data>
<data key="r">0</data>
<data key="g">0</data>
<data key="b">0</data>
<data key="x">234.53342</data>
<data key="y">295.60278</data>
</node>
<node id="108.0">
<data key="label">usual</data>
<data key="value">0.0</data>
<data key="size">10.0</data>
<data key="r">0</data>
<data key="g">0</data>
<data key="b">0</data>
<data key="x">-163.25912</data>
<data key="y">-120.11596</data>
</node>
<node id="109.0">
<data key="label">family</data>
<data key="value">1.0</data>
<data key="size">10.0</data>
<data key="r">0</data>
<data key="g">0</data>
<data key="b">0</data>
<data key="x">-344.45013</data>
<data key="y">244.74338</data>
</node>
<node id="110.0">
<data key="label">world</data>
<data key="value">1.0</data>
<data key="size">10.0</data>
<data key="r">0</data>
<data key="g">0</data>
<data key="b">0</data>
<data key="x">-313.35715</data>
<data key="y">285.43073</data>
</node>
<node id="111.0">
<data key="label">year</data>
<data key="value">1.0</data>
<data key="size">10.0</data>
<data key="r">0</data>
<data key="g">0</data>
<data key="b">0</data>
<data key="x">-241.28392</data>
<data key="y">-241.0531</data>
</node>
<edge source="1.0" target="0.0">
<data key="edgeid">6744</data>
<data key="weight">1.0</data>
</edge>
<edge source="2.0" target="0.0">
<data key="edgeid">6745</data>
<data key="weight">1.0</data>
</edge>
<edge source="2.0" target="1.0">
<data key="edgeid">6746</data>
<data key="weight">1.0</data>
</edge>
<edge source="3.0" target="0.0">
<data key="edgeid">6747</data>
<data key="weight">1.0</data>
</edge>
<edge source="3.0" target="2.0">
<data key="edgeid">6748</data>
<data key="weight">1.0</data>
</edge>
<edge source="5.0" target="4.0">
<data key="edgeid">6749</data>
<data key="weight">1.0</data>
</edge>
<edge source="6.0" target="5.0">
<data key="edgeid">6750</data>
<data key="weight">1.0</data>
</edge>
<edge source="7.0" target="6.0">
<data key="edgeid">6751</data>
<data key="weight">1.0</data>
</edge>
<edge source="9.0" target="1.0">
<data key="edgeid">6752</data>
<data key="weight">1.0</data>
</edge>
<edge source="9.0" target="2.0">
<data key="edgeid">6753</data>
<data key="weight">1.0</data>
</edge>
<edge source="9.0" target="3.0">
<data key="edgeid">6754</data>
<data key="weight">1.0</data>
</edge>
<edge source="9.0" target="8.0">
<data key="edgeid">6755</data>
<data key="weight">1.0</data>
</edge>
<edge source="10.0" target="3.0">
<data key="edgeid">6756</data>
<data key="weight">1.0</data>
</edge>
<edge source="11.0" target="2.0">
<data key="edgeid">6757</data>
<data key="weight">1.0</data>
</edge>
<edge source="11.0" target="10.0">
<data key="edgeid">6758</data>
<data key="weight">1.0</data>
</edge>
<edge source="12.0" target="9.0">
<data key="edgeid">6759</data>
<data key="weight">1.0</data>
</edge>
<edge source="12.0" target="10.0">
<data key="edgeid">6760</data>
<data key="weight">1.0</data>
</edge>
<edge source="14.0" target="1.0">
<data key="edgeid">6761</data>
<data key="weight">1.0</data>
</edge>
<edge source="14.0" target="2.0">
<data key="edgeid">6762</data>
<data key="weight">1.0</data>
</edge>
<edge source="14.0" target="13.0">
<data key="edgeid">6763</data>
<data key="weight">1.0</data>
</edge>
<edge source="15.0" target="7.0">
<data key="edgeid">6764</data>
<data key="weight">1.0</data>
</edge>
<edge source="15.0" target="13.0">
<data key="edgeid">6765</data>
<data key="weight">1.0</data>
</edge>
<edge source="16.0" target="13.0">
<data key="edgeid">6766</data>
<data key="weight">1.0</data>
</edge>
<edge source="16.0" target="14.0">
<data key="edgeid">6767</data>
<data key="weight">1.0</data>
</edge>
<edge source="17.0" target="1.0">
<data key="edgeid">6768</data>
<data key="weight">1.0</data>
</edge>
<edge source="17.0" target="2.0">
<data key="edgeid">6769</data>
<data key="weight">1.0</data>
</edge>
<edge source="17.0" target="5.0">
<data key="edgeid">6770</data>
<data key="weight">1.0</data>
</edge>
<edge source="17.0" target="7.0">
<data key="edgeid">6771</data>
<data key="weight">1.0</data>
</edge>
<edge source="17.0" target="9.0">
<data key="edgeid">6772</data>
<data key="weight">1.0</data>
</edge>
<edge source="17.0" target="12.0">
<data key="edgeid">6773</data>
<data key="weight">1.0</data>
</edge>
<edge source="17.0" target="13.0">
<data key="edgeid">6774</data>
<data key="weight">1.0</data>
</edge>
<edge source="17.0" target="14.0">
<data key="edgeid">6775</data>
<data key="weight">1.0</data>
</edge>
<edge source="17.0" target="15.0">
<data key="edgeid">6776</data>
<data key="weight">1.0</data>
</edge>
<edge source="18.0" target="1.0">
<data key="edgeid">6777</data>
<data key="weight">1.0</data>
</edge>
<edge source="18.0" target="3.0">
<data key="edgeid">6778</data>
<data key="weight">1.0</data>
</edge>
<edge source="18.0" target="12.0">
<data key="edgeid">6779</data>
<data key="weight">1.0</data>
</edge>
<edge source="18.0" target="13.0">
<data key="edgeid">6780</data>
<data key="weight">1.0</data>
</edge>
<edge source="19.0" target="1.0">
<data key="edgeid">6781</data>
<data key="weight">1.0</data>
</edge>
<edge source="20.0" target="19.0">
<data key="edgeid">6782</data>
<data key="weight">1.0</data>
</edge>
<edge source="21.0" target="2.0">
<data key="edgeid">6783</data>
<data key="weight">1.0</data>
</edge>
<edge source="21.0" target="7.0">
<data key="edgeid">6784</data>
<data key="weight">1.0</data>
</edge>
<edge source="21.0" target="17.0">
<data key="edgeid">6785</data>
<data key="weight">1.0</data>
</edge>
<edge source="21.0" target="18.0">
<data key="edgeid">6786</data>
<data key="weight">1.0</data>
</edge>
<edge source="21.0" target="19.0">
<data key="edgeid">6787</data>
<data key="weight">1.0</data>
</edge>
<edge source="22.0" target="2.0">
<data key="edgeid">6788</data>
<data key="weight">1.0</data>
</edge>
<edge source="22.0" target="17.0">
<data key="edgeid">6789</data>
<data key="weight">1.0</data>
</edge>
<edge source="22.0" target="19.0">
<data key="edgeid">6790</data>
<data key="weight">1.0</data>
</edge>
<edge source="23.0" target="2.0">
<data key="edgeid">6791</data>
<data key="weight">1.0</data>
</edge>
<edge source="23.0" target="19.0">
<data key="edgeid">6792</data>
<data key="weight">1.0</data>
</edge>
<edge source="24.0" target="2.0">
<data key="edgeid">6793</data>
<data key="weight">1.0</data>
</edge>
<edge source="24.0" target="9.0">
<data key="edgeid">6794</data>
<data key="weight">1.0</data>
</edge>
<edge source="24.0" target="17.0">
<data key="edgeid">6795</data>
<data key="weight">1.0</data>
</edge>
<edge source="24.0" target="19.0">
<data key="edgeid">6796</data>
<data key="weight">1.0</data>
</edge>
<edge source="25.0" target="2.0">
<data key="edgeid">6797</data>
<data key="weight">1.0</data>
</edge>
<edge source="25.0" target="9.0">
<data key="edgeid">6798</data>
<data key="weight">1.0</data>
</edge>
<edge source="25.0" target="14.0">
<data key="edgeid">6799</data>
<data key="weight">1.0</data>
</edge>
<edge source="25.0" target="17.0">
<data key="edgeid">6800</data>
<data key="weight">1.0</data>
</edge>
<edge source="25.0" target="19.0">
<data key="edgeid">6801</data>
<data key="weight">1.0</data>
</edge>
<edge source="26.0" target="2.0">
<data key="edgeid">6802</data>
<data key="weight">1.0</data>
</edge>
<edge source="26.0" target="9.0">
<data key="edgeid">6803</data>
<data key="weight">1.0</data>
</edge>
<edge source="26.0" target="17.0">
<data key="edgeid">6804</data>
<data key="weight">1.0</data>
</edge>
<edge source="26.0" target="19.0">
<data key="edgeid">6805</data>
<data key="weight">1.0</data>
</edge>
<edge source="27.0" target="2.0">
<data key="edgeid">6806</data>
<data key="weight">1.0</data>
</edge>
<edge source="27.0" target="5.0">
<data key="edgeid">6807</data>
<data key="weight">1.0</data>
</edge>
<edge source="27.0" target="17.0">
<data key="edgeid">6808</data>
<data key="weight">1.0</data>
</edge>
<edge source="27.0" target="19.0">
<data key="edgeid">6809</data>
<data key="weight">1.0</data>
</edge>
<edge source="28.0" target="1.0">
<data key="edgeid">6810</data>
<data key="weight">1.0</data>
</edge>
<edge source="28.0" target="17.0">
<data key="edgeid">6811</data>
<data key="weight">1.0</data>
</edge>
<edge source="28.0" target="21.0">
<data key="edgeid">6812</data>
<data key="weight">1.0</data>
</edge>
<edge source="29.0" target="18.0">
<data key="edgeid">6813</data>
<data key="weight">1.0</data>
</edge>
<edge source="29.0" target="28.0">
<data key="edgeid">6814</data>
<data key="weight">1.0</data>
</edge>
<edge source="30.0" target="25.0">
<data key="edgeid">6815</data>
<data key="weight">1.0</data>
</edge>
<edge source="30.0" target="28.0">
<data key="edgeid">6816</data>
<data key="weight">1.0</data>
</edge>
<edge source="31.0" target="2.0">
<data key="edgeid">6817</data>
<data key="weight">1.0</data>
</edge>
<edge source="31.0" target="17.0">
<data key="edgeid">6818</data>
<data key="weight">1.0</data>
</edge>
<edge source="31.0" target="28.0">
<data key="edgeid">6819</data>
<data key="weight">1.0</data>
</edge>
<edge source="32.0" target="5.0">
<data key="edgeid">6820</data>
<data key="weight">1.0</data>
</edge>
<edge source="32.0" target="6.0">
<data key="edgeid">6821</data>
<data key="weight">1.0</data>
</edge>
<edge source="32.0" target="15.0">
<data key="edgeid">6822</data>
<data key="weight">1.0</data>
</edge>
<edge source="32.0" target="17.0">
<data key="edgeid">6823</data>
<data key="weight">1.0</data>
</edge>
<edge source="32.0" target="28.0">
<data key="edgeid">6824</data>
<data key="weight">1.0</data>
</edge>
<edge source="32.0" target="31.0">
<data key="edgeid">6825</data>
<data key="weight">1.0</data>
</edge>
<edge source="33.0" target="28.0">
<data key="edgeid">6826</data>
<data key="weight">1.0</data>
</edge>
<edge source="34.0" target="2.0">
<data key="edgeid">6827</data>
<data key="weight">1.0</data>
</edge>
<edge source="34.0" target="17.0">
<data key="edgeid">6828</data>
<data key="weight">1.0</data>
</edge>
<edge source="34.0" target="18.0">
<data key="edgeid">6829</data>
<data key="weight">1.0</data>
</edge>
<edge source="34.0" target="28.0">
<data key="edgeid">6830</data>
<data key="weight">1.0</data>
</edge>
<edge source="35.0" target="17.0">
<data key="edgeid">6831</data>
<data key="weight">1.0</data>
</edge>
<edge source="35.0" target="28.0">
<data key="edgeid">6832</data>
<data key="weight">1.0</data>
</edge>
<edge source="36.0" target="2.0">
<data key="edgeid">6833</data>
<data key="weight">1.0</data>
</edge>
<edge source="36.0" target="14.0">
<data key="edgeid">6834</data>
<data key="weight">1.0</data>
</edge>
<edge source="36.0" target="17.0">
<data key="edgeid">6835</data>
<data key="weight">1.0</data>
</edge>
<edge source="36.0" target="24.0">
<data key="edgeid">6836</data>
<data key="weight">1.0</data>
</edge>
<edge source="37.0" target="7.0">
<data key="edgeid">6837</data>
<data key="weight">1.0</data>
</edge>
<edge source="37.0" target="14.0">
<data key="edgeid">6838</data>
<data key="weight">1.0</data>
</edge>
<edge source="37.0" target="17.0">
<data key="edgeid">6839</data>
<data key="weight">1.0</data>
</edge>
<edge source="38.0" target="7.0">
<data key="edgeid">6840</data>
<data key="weight">1.0</data>
</edge>
<edge source="38.0" target="15.0">
<data key="edgeid">6841</data>
<data key="weight">1.0</data>
</edge>
<edge source="38.0" target="17.0">
<data key="edgeid">6842</data>
<data key="weight">1.0</data>
</edge>
<edge source="38.0" target="37.0">
<data key="edgeid">6843</data>
<data key="weight">1.0</data>
</edge>
<edge source="39.0" target="5.0">
<data key="edgeid">6844</data>
<data key="weight">1.0</data>
</edge>
<edge source="39.0" target="9.0">
<data key="edgeid">6845</data>
<data key="weight">1.0</data>
</edge>
<edge source="39.0" target="38.0">
<data key="edgeid">6846</data>
<data key="weight">1.0</data>
</edge>
<edge source="40.0" target="9.0">
<data key="edgeid">6847</data>
<data key="weight">1.0</data>
</edge>
<edge source="40.0" target="11.0">
<data key="edgeid">6848</data>
<data key="weight">1.0</data>
</edge>
<edge source="40.0" target="38.0">
<data key="edgeid">6849</data>
<data key="weight">1.0</data>
</edge>
<edge source="41.0" target="1.0">
<data key="edgeid">6850</data>
<data key="weight">1.0</data>
</edge>
<edge source="41.0" target="2.0">
<data key="edgeid">6851</data>
<data key="weight">1.0</data>
</edge>
<edge source="41.0" target="3.0">
<data key="edgeid">6852</data>
<data key="weight">1.0</data>
</edge>
<edge source="41.0" target="25.0">
<data key="edgeid">6853</data>
<data key="weight">1.0</data>
</edge>
<edge source="41.0" target="31.0">
<data key="edgeid">6854</data>
<data key="weight">1.0</data>
</edge>
<edge source="41.0" target="38.0">
<data key="edgeid">6855</data>
<data key="weight">1.0</data>
</edge>
<edge source="42.0" target="2.0">
<data key="edgeid">6856</data>
<data key="weight">1.0</data>
</edge>
<edge source="42.0" target="9.0">
<data key="edgeid">6857</data>
<data key="weight">1.0</data>
</edge>
<edge source="42.0" target="41.0">
<data key="edgeid">6858</data>
<data key="weight">1.0</data>
</edge>
<edge source="43.0" target="3.0">
<data key="edgeid">6859</data>
<data key="weight">1.0</data>
</edge>
<edge source="43.0" target="5.0">
<data key="edgeid">6860</data>
<data key="weight">1.0</data>
</edge>
<edge source="43.0" target="12.0">
<data key="edgeid">6861</data>
<data key="weight">1.0</data>
</edge>
<edge source="43.0" target="15.0">
<data key="edgeid">6862</data>
<data key="weight">1.0</data>
</edge>
<edge source="43.0" target="17.0">
<data key="edgeid">6863</data>
<data key="weight">1.0</data>
</edge>
<edge source="43.0" target="18.0">
<data key="edgeid">6864</data>
<data key="weight">1.0</data>
</edge>
<edge source="43.0" target="20.0">
<data key="edgeid">6865</data>
<data key="weight">1.0</data>
</edge>
<edge source="43.0" target="21.0">
<data key="edgeid">6866</data>
<data key="weight">1.0</data>
</edge>
<edge source="43.0" target="23.0">
<data key="edgeid">6867</data>
<data key="weight">1.0</data>
</edge>
<edge source="43.0" target="24.0">
<data key="edgeid">6868</data>
<data key="weight">1.0</data>
</edge>
<edge source="43.0" target="26.0">
<data key="edgeid">6869</data>
<data key="weight">1.0</data>
</edge>
<edge source="43.0" target="27.0">
<data key="edgeid">6870</data>
<data key="weight">1.0</data>
</edge>
<edge source="43.0" target="31.0">
<data key="edgeid">6871</data>
<data key="weight">1.0</data>
</edge>
<edge source="43.0" target="36.0">
<data key="edgeid">6872</data>
<data key="weight">1.0</data>
</edge>
<edge source="43.0" target="39.0">
<data key="edgeid">6873</data>
<data key="weight">1.0</data>
</edge>
<edge source="43.0" target="41.0">
<data key="edgeid">6874</data>
<data key="weight">1.0</data>
</edge>
<edge source="44.0" target="17.0">
<data key="edgeid">6875</data>
<data key="weight">1.0</data>
</edge>
<edge source="44.0" target="18.0">
<data key="edgeid">6876</data>
<data key="weight">1.0</data>
</edge>
<edge source="44.0" target="28.0">
<data key="edgeid">6877</data>
<data key="weight">1.0</data>
</edge>
<edge source="44.0" target="43.0">
<data key="edgeid">6878</data>
<data key="weight">1.0</data>
</edge>
<edge source="45.0" target="1.0">
<data key="edgeid">6879</data>
<data key="weight">1.0</data>
</edge>
<edge source="45.0" target="2.0">
<data key="edgeid">6880</data>
<data key="weight">1.0</data>
</edge>
<edge source="45.0" target="22.0">
<data key="edgeid">6881</data>
<data key="weight">1.0</data>
</edge>
<edge source="45.0" target="44.0">
<data key="edgeid">6882</data>
<data key="weight">1.0</data>
</edge>
<edge source="46.0" target="1.0">
<data key="edgeid">6883</data>
<data key="weight">1.0</data>
</edge>
<edge source="46.0" target="25.0">
<data key="edgeid">6884</data>
<data key="weight">1.0</data>
</edge>
<edge source="47.0" target="23.0">
<data key="edgeid">6885</data>
<data key="weight">1.0</data>
</edge>
<edge source="47.0" target="24.0">
<data key="edgeid">6886</data>
<data key="weight">1.0</data>
</edge>
<edge source="47.0" target="37.0">
<data key="edgeid">6887</data>
<data key="weight">1.0</data>
</edge>
<edge source="48.0" target="15.0">
<data key="edgeid">6888</data>
<data key="weight">1.0</data>
</edge>
<edge source="48.0" target="21.0">
<data key="edgeid">6889</data>
<data key="weight">1.0</data>
</edge>
<edge source="48.0" target="25.0">
<data key="edgeid">6890</data>
<data key="weight">1.0</data>
</edge>
<edge source="48.0" target="35.0">
<data key="edgeid">6891</data>
<data key="weight">1.0</data>
</edge>
<edge source="48.0" target="43.0">
<data key="edgeid">6892</data>
<data key="weight">1.0</data>
</edge>
<edge source="48.0" target="47.0">
<data key="edgeid">6893</data>
<data key="weight">1.0</data>
</edge>
<edge source="49.0" target="24.0">
<data key="edgeid">6894</data>
<data key="weight">1.0</data>
</edge>
<edge source="49.0" target="47.0">
<data key="edgeid">6895</data>
<data key="weight">1.0</data>
</edge>
<edge source="50.0" target="2.0">
<data key="edgeid">6896</data>
<data key="weight">1.0</data>
</edge>
<edge source="50.0" target="10.0">
<data key="edgeid">6897</data>
<data key="weight">1.0</data>
</edge>
<edge source="50.0" target="12.0">
<data key="edgeid">6898</data>
<data key="weight">1.0</data>
</edge>
<edge source="50.0" target="17.0">
<data key="edgeid">6899</data>
<data key="weight">1.0</data>
</edge>
<edge source="50.0" target="18.0">
<data key="edgeid">6900</data>
<data key="weight">1.0</data>
</edge>
<edge source="50.0" target="21.0">
<data key="edgeid">6901</data>
<data key="weight">1.0</data>
</edge>
<edge source="50.0" target="44.0">
<data key="edgeid">6902</data>
<data key="weight">1.0</data>
</edge>
<edge source="50.0" target="48.0">
<data key="edgeid">6903</data>
<data key="weight">1.0</data>
</edge>
<edge source="51.0" target="1.0">
<data key="edgeid">6904</data>
<data key="weight">1.0</data>
</edge>
<edge source="51.0" target="2.0">
<data key="edgeid">6905</data>
<data key="weight">1.0</data>
</edge>
<edge source="51.0" target="3.0">
<data key="edgeid">6906</data>
<data key="weight">1.0</data>
</edge>
<edge source="51.0" target="6.0">
<data key="edgeid">6907</data>
<data key="weight">1.0</data>
</edge>
<edge source="51.0" target="7.0">
<data key="edgeid">6908</data>
<data key="weight">1.0</data>
</edge>
<edge source="51.0" target="17.0">
<data key="edgeid">6909</data>
<data key="weight">1.0</data>
</edge>
<edge source="51.0" target="18.0">
<data key="edgeid">6910</data>
<data key="weight">1.0</data>
</edge>
<edge source="51.0" target="21.0">
<data key="edgeid">6911</data>
<data key="weight">1.0</data>
</edge>
<edge source="51.0" target="23.0">
<data key="edgeid">6912</data>
<data key="weight">1.0</data>
</edge>
<edge source="51.0" target="25.0">
<data key="edgeid">6913</data>
<data key="weight">1.0</data>
</edge>
<edge source="51.0" target="26.0">
<data key="edgeid">6914</data>
<data key="weight">1.0</data>
</edge>
<edge source="51.0" target="30.0">
<data key="edgeid">6915</data>
<data key="weight">1.0</data>
</edge>
<edge source="51.0" target="31.0">
<data key="edgeid">6916</data>
<data key="weight">1.0</data>
</edge>
<edge source="51.0" target="32.0">
<data key="edgeid">6917</data>
<data key="weight">1.0</data>
</edge>
<edge source="51.0" target="34.0">
<data key="edgeid">6918</data>
<data key="weight">1.0</data>
</edge>
<edge source="51.0" target="35.0">
<data key="edgeid">6919</data>
<data key="weight">1.0</data>
</edge>
<edge source="51.0" target="38.0">
<data key="edgeid">6920</data>
<data key="weight">1.0</data>
</edge>
<edge source="51.0" target="42.0">
<data key="edgeid">6921</data>
<data key="weight">1.0</data>
</edge>
<edge source="51.0" target="49.0">
<data key="edgeid">6922</data>
<data key="weight">1.0</data>
</edge>
<edge source="51.0" target="50.0">
<data key="edgeid">6923</data>
<data key="weight">1.0</data>
</edge>
<edge source="52.0" target="6.0">
<data key="edgeid">6924</data>
<data key="weight">1.0</data>
</edge>
<edge source="52.0" target="17.0">
<data key="edgeid">6925</data>
<data key="weight">1.0</data>
</edge>
<edge source="52.0" target="27.0">
<data key="edgeid">6926</data>
<data key="weight">1.0</data>
</edge>
<edge source="52.0" target="32.0">
<data key="edgeid">6927</data>
<data key="weight">1.0</data>
</edge>
<edge source="52.0" target="45.0">
<data key="edgeid">6928</data>
<data key="weight">1.0</data>
</edge>
<edge source="52.0" target="50.0">
<data key="edgeid">6929</data>
<data key="weight">1.0</data>
</edge>
<edge source="53.0" target="18.0">
<data key="edgeid">6930</data>
<data key="weight">1.0</data>
</edge>
<edge source="53.0" target="50.0">
<data key="edgeid">6931</data>
<data key="weight">1.0</data>
</edge>
<edge source="54.0" target="2.0">
<data key="edgeid">6932</data>
<data key="weight">1.0</data>
</edge>
<edge source="54.0" target="17.0">
<data key="edgeid">6933</data>
<data key="weight">1.0</data>
</edge>
<edge source="54.0" target="18.0">
<data key="edgeid">6934</data>
<data key="weight">1.0</data>
</edge>
<edge source="54.0" target="27.0">
<data key="edgeid">6935</data>
<data key="weight">1.0</data>
</edge>
<edge source="54.0" target="34.0">
<data key="edgeid">6936</data>
<data key="weight">1.0</data>
</edge>
<edge source="54.0" target="50.0">
<data key="edgeid">6937</data>
<data key="weight">1.0</data>
</edge>
<edge source="54.0" target="51.0">
<data key="edgeid">6938</data>
<data key="weight">1.0</data>
</edge>
<edge source="54.0" target="53.0">
<data key="edgeid">6939</data>
<data key="weight">1.0</data>
</edge>
<edge source="55.0" target="6.0">
<data key="edgeid">6940</data>
<data key="weight">1.0</data>
</edge>
<edge source="55.0" target="36.0">
<data key="edgeid">6941</data>
<data key="weight">1.0</data>
</edge>
<edge source="56.0" target="26.0">
<data key="edgeid">6942</data>
<data key="weight">1.0</data>
</edge>
<edge source="56.0" target="40.0">
<data key="edgeid">6943</data>
<data key="weight">1.0</data>
</edge>
<edge source="56.0" target="42.0">
<data key="edgeid">6944</data>
<data key="weight">1.0</data>
</edge>
<edge source="56.0" target="52.0">
<data key="edgeid">6945</data>
<data key="weight">1.0</data>
</edge>
<edge source="57.0" target="37.0">
<data key="edgeid">6946</data>
<data key="weight">1.0</data>
</edge>
<edge source="57.0" target="51.0">
<data key="edgeid">6947</data>
<data key="weight">1.0</data>
</edge>
<edge source="58.0" target="29.0">
<data key="edgeid">6948</data>
<data key="weight">1.0</data>
</edge>
<edge source="58.0" target="37.0">
<data key="edgeid">6949</data>
<data key="weight">1.0</data>
</edge>
<edge source="59.0" target="9.0">
<data key="edgeid">6950</data>
<data key="weight">1.0</data>
</edge>
<edge source="59.0" target="14.0">
<data key="edgeid">6951</data>
<data key="weight">1.0</data>
</edge>
<edge source="59.0" target="23.0">
<data key="edgeid">6952</data>
<data key="weight">1.0</data>
</edge>
<edge source="59.0" target="25.0">
<data key="edgeid">6953</data>
<data key="weight">1.0</data>
</edge>
<edge source="59.0" target="37.0">
<data key="edgeid">6954</data>
<data key="weight">1.0</data>
</edge>
<edge source="59.0" target="43.0">
<data key="edgeid">6955</data>
<data key="weight">1.0</data>
</edge>
<edge source="59.0" target="49.0">
<data key="edgeid">6956</data>
<data key="weight">1.0</data>
</edge>
<edge source="59.0" target="51.0">
<data key="edgeid">6957</data>
<data key="weight">1.0</data>
</edge>
<edge source="60.0" target="9.0">
<data key="edgeid">6958</data>
<data key="weight">1.0</data>
</edge>
<edge source="60.0" target="18.0">
<data key="edgeid">6959</data>
<data key="weight">1.0</data>
</edge>
<edge source="61.0" target="9.0">
<data key="edgeid">6960</data>
<data key="weight">1.0</data>
</edge>
<edge source="62.0" target="9.0">
<data key="edgeid">6961</data>
<data key="weight">1.0</data>
</edge>
<edge source="63.0" target="11.0">
<data key="edgeid">6962</data>
<data key="weight">1.0</data>
</edge>
<edge source="63.0" target="27.0">
<data key="edgeid">6963</data>
<data key="weight">1.0</data>
</edge>
<edge source="63.0" target="43.0">
<data key="edgeid">6964</data>
<data key="weight">1.0</data>
</edge>
<edge source="64.0" target="63.0">
<data key="edgeid">6965</data>
<data key="weight">1.0</data>
</edge>
<edge source="65.0" target="17.0">
<data key="edgeid">6966</data>
<data key="weight">1.0</data>
</edge>
<edge source="65.0" target="59.0">
<data key="edgeid">6967</data>
<data key="weight">1.0</data>
</edge>
<edge source="65.0" target="63.0">
<data key="edgeid">6968</data>
<data key="weight">1.0</data>
</edge>
<edge source="66.0" target="2.0">
<data key="edgeid">6969</data>
<data key="weight">1.0</data>
</edge>
<edge source="66.0" target="17.0">
<data key="edgeid">6970</data>
<data key="weight">1.0</data>
</edge>
<edge source="66.0" target="43.0">
<data key="edgeid">6971</data>
<data key="weight">1.0</data>
</edge>
<edge source="66.0" target="51.0">
<data key="edgeid">6972</data>
<data key="weight">1.0</data>
</edge>
<edge source="67.0" target="17.0">
<data key="edgeid">6973</data>
<data key="weight">1.0</data>
</edge>
<edge source="67.0" target="51.0">
<data key="edgeid">6974</data>
<data key="weight">1.0</data>
</edge>
<edge source="68.0" target="14.0">
<data key="edgeid">6975</data>
<data key="weight">1.0</data>
</edge>
<edge source="68.0" target="16.0">
<data key="edgeid">6976</data>
<data key="weight">1.0</data>
</edge>
<edge source="68.0" target="24.0">
<data key="edgeid">6977</data>
<data key="weight">1.0</data>
</edge>
<edge source="68.0" target="26.0">
<data key="edgeid">6978</data>
<data key="weight">1.0</data>
</edge>
<edge source="68.0" target="27.0">
<data key="edgeid">6979</data>
<data key="weight">1.0</data>
</edge>
<edge source="68.0" target="49.0">
<data key="edgeid">6980</data>
<data key="weight">1.0</data>
</edge>
<edge source="68.0" target="51.0">
<data key="edgeid">6981</data>
<data key="weight">1.0</data>
</edge>
<edge source="68.0" target="54.0">
<data key="edgeid">6982</data>
<data key="weight">1.0</data>
</edge>
<edge source="69.0" target="11.0">
<data key="edgeid">6983</data>
<data key="weight">1.0</data>
</edge>
<edge source="69.0" target="23.0">
<data key="edgeid">6984</data>
<data key="weight">1.0</data>
</edge>
<edge source="70.0" target="7.0">
<data key="edgeid">6985</data>
<data key="weight">1.0</data>
</edge>
<edge source="70.0" target="17.0">
<data key="edgeid">6986</data>
<data key="weight">1.0</data>
</edge>
<edge source="70.0" target="32.0">
<data key="edgeid">6987</data>
<data key="weight">1.0</data>
</edge>
<edge source="70.0" target="43.0">
<data key="edgeid">6988</data>
<data key="weight">1.0</data>
</edge>
<edge source="70.0" target="54.0">
<data key="edgeid">6989</data>
<data key="weight">1.0</data>
</edge>
<edge source="70.0" target="55.0">
<data key="edgeid">6990</data>
<data key="weight">1.0</data>
</edge>
<edge source="70.0" target="59.0">
<data key="edgeid">6991</data>
<data key="weight">1.0</data>
</edge>
<edge source="70.0" target="68.0">
<data key="edgeid">6992</data>
<data key="weight">1.0</data>
</edge>
<edge source="71.0" target="14.0">
<data key="edgeid">6993</data>
<data key="weight">1.0</data>
</edge>
<edge source="71.0" target="35.0">
<data key="edgeid">6994</data>
<data key="weight">1.0</data>
</edge>
<edge source="71.0" target="59.0">
<data key="edgeid">6995</data>
<data key="weight">1.0</data>
</edge>
<edge source="71.0" target="60.0">
<data key="edgeid">6996</data>
<data key="weight">1.0</data>
</edge>
<edge source="71.0" target="62.0">
<data key="edgeid">6997</data>
<data key="weight">1.0</data>
</edge>
<edge source="72.0" target="17.0">
<data key="edgeid">6998</data>
<data key="weight">1.0</data>
</edge>
<edge source="72.0" target="37.0">
<data key="edgeid">6999</data>
<data key="weight">1.0</data>
</edge>
<edge source="72.0" target="54.0">
<data key="edgeid">7000</data>
<data key="weight">1.0</data>
</edge>
<edge source="72.0" target="59.0">
<data key="edgeid">7001</data>
<data key="weight">1.0</data>
</edge>
<edge source="72.0" target="66.0">
<data key="edgeid">7002</data>
<data key="weight">1.0</data>
</edge>
<edge source="73.0" target="2.0">
<data key="edgeid">7003</data>
<data key="weight">1.0</data>
</edge>
<edge source="73.0" target="45.0">
<data key="edgeid">7004</data>
<data key="weight">1.0</data>
</edge>
<edge source="73.0" target="53.0">
<data key="edgeid">7005</data>
<data key="weight">1.0</data>
</edge>
<edge source="73.0" target="68.0">
<data key="edgeid">7006</data>
<data key="weight">1.0</data>
</edge>
<edge source="73.0" target="71.0">
<data key="edgeid">7007</data>
<data key="weight">1.0</data>
</edge>
<edge source="74.0" target="29.0">
<data key="edgeid">7008</data>
<data key="weight">1.0</data>
</edge>
<edge source="75.0" target="7.0">
<data key="edgeid">7009</data>
<data key="weight">1.0</data>
</edge>
<edge source="75.0" target="15.0">
<data key="edgeid">7010</data>
<data key="weight">1.0</data>
</edge>
<edge source="75.0" target="24.0">
<data key="edgeid">7011</data>
<data key="weight">1.0</data>
</edge>
<edge source="75.0" target="54.0">
<data key="edgeid">7012</data>
<data key="weight">1.0</data>
</edge>
<edge source="75.0" target="57.0">
<data key="edgeid">7013</data>
<data key="weight">1.0</data>
</edge>
<edge source="75.0" target="66.0">
<data key="edgeid">7014</data>
<data key="weight">1.0</data>
</edge>
<edge source="75.0" target="68.0">
<data key="edgeid">7015</data>
<data key="weight">1.0</data>
</edge>
<edge source="75.0" target="70.0">
<data key="edgeid">7016</data>
<data key="weight">1.0</data>
</edge>
<edge source="76.0" target="15.0">
<data key="edgeid">7017</data>
<data key="weight">1.0</data>
</edge>
<edge source="76.0" target="24.0">
<data key="edgeid">7018</data>
<data key="weight">1.0</data>
</edge>
<edge source="76.0" target="27.0">
<data key="edgeid">7019</data>
<data key="weight">1.0</data>
</edge>
<edge source="76.0" target="33.0">
<data key="edgeid">7020</data>
<data key="weight">1.0</data>
</edge>
<edge source="76.0" target="48.0">
<data key="edgeid">7021</data>
<data key="weight">1.0</data>
</edge>
<edge source="76.0" target="60.0">
<data key="edgeid">7022</data>
<data key="weight">1.0</data>
</edge>
<edge source="76.0" target="67.0">
<data key="edgeid">7023</data>
<data key="weight">1.0</data>
</edge>
<edge source="76.0" target="73.0">
<data key="edgeid">7024</data>
<data key="weight">1.0</data>
</edge>
<edge source="76.0" target="75.0">
<data key="edgeid">7025</data>
<data key="weight">1.0</data>
</edge>
<edge source="77.0" target="17.0">
<data key="edgeid">7026</data>
<data key="weight">1.0</data>
</edge>
<edge source="77.0" target="25.0">
<data key="edgeid">7027</data>
<data key="weight">1.0</data>
</edge>
<edge source="77.0" target="75.0">
<data key="edgeid">7028</data>
<data key="weight">1.0</data>
</edge>
<edge source="78.0" target="50.0">
<data key="edgeid">7029</data>
<data key="weight">1.0</data>
</edge>
<edge source="78.0" target="54.0">
<data key="edgeid">7030</data>
<data key="weight">1.0</data>
</edge>
<edge source="79.0" target="15.0">
<data key="edgeid">7031</data>
<data key="weight">1.0</data>
</edge>
<edge source="79.0" target="20.0">
<data key="edgeid">7032</data>
<data key="weight">1.0</data>
</edge>
<edge source="79.0" target="26.0">
<data key="edgeid">7033</data>
<data key="weight">1.0</data>
</edge>
<edge source="79.0" target="27.0">
<data key="edgeid">7034</data>
<data key="weight">1.0</data>
</edge>
<edge source="79.0" target="29.0">
<data key="edgeid">7035</data>
<data key="weight">1.0</data>
</edge>
<edge source="79.0" target="30.0">
<data key="edgeid">7036</data>
<data key="weight">1.0</data>
</edge>
<edge source="79.0" target="31.0">
<data key="edgeid">7037</data>
<data key="weight">1.0</data>
</edge>
<edge source="79.0" target="42.0">
<data key="edgeid">7038</data>
<data key="weight">1.0</data>
</edge>
<edge source="79.0" target="78.0">
<data key="edgeid">7039</data>
<data key="weight">1.0</data>
</edge>
<edge source="80.0" target="17.0">
<data key="edgeid">7040</data>
<data key="weight">1.0</data>
</edge>
<edge source="80.0" target="26.0">
<data key="edgeid">7041</data>
<data key="weight">1.0</data>
</edge>
<edge source="80.0" target="27.0">
<data key="edgeid">7042</data>
<data key="weight">1.0</data>
</edge>
<edge source="80.0" target="43.0">
<data key="edgeid">7043</data>
<data key="weight">1.0</data>
</edge>
<edge source="80.0" target="72.0">
<data key="edgeid">7044</data>
<data key="weight">1.0</data>
</edge>
<edge source="80.0" target="76.0">
<data key="edgeid">7045</data>
<data key="weight">1.0</data>
</edge>
<edge source="81.0" target="43.0">
<data key="edgeid">7046</data>
<data key="weight">1.0</data>
</edge>
<edge source="81.0" target="79.0">
<data key="edgeid">7047</data>
<data key="weight">1.0</data>
</edge>
<edge source="81.0" target="80.0">
<data key="edgeid">7048</data>
<data key="weight">1.0</data>
</edge>
<edge source="82.0" target="17.0">
<data key="edgeid">7049</data>
<data key="weight">1.0</data>
</edge>
<edge source="83.0" target="2.0">
<data key="edgeid">7050</data>
<data key="weight">1.0</data>
</edge>
<edge source="83.0" target="17.0">
<data key="edgeid">7051</data>
<data key="weight">1.0</data>
</edge>
<edge source="83.0" target="43.0">
<data key="edgeid">7052</data>
<data key="weight">1.0</data>
</edge>
<edge source="83.0" target="79.0">
<data key="edgeid">7053</data>
<data key="weight">1.0</data>
</edge>
<edge source="84.0" target="17.0">
<data key="edgeid">7054</data>
<data key="weight">1.0</data>
</edge>
<edge source="84.0" target="30.0">
<data key="edgeid">7055</data>
<data key="weight">1.0</data>
</edge>
<edge source="84.0" target="33.0">
<data key="edgeid">7056</data>
<data key="weight">1.0</data>
</edge>
<edge source="84.0" target="65.0">
<data key="edgeid">7057</data>
<data key="weight">1.0</data>
</edge>
<edge source="84.0" target="68.0">
<data key="edgeid">7058</data>
<data key="weight">1.0</data>
</edge>
<edge source="85.0" target="3.0">
<data key="edgeid">7059</data>
<data key="weight">1.0</data>
</edge>
<edge source="85.0" target="17.0">
<data key="edgeid">7060</data>
<data key="weight">1.0</data>
</edge>
<edge source="86.0" target="17.0">
<data key="edgeid">7061</data>
<data key="weight">1.0</data>
</edge>
<edge source="86.0" target="31.0">
<data key="edgeid">7062</data>
<data key="weight">1.0</data>
</edge>
<edge source="87.0" target="7.0">
<data key="edgeid">7063</data>
<data key="weight">1.0</data>
</edge>
<edge source="87.0" target="12.0">
<data key="edgeid">7064</data>
<data key="weight">1.0</data>
</edge>
<edge source="87.0" target="17.0">
<data key="edgeid">7065</data>
<data key="weight">1.0</data>
</edge>
<edge source="87.0" target="24.0">
<data key="edgeid">7066</data>
<data key="weight">1.0</data>
</edge>
<edge source="87.0" target="27.0">
<data key="edgeid">7067</data>
<data key="weight">1.0</data>
</edge>
<edge source="87.0" target="36.0">
<data key="edgeid">7068</data>
<data key="weight">1.0</data>
</edge>
<edge source="87.0" target="65.0">
<data key="edgeid">7069</data>
<data key="weight">1.0</data>
</edge>
<edge source="87.0" target="67.0">
<data key="edgeid">7070</data>
<data key="weight">1.0</data>
</edge>
<edge source="87.0" target="70.0">
<data key="edgeid">7071</data>
<data key="weight">1.0</data>
</edge>
<edge source="87.0" target="83.0">
<data key="edgeid">7072</data>
<data key="weight">1.0</data>
</edge>
<edge source="88.0" target="12.0">
<data key="edgeid">7073</data>
<data key="weight">1.0</data>
</edge>
<edge source="88.0" target="15.0">
<data key="edgeid">7074</data>
<data key="weight">1.0</data>
</edge>
<edge source="88.0" target="17.0">
<data key="edgeid">7075</data>
<data key="weight">1.0</data>
</edge>
<edge source="88.0" target="25.0">
<data key="edgeid">7076</data>
<data key="weight">1.0</data>
</edge>
<edge source="88.0" target="48.0">
<data key="edgeid">7077</data>
<data key="weight">1.0</data>
</edge>
<edge source="89.0" target="4.0">
<data key="edgeid">7078</data>
<data key="weight">1.0</data>
</edge>
<edge source="89.0" target="9.0">
<data key="edgeid">7079</data>
<data key="weight">1.0</data>
</edge>
<edge source="89.0" target="17.0">
<data key="edgeid">7080</data>
<data key="weight">1.0</data>
</edge>
<edge source="89.0" target="28.0">
<data key="edgeid">7081</data>
<data key="weight">1.0</data>
</edge>
<edge source="89.0" target="53.0">
<data key="edgeid">7082</data>
<data key="weight">1.0</data>
</edge>
<edge source="90.0" target="42.0">
<data key="edgeid">7083</data>
<data key="weight">1.0</data>
</edge>
<edge source="91.0" target="1.0">
<data key="edgeid">7084</data>
<data key="weight">1.0</data>
</edge>
<edge source="92.0" target="28.0">
<data key="edgeid">7085</data>
<data key="weight">1.0</data>
</edge>
<edge source="92.0" target="30.0">
<data key="edgeid">7086</data>
<data key="weight">1.0</data>
</edge>
<edge source="92.0" target="76.0">
<data key="edgeid">7087</data>
<data key="weight">1.0</data>
</edge>
<edge source="92.0" target="89.0">
<data key="edgeid">7088</data>
<data key="weight">1.0</data>
</edge>
<edge source="93.0" target="2.0">
<data key="edgeid">7089</data>
<data key="weight">1.0</data>
</edge>
<edge source="93.0" target="17.0">
<data key="edgeid">7090</data>
<data key="weight">1.0</data>
</edge>
<edge source="94.0" target="20.0">
<data key="edgeid">7091</data>
<data key="weight">1.0</data>
</edge>
<edge source="94.0" target="22.0">
<data key="edgeid">7092</data>
<data key="weight">1.0</data>
</edge>
<edge source="94.0" target="81.0">
<data key="edgeid">7093</data>
<data key="weight">1.0</data>
</edge>
<edge source="95.0" target="92.0">
<data key="edgeid">7094</data>
<data key="weight">1.0</data>
</edge>
<edge source="96.0" target="27.0">
<data key="edgeid">7095</data>
<data key="weight">1.0</data>
</edge>
<edge source="96.0" target="92.0">
<data key="edgeid">7096</data>
<data key="weight">1.0</data>
</edge>
<edge source="97.0" target="2.0">
<data key="edgeid">7097</data>
<data key="weight">1.0</data>
</edge>
<edge source="98.0" target="2.0">
<data key="edgeid">7098</data>
<data key="weight">1.0</data>
</edge>
<edge source="98.0" target="11.0">
<data key="edgeid">7099</data>
<data key="weight">1.0</data>
</edge>
<edge source="98.0" target="17.0">
<data key="edgeid">7100</data>
<data key="weight">1.0</data>
</edge>
<edge source="98.0" target="43.0">
<data key="edgeid">7101</data>
<data key="weight">1.0</data>
</edge>
<edge source="98.0" target="81.0">
<data key="edgeid">7102</data>
<data key="weight">1.0</data>
</edge>
<edge source="99.0" target="43.0">
<data key="edgeid">7103</data>
<data key="weight">1.0</data>
</edge>
<edge source="99.0" target="89.0">
<data key="edgeid">7104</data>
<data key="weight">1.0</data>
</edge>
<edge source="100.0" target="32.0">
<data key="edgeid">7105</data>
<data key="weight">1.0</data>
</edge>
<edge source="100.0" target="43.0">
<data key="edgeid">7106</data>
<data key="weight">1.0</data>
</edge>
<edge source="101.0" target="51.0">
<data key="edgeid">7107</data>
<data key="weight">1.0</data>
</edge>
<edge source="101.0" target="60.0">
<data key="edgeid">7108</data>
<data key="weight">1.0</data>
</edge>
<edge source="102.0" target="1.0">
<data key="edgeid">7109</data>
<data key="weight">1.0</data>
</edge>
<edge source="102.0" target="2.0">
<data key="edgeid">7110</data>
<data key="weight">1.0</data>
</edge>
<edge source="102.0" target="12.0">
<data key="edgeid">7111</data>
<data key="weight">1.0</data>
</edge>
<edge source="102.0" target="13.0">
<data key="edgeid">7112</data>
<data key="weight">1.0</data>
</edge>
<edge source="102.0" target="17.0">
<data key="edgeid">7113</data>
<data key="weight">1.0</data>
</edge>
<edge source="102.0" target="44.0">
<data key="edgeid">7114</data>
<data key="weight">1.0</data>
</edge>
<edge source="102.0" target="50.0">
<data key="edgeid">7115</data>
<data key="weight">1.0</data>
</edge>
<edge source="102.0" target="53.0">
<data key="edgeid">7116</data>
<data key="weight">1.0</data>
</edge>
<edge source="102.0" target="66.0">
<data key="edgeid">7117</data>
<data key="weight">1.0</data>
</edge>
<edge source="102.0" target="70.0">
<data key="edgeid">7118</data>
<data key="weight">1.0</data>
</edge>
<edge source="103.0" target="17.0">
<data key="edgeid">7119</data>
<data key="weight">1.0</data>
</edge>
<edge source="103.0" target="24.0">
<data key="edgeid">7120</data>
<data key="weight">1.0</data>
</edge>
<edge source="103.0" target="27.0">
<data key="edgeid">7121</data>
<data key="weight">1.0</data>
</edge>
<edge source="103.0" target="31.0">
<data key="edgeid">7122</data>
<data key="weight">1.0</data>
</edge>
<edge source="103.0" target="37.0">
<data key="edgeid">7123</data>
<data key="weight">1.0</data>
</edge>
<edge source="103.0" target="39.0">
<data key="edgeid">7124</data>
<data key="weight">1.0</data>
</edge>
<edge source="103.0" target="65.0">
<data key="edgeid">7125</data>
<data key="weight">1.0</data>
</edge>
<edge source="103.0" target="73.0">
<data key="edgeid">7126</data>
<data key="weight">1.0</data>
</edge>
<edge source="104.0" target="2.0">
<data key="edgeid">7127</data>
<data key="weight">1.0</data>
</edge>
<edge source="104.0" target="11.0">
<data key="edgeid">7128</data>
<data key="weight">1.0</data>
</edge>
<edge source="104.0" target="12.0">
<data key="edgeid">7129</data>
<data key="weight">1.0</data>
</edge>
<edge source="104.0" target="15.0">
<data key="edgeid">7130</data>
<data key="weight">1.0</data>
</edge>
<edge source="104.0" target="17.0">
<data key="edgeid">7131</data>
<data key="weight">1.0</data>
</edge>
<edge source="104.0" target="24.0">
<data key="edgeid">7132</data>
<data key="weight">1.0</data>
</edge>
<edge source="104.0" target="25.0">
<data key="edgeid">7133</data>
<data key="weight">1.0</data>
</edge>
<edge source="104.0" target="26.0">
<data key="edgeid">7134</data>
<data key="weight">1.0</data>
</edge>
<edge source="104.0" target="31.0">
<data key="edgeid">7135</data>
<data key="weight">1.0</data>
</edge>
<edge source="104.0" target="33.0">
<data key="edgeid">7136</data>
<data key="weight">1.0</data>
</edge>
<edge source="104.0" target="35.0">
<data key="edgeid">7137</data>
<data key="weight">1.0</data>
</edge>
<edge source="104.0" target="38.0">
<data key="edgeid">7138</data>
<data key="weight">1.0</data>
</edge>
<edge source="104.0" target="46.0">
<data key="edgeid">7139</data>
<data key="weight">1.0</data>
</edge>
<edge source="104.0" target="48.0">
<data key="edgeid">7140</data>
<data key="weight">1.0</data>
</edge>
<edge source="104.0" target="50.0">
<data key="edgeid">7141</data>
<data key="weight">1.0</data>
</edge>
<edge source="104.0" target="59.0">
<data key="edgeid">7142</data>
<data key="weight">1.0</data>
</edge>
<edge source="104.0" target="61.0">
<data key="edgeid">7143</data>
<data key="weight">1.0</data>
</edge>
<edge source="104.0" target="81.0">
<data key="edgeid">7144</data>
<data key="weight">1.0</data>
</edge>
<edge source="104.0" target="84.0">
<data key="edgeid">7145</data>
<data key="weight">1.0</data>
</edge>
<edge source="104.0" target="103.0">
<data key="edgeid">7146</data>
<data key="weight">1.0</data>
</edge>
<edge source="105.0" target="2.0">
<data key="edgeid">7147</data>
<data key="weight">1.0</data>
</edge>
<edge source="105.0" target="14.0">
<data key="edgeid">7148</data>
<data key="weight">1.0</data>
</edge>
<edge source="105.0" target="23.0">
<data key="edgeid">7149</data>
<data key="weight">1.0</data>
</edge>
<edge source="105.0" target="70.0">
<data key="edgeid">7150</data>
<data key="weight">1.0</data>
</edge>
<edge source="105.0" target="72.0">
<data key="edgeid">7151</data>
<data key="weight">1.0</data>
</edge>
<edge source="105.0" target="104.0">
<data key="edgeid">7152</data>
<data key="weight">1.0</data>
</edge>
<edge source="106.0" target="7.0">
<data key="edgeid">7153</data>
<data key="weight">1.0</data>
</edge>
<edge source="106.0" target="51.0">
<data key="edgeid">7154</data>
<data key="weight">1.0</data>
</edge>
<edge source="106.0" target="76.0">
<data key="edgeid">7155</data>
<data key="weight">1.0</data>
</edge>
<edge source="106.0" target="80.0">
<data key="edgeid">7156</data>
<data key="weight">1.0</data>
</edge>
<edge source="106.0" target="88.0">
<data key="edgeid">7157</data>
<data key="weight">1.0</data>
</edge>
<edge source="106.0" target="96.0">
<data key="edgeid">7158</data>
<data key="weight">1.0</data>
</edge>
<edge source="107.0" target="33.0">
<data key="edgeid">7159</data>
<data key="weight">1.0</data>
</edge>
<edge source="107.0" target="34.0">
<data key="edgeid">7160</data>
<data key="weight">1.0</data>
</edge>
<edge source="108.0" target="20.0">
<data key="edgeid">7161</data>
<data key="weight">1.0</data>
</edge>
<edge source="108.0" target="24.0">
<data key="edgeid">7162</data>
<data key="weight">1.0</data>
</edge>
<edge source="108.0" target="31.0">
<data key="edgeid">7163</data>
<data key="weight">1.0</data>
</edge>
<edge source="108.0" target="105.0">
<data key="edgeid">7164</data>
<data key="weight">1.0</data>
</edge>
<edge source="109.0" target="79.0">
<data key="edgeid">7165</data>
<data key="weight">1.0</data>
</edge>
<edge source="110.0" target="79.0">
<data key="edgeid">7166</data>
<data key="weight">1.0</data>
</edge>
<edge source="110.0" target="100.0">
<data key="edgeid">7167</data>
<data key="weight">1.0</data>
</edge>
<edge source="111.0" target="2.0">
<data key="edgeid">7168</data>
<data key="weight">1.0</data>
</edge>
</graph>
</graphml>
