<?xml version="1.0" encoding="UTF-8"?>
<graphml xmlns="http://graphml.graphdrawing.org/xmlns">
<key attr.name="label" attr.type="string" for="node" id="label"/>
<key attr.name="Edge Label" attr.type="string" for="edge" id="edgelabel"/>
<key attr.name="weight" attr.type="double" for="edge" id="weight"/>
<key attr.name="Edge Id" attr.type="string" for="edge" id="edgeid"/>
<key attr.name="r" attr.type="int" for="node" id="r"/>
<key attr.name="g" attr.type="int" for="node" id="g"/>
<key attr.name="b" attr.type="int" for="node" id="b"/>
<key attr.name="x" attr.type="float" for="node" id="x"/>
<key attr.name="y" attr.type="float" for="node" id="y"/>
<key attr.name="size" attr.type="float" for="node" id="size"/>
<key attr.name="value" attr.type="string" for="node" id="value"/>
<graph edgedefault="undirected">
<node id="0.0">
<data key="label">1000 Years for Revenge</data>
<data key="value">n</data>
<data key="size">4.0</data>
<data key="r">0</data>
<data key="g">0</data>
<data key="b">0</data>
<data key="x">315.4366</data>
<data key="y">-174.30571</data>
</node>
<node id="1.0">
<data key="label">Bush vs. the Beltway</data>
<data key="value">c</data>
<data key="size">4.0</data>
<data key="r">0</data>
<data key="g">0</data>
<data key="b">0</data>
<data key="x">315.9143</data>
<data key="y">-252.35728</data>
</node>
<node id="2.0">
<data key="label">Charlie Wilson's War</data>
<data key="value">c</data>
<data key="size">4.0</data>
<data key="r">0</data>
<data key="g">0</data>
<data key="b">0</data>
<data key="x">374.0474</data>
<data key="y">-61.675774</data>
</node>
<node id="3.0">
<data key="label">Losing Bin Laden</data>
<data key="value">c</data>
<data key="size">4.0</data>
<data key="r">0</data>
<data key="g">0</data>
<data key="b">0</data>
<data key="x">91.041466</data>
<data key="y">-245.84825</data>
</node>
<node id="4.0">
<data key="label">Sleeping With the Devil</data>
<data key="value">n</data>
<data key="size">4.0</data>
<data key="r">0</data>
<data key="g">0</data>
<data key="b">0</data>
<data key="x">216.40309</data>
<data key="y">-4.844139</data>
</node>
<node id="5.0">
<data key="label">The Man Who Warned America</data>
<data key="value">c</data>
<data key="size">4.0</data>
<data key="r">0</data>
<data key="g">0</data>
<data key="b">0</data>
<data key="x">289.6507</data>
<data key="y">-131.08868</data>
</node>
<node id="6.0">
<data key="label">Why America Slept</data>
<data key="value">n</data>
<data key="size">4.0</data>
<data key="r">0</data>
<data key="g">0</data>
<data key="b">0</data>
<data key="x">188.1684</data>
<data key="y">-196.93755</data>
</node>
<node id="7.0">
<data key="label">Ghost Wars</data>
<data key="value">n</data>
<data key="size">4.0</data>
<data key="r">0</data>
<data key="g">0</data>
<data key="b">0</data>
<data key="x">197.97214</data>
<data key="y">31.62894</data>
</node>
<node id="8.0">
<data key="label">A National Party No More</data>
<data key="value">c</data>
<data key="size">4.0</data>
<data key="r">0</data>
<data key="g">0</data>
<data key="b">0</data>
<data key="x">-63.99169</data>
<data key="y">-306.66656</data>
</node>
<node id="9.0">
<data key="label">Bush Country</data>
<data key="value">c</data>
<data key="size">4.0</data>
<data key="r">0</data>
<data key="g">0</data>
<data key="b">0</data>
<data key="x">96.02154</data>
<data key="y">-176.15869</data>
</node>
<node id="10.0">
<data key="label">Dereliction of Duty</data>
<data key="value">c</data>
<data key="size">4.0</data>
<data key="r">0</data>
<data key="g">0</data>
<data key="b">0</data>
<data key="x">-99.93633</data>
<data key="y">-287.91898</data>
</node>
<node id="11.0">
<data key="label">Legacy</data>
<data key="value">c</data>
<data key="size">4.0</data>
<data key="r">0</data>
<data key="g">0</data>
<data key="b">0</data>
<data key="x">58.605083</data>
<data key="y">-239.81393</data>
</node>
<node id="12.0">
<data key="label">Off with Their Heads</data>
<data key="value">c</data>
<data key="size">4.0</data>
<data key="r">0</data>
<data key="g">0</data>
<data key="b">0</data>
<data key="x">-32.061363</data>
<data key="y">-308.04465</data>
</node>
<node id="13.0">
<data key="label">Persecution</data>
<data key="value">c</data>
<data key="size">4.0</data>
<data key="r">0</data>
<data key="g">0</data>
<data key="b">0</data>
<data key="x">-48.80098</data>
<data key="y">-240.31995</data>
</node>
<node id="14.0">
<data key="label">Rumsfeld's War</data>
<data key="value">c</data>
<data key="size">4.0</data>
<data key="r">0</data>
<data key="g">0</data>
<data key="b">0</data>
<data key="x">117.90504</data>
<data key="y">-137.69408</data>
</node>
<node id="15.0">
<data key="label">Breakdown</data>
<data key="value">c</data>
<data key="size">4.0</data>
<data key="r">0</data>
<data key="g">0</data>
<data key="b">0</data>
<data key="x">-139.91714</data>
<data key="y">-212.20856</data>
</node>
<node id="16.0">
<data key="label">Betrayal</data>
<data key="value">c</data>
<data key="size">4.0</data>
<data key="r">0</data>
<data key="g">0</data>
<data key="b">0</data>
<data key="x">-132.09352</data>
<data key="y">-157.40471</data>
</node>
<node id="17.0">
<data key="label">Shut Up and Sing</data>
<data key="value">c</data>
<data key="size">4.0</data>
<data key="r">0</data>
<data key="g">0</data>
<data key="b">0</data>
<data key="x">109.66099</data>
<data key="y">-359.93433</data>
</node>
<node id="18.0">
<data key="label">Meant To Be</data>
<data key="value">n</data>
<data key="size">4.0</data>
<data key="r">0</data>
<data key="g">0</data>
<data key="b">0</data>
<data key="x">199.78633</data>
<data key="y">-357.09592</data>
</node>
<node id="19.0">
<data key="label">The Right Man</data>
<data key="value">c</data>
<data key="size">4.0</data>
<data key="r">0</data>
<data key="g">0</data>
<data key="b">0</data>
<data key="x">-104.69604</data>
<data key="y">-99.70516</data>
</node>
<node id="20.0">
<data key="label">Ten Minutes from Normal</data>
<data key="value">c</data>
<data key="size">4.0</data>
<data key="r">0</data>
<data key="g">0</data>
<data key="b">0</data>
<data key="x">15.232464</data>
<data key="y">-125.960365</data>
</node>
<node id="21.0">
<data key="label">Hillary's Scheme</data>
<data key="value">c</data>
<data key="size">4.0</data>
<data key="r">0</data>
<data key="g">0</data>
<data key="b">0</data>
<data key="x">64.39443</data>
<data key="y">-390.3586</data>
</node>
<node id="22.0">
<data key="label">The French Betrayal of America</data>
<data key="value">c</data>
<data key="size">4.0</data>
<data key="r">0</data>
<data key="g">0</data>
<data key="b">0</data>
<data key="x">169.8971</data>
<data key="y">-245.28108</data>
</node>
<node id="23.0">
<data key="label">Tales from the Left Coast</data>
<data key="value">c</data>
<data key="size">4.0</data>
<data key="r">0</data>
<data key="g">0</data>
<data key="b">0</data>
<data key="x">5.2317166</data>
<data key="y">-427.94946</data>
</node>
<node id="24.0">
<data key="label">Hating America</data>
<data key="value">c</data>
<data key="size">4.0</data>
<data key="r">0</data>
<data key="g">0</data>
<data key="b">0</data>
<data key="x">-34.635513</data>
<data key="y">-180.08885</data>
</node>
<node id="25.0">
<data key="label">The Third Terrorist</data>
<data key="value">c</data>
<data key="size">4.0</data>
<data key="r">0</data>
<data key="g">0</data>
<data key="b">0</data>
<data key="x">216.89368</data>
<data key="y">-282.36478</data>
</node>
<node id="26.0">
<data key="label">Endgame</data>
<data key="value">c</data>
<data key="size">4.0</data>
<data key="r">0</data>
<data key="g">0</data>
<data key="b">0</data>
<data key="x">38.9994</data>
<data key="y">-195.64738</data>
</node>
<node id="27.0">
<data key="label">Spin Sisters</data>
<data key="value">c</data>
<data key="size">4.0</data>
<data key="r">0</data>
<data key="g">0</data>
<data key="b">0</data>
<data key="x">55.67097</data>
<data key="y">-351.33984</data>
</node>
<node id="28.0">
<data key="label">All the Shah's Men</data>
<data key="value">n</data>
<data key="size">4.0</data>
<data key="r">0</data>
<data key="g">0</data>
<data key="b">0</data>
<data key="x">166.15652</data>
<data key="y">175.62164</data>
</node>
<node id="29.0">
<data key="label">Dangerous Dimplomacy</data>
<data key="value">c</data>
<data key="size">4.0</data>
<data key="r">0</data>
<data key="g">0</data>
<data key="b">0</data>
<data key="x">167.4315</data>
<data key="y">-143.1152</data>
</node>
<node id="30.0">
<data key="label">The Price of Loyalty</data>
<data key="value">l</data>
<data key="size">4.0</data>
<data key="r">0</data>
<data key="g">0</data>
<data key="b">0</data>
<data key="x">46.808067</data>
<data key="y">201.77951</data>
</node>
<node id="31.0">
<data key="label">House of Bush, House of Saud</data>
<data key="value">l</data>
<data key="size">4.0</data>
<data key="r">0</data>
<data key="g">0</data>
<data key="b">0</data>
<data key="x">63.830505</data>
<data key="y">165.61662</data>
</node>
<node id="32.0">
<data key="label">The Death of Right and Wrong</data>
<data key="value">c</data>
<data key="size">4.0</data>
<data key="r">0</data>
<data key="g">0</data>
<data key="b">0</data>
<data key="x">-61.8484</data>
<data key="y">-438.0824</data>
</node>
<node id="33.0">
<data key="label">Useful Idiots</data>
<data key="value">c</data>
<data key="size">4.0</data>
<data key="r">0</data>
<data key="g">0</data>
<data key="b">0</data>
<data key="x">-129.91853</data>
<data key="y">-397.30615</data>
</node>
<node id="34.0">
<data key="label">The O'Reilly Factor</data>
<data key="value">c</data>
<data key="size">4.0</data>
<data key="r">0</data>
<data key="g">0</data>
<data key="b">0</data>
<data key="x">-302.23447</data>
<data key="y">-414.20383</data>
</node>
<node id="35.0">
<data key="label">Let Freedom Ring</data>
<data key="value">c</data>
<data key="size">4.0</data>
<data key="r">0</data>
<data key="g">0</data>
<data key="b">0</data>
<data key="x">-212.38335</data>
<data key="y">-329.95444</data>
</node>
<node id="36.0">
<data key="label">Those Who Trespass</data>
<data key="value">c</data>
<data key="size">4.0</data>
<data key="r">0</data>
<data key="g">0</data>
<data key="b">0</data>
<data key="x">-149.58989</data>
<data key="y">-452.67712</data>
</node>
<node id="37.0">
<data key="label">Bias</data>
<data key="value">c</data>
<data key="size">4.0</data>
<data key="r">0</data>
<data key="g">0</data>
<data key="b">0</data>
<data key="x">-196.11087</data>
<data key="y">-406.37595</data>
</node>
<node id="38.0">
<data key="label">Slander</data>
<data key="value">c</data>
<data key="size">4.0</data>
<data key="r">0</data>
<data key="g">0</data>
<data key="b">0</data>
<data key="x">-246.04126</data>
<data key="y">-367.93533</data>
</node>
<node id="39.0">
<data key="label">The Savage Nation</data>
<data key="value">c</data>
<data key="size">4.0</data>
<data key="r">0</data>
<data key="g">0</data>
<data key="b">0</data>
<data key="x">-166.2203</data>
<data key="y">-382.35803</data>
</node>
<node id="40.0">
<data key="label">Deliver Us from Evil</data>
<data key="value">c</data>
<data key="size">4.0</data>
<data key="r">0</data>
<data key="g">0</data>
<data key="b">0</data>
<data key="x">31.903622</data>
<data key="y">-256.0797</data>
</node>
<node id="41.0">
<data key="label">Give Me a Break</data>
<data key="value">c</data>
<data key="size">4.0</data>
<data key="r">0</data>
<data key="g">0</data>
<data key="b">0</data>
<data key="x">9.0463085</data>
<data key="y">-367.29575</data>
</node>
<node id="42.0">
<data key="label">The Enemy Within</data>
<data key="value">c</data>
<data key="size">4.0</data>
<data key="r">0</data>
<data key="g">0</data>
<data key="b">0</data>
<data key="x">-168.73076</data>
<data key="y">-316.81775</data>
</node>
<node id="43.0">
<data key="label">The Real America</data>
<data key="value">c</data>
<data key="size">4.0</data>
<data key="r">0</data>
<data key="g">0</data>
<data key="b">0</data>
<data key="x">-250.36761</data>
<data key="y">-246.55594</data>
</node>
<node id="44.0">
<data key="label">Who's Looking Out for You?</data>
<data key="value">c</data>
<data key="size">4.0</data>
<data key="r">0</data>
<data key="g">0</data>
<data key="b">0</data>
<data key="x">-170.82462</data>
<data key="y">-270.40076</data>
</node>
<node id="45.0">
<data key="label">The Official Handbook Vast Right Wing Conspiracy</data>
<data key="value">c</data>
<data key="size">4.0</data>
<data key="r">0</data>
<data key="g">0</data>
<data key="b">0</data>
<data key="x">105.91169</data>
<data key="y">-299.7173</data>
</node>
<node id="46.0">
<data key="label">Power Plays</data>
<data key="value">n</data>
<data key="size">4.0</data>
<data key="r">0</data>
<data key="g">0</data>
<data key="b">0</data>
<data key="x">-204.04077</data>
<data key="y">-188.16936</data>
</node>
<node id="47.0">
<data key="label">Arrogance</data>
<data key="value">c</data>
<data key="size">4.0</data>
<data key="r">0</data>
<data key="g">0</data>
<data key="b">0</data>
<data key="x">-20.649412</data>
<data key="y">-341.78625</data>
</node>
<node id="48.0">
<data key="label">The Perfect Wife</data>
<data key="value">n</data>
<data key="size">4.0</data>
<data key="r">0</data>
<data key="g">0</data>
<data key="b">0</data>
<data key="x">43.593544</data>
<data key="y">-41.05275</data>
</node>
<node id="49.0">
<data key="label">The Bushes</data>
<data key="value">c</data>
<data key="size">4.0</data>
<data key="r">0</data>
<data key="g">0</data>
<data key="b">0</data>
<data key="x">60.873672</data>
<data key="y">35.050423</data>
</node>
<node id="50.0">
<data key="label">Things Worth Fighting For</data>
<data key="value">c</data>
<data key="size">4.0</data>
<data key="r">0</data>
<data key="g">0</data>
<data key="b">0</data>
<data key="x">223.63745</data>
<data key="y">-103.57421</data>
</node>
<node id="51.0">
<data key="label">Surprise, Security, the American Experience</data>
<data key="value">n</data>
<data key="size">4.0</data>
<data key="r">0</data>
<data key="g">0</data>
<data key="b">0</data>
<data key="x">322.76544</data>
<data key="y">16.334576</data>
</node>
<node id="52.0">
<data key="label">Allies</data>
<data key="value">c</data>
<data key="size">4.0</data>
<data key="r">0</data>
<data key="g">0</data>
<data key="b">0</data>
<data key="x">280.12006</data>
<data key="y">-53.08684</data>
</node>
<node id="53.0">
<data key="label">Why Courage Matters</data>
<data key="value">c</data>
<data key="size">4.0</data>
<data key="r">0</data>
<data key="g">0</data>
<data key="b">0</data>
<data key="x">-27.467644</data>
<data key="y">-69.87174</data>
</node>
<node id="54.0">
<data key="label">Hollywood Interrupted</data>
<data key="value">c</data>
<data key="size">4.0</data>
<data key="r">0</data>
<data key="g">0</data>
<data key="b">0</data>
<data key="x">55.164253</data>
<data key="y">-454.518</data>
</node>
<node id="55.0">
<data key="label">Fighting Back</data>
<data key="value">c</data>
<data key="size">4.0</data>
<data key="r">0</data>
<data key="g">0</data>
<data key="b">0</data>
<data key="x">-247.40555</data>
<data key="y">-189.17479</data>
</node>
<node id="56.0">
<data key="label">We Will Prevail</data>
<data key="value">c</data>
<data key="size">4.0</data>
<data key="r">0</data>
<data key="g">0</data>
<data key="b">0</data>
<data key="x">-199.94122</data>
<data key="y">-110.32869</data>
</node>
<node id="57.0">
<data key="label">The Faith of George W Bush</data>
<data key="value">c</data>
<data key="size">4.0</data>
<data key="r">0</data>
<data key="g">0</data>
<data key="b">0</data>
<data key="x">-88.4183</data>
<data key="y">-45.41267</data>
</node>
<node id="58.0">
<data key="label">Rise of the Vulcans</data>
<data key="value">c</data>
<data key="size">4.0</data>
<data key="r">0</data>
<data key="g">0</data>
<data key="b">0</data>
<data key="x">230.5741</data>
<data key="y">72.43684</data>
</node>
<node id="59.0">
<data key="label">Downsize This!</data>
<data key="value">l</data>
<data key="size">4.0</data>
<data key="r">0</data>
<data key="g">0</data>
<data key="b">0</data>
<data key="x">-377.6014</data>
<data key="y">306.10986</data>
</node>
<node id="60.0">
<data key="label">Stupid White Men</data>
<data key="value">l</data>
<data key="size">4.0</data>
<data key="r">0</data>
<data key="g">0</data>
<data key="b">0</data>
<data key="x">-274.76767</data>
<data key="y">377.11572</data>
</node>
<node id="61.0">
<data key="label">Rush Limbaugh Is a Big Fat Idiot</data>
<data key="value">l</data>
<data key="size">4.0</data>
<data key="r">0</data>
<data key="g">0</data>
<data key="b">0</data>
<data key="x">-382.38333</data>
<data key="y">195.65889</data>
</node>
<node id="62.0">
<data key="label">The Best Democracy Money Can Buy</data>
<data key="value">l</data>
<data key="size">4.0</data>
<data key="r">0</data>
<data key="g">0</data>
<data key="b">0</data>
<data key="x">-300.97693</data>
<data key="y">331.8828</data>
</node>
<node id="63.0">
<data key="label">The Culture of Fear</data>
<data key="value">l</data>
<data key="size">4.0</data>
<data key="r">0</data>
<data key="g">0</data>
<data key="b">0</data>
<data key="x">-358.85117</data>
<data key="y">383.85278</data>
</node>
<node id="64.0">
<data key="label">America Unbound</data>
<data key="value">l</data>
<data key="size">4.0</data>
<data key="r">0</data>
<data key="g">0</data>
<data key="b">0</data>
<data key="x">267.09058</data>
<data key="y">155.7641</data>
</node>
<node id="65.0">
<data key="label">The Choice</data>
<data key="value">l</data>
<data key="size">4.0</data>
<data key="r">0</data>
<data key="g">0</data>
<data key="b">0</data>
<data key="x">351.15018</data>
<data key="y">151.02995</data>
</node>
<node id="66.0">
<data key="label">The Great Unraveling</data>
<data key="value">l</data>
<data key="size">4.0</data>
<data key="r">0</data>
<data key="g">0</data>
<data key="b">0</data>
<data key="x">10.977695</data>
<data key="y">291.47333</data>
</node>
<node id="67.0">
<data key="label">Rogue Nation</data>
<data key="value">l</data>
<data key="size">4.0</data>
<data key="r">0</data>
<data key="g">0</data>
<data key="b">0</data>
<data key="x">268.99597</data>
<data key="y">271.64938</data>
</node>
<node id="68.0">
<data key="label">Soft Power</data>
<data key="value">l</data>
<data key="size">4.0</data>
<data key="r">0</data>
<data key="g">0</data>
<data key="b">0</data>
<data key="x">307.9953</data>
<data key="y">213.4145</data>
</node>
<node id="69.0">
<data key="label">Colossus</data>
<data key="value">n</data>
<data key="size">4.0</data>
<data key="r">0</data>
<data key="g">0</data>
<data key="b">0</data>
<data key="x">406.65112</data>
<data key="y">105.56731</data>
</node>
<node id="70.0">
<data key="label">The Sorrows of Empire</data>
<data key="value">l</data>
<data key="size">4.0</data>
<data key="r">0</data>
<data key="g">0</data>
<data key="b">0</data>
<data key="x">156.18959</data>
<data key="y">292.4656</data>
</node>
<node id="71.0">
<data key="label">Against All Enemies</data>
<data key="value">l</data>
<data key="size">4.0</data>
<data key="r">0</data>
<data key="g">0</data>
<data key="b">0</data>
<data key="x">86.60125</data>
<data key="y">243.029</data>
</node>
<node id="72.0">
<data key="label">American Dynasty</data>
<data key="value">l</data>
<data key="size">4.0</data>
<data key="r">0</data>
<data key="g">0</data>
<data key="b">0</data>
<data key="x">39.113438</data>
<data key="y">281.211</data>
</node>
<node id="73.0">
<data key="label">Big Lies</data>
<data key="value">l</data>
<data key="size">4.0</data>
<data key="r">0</data>
<data key="g">0</data>
<data key="b">0</data>
<data key="x">-96.81769</data>
<data key="y">248.04</data>
</node>
<node id="74.0">
<data key="label">The Lies of George W. Bush</data>
<data key="value">l</data>
<data key="size">4.0</data>
<data key="r">0</data>
<data key="g">0</data>
<data key="b">0</data>
<data key="x">-37.955338</data>
<data key="y">278.37167</data>
</node>
<node id="75.0">
<data key="label">Worse Than Watergate</data>
<data key="value">l</data>
<data key="size">4.0</data>
<data key="r">0</data>
<data key="g">0</data>
<data key="b">0</data>
<data key="x">27.522644</data>
<data key="y">249.03955</data>
</node>
<node id="76.0">
<data key="label">Plan of Attack</data>
<data key="value">n</data>
<data key="size">4.0</data>
<data key="r">0</data>
<data key="g">0</data>
<data key="b">0</data>
<data key="x">-18.882149</data>
<data key="y">147.46819</data>
</node>
<node id="77.0">
<data key="label">Bush at War</data>
<data key="value">c</data>
<data key="size">4.0</data>
<data key="r">0</data>
<data key="g">0</data>
<data key="b">0</data>
<data key="x">51.56487</data>
<data key="y">92.60515</data>
</node>
<node id="78.0">
<data key="label">The New Pearl Harbor</data>
<data key="value">l</data>
<data key="size">4.0</data>
<data key="r">0</data>
<data key="g">0</data>
<data key="b">0</data>
<data key="x">114.082184</data>
<data key="y">324.6054</data>
</node>
<node id="79.0">
<data key="label">Bushwomen</data>
<data key="value">l</data>
<data key="size">4.0</data>
<data key="r">0</data>
<data key="g">0</data>
<data key="b">0</data>
<data key="x">-0.494591</data>
<data key="y">347.31183</data>
</node>
<node id="80.0">
<data key="label">The Bubble of American Supremacy</data>
<data key="value">l</data>
<data key="size">4.0</data>
<data key="r">0</data>
<data key="g">0</data>
<data key="b">0</data>
<data key="x">160.1897</data>
<data key="y">356.8528</data>
</node>
<node id="81.0">
<data key="label">Living History</data>
<data key="value">l</data>
<data key="size">4.0</data>
<data key="r">0</data>
<data key="g">0</data>
<data key="b">0</data>
<data key="x">-83.9297</data>
<data key="y">428.9265</data>
</node>
<node id="82.0">
<data key="label">The Politics of Truth</data>
<data key="value">l</data>
<data key="size">4.0</data>
<data key="r">0</data>
<data key="g">0</data>
<data key="b">0</data>
<data key="x">-16.956278</data>
<data key="y">206.52866</data>
</node>
<node id="83.0">
<data key="label">Fanatics and Fools</data>
<data key="value">l</data>
<data key="size">4.0</data>
<data key="r">0</data>
<data key="g">0</data>
<data key="b">0</data>
<data key="x">-71.887344</data>
<data key="y">189.6992</data>
</node>
<node id="84.0">
<data key="label">Bushwhacked</data>
<data key="value">l</data>
<data key="size">4.0</data>
<data key="r">0</data>
<data key="g">0</data>
<data key="b">0</data>
<data key="x">-116.92329</data>
<data key="y">292.86636</data>
</node>
<node id="85.0">
<data key="label">Disarming Iraq</data>
<data key="value">l</data>
<data key="size">4.0</data>
<data key="r">0</data>
<data key="g">0</data>
<data key="b">0</data>
<data key="x">212.12823</data>
<data key="y">202.9483</data>
</node>
<node id="86.0">
<data key="label">Lies and the Lying Liars Who Tell Them</data>
<data key="value">l</data>
<data key="size">4.0</data>
<data key="r">0</data>
<data key="g">0</data>
<data key="b">0</data>
<data key="x">-151.91655</data>
<data key="y">266.05432</data>
</node>
<node id="87.0">
<data key="label">MoveOn's 50 Ways to Love Your Country</data>
<data key="value">l</data>
<data key="size">4.0</data>
<data key="r">0</data>
<data key="g">0</data>
<data key="b">0</data>
<data key="x">-128.97337</data>
<data key="y">178.97594</data>
</node>
<node id="88.0">
<data key="label">The Buying of the President 2004</data>
<data key="value">l</data>
<data key="size">4.0</data>
<data key="r">0</data>
<data key="g">0</data>
<data key="b">0</data>
<data key="x">-19.290272</data>
<data key="y">428.38516</data>
</node>
<node id="89.0">
<data key="label">Perfectly Legal</data>
<data key="value">l</data>
<data key="size">4.0</data>
<data key="r">0</data>
<data key="g">0</data>
<data key="b">0</data>
<data key="x">-78.38785</data>
<data key="y">382.5619</data>
</node>
<node id="90.0">
<data key="label">Hegemony or Survival</data>
<data key="value">l</data>
<data key="size">4.0</data>
<data key="r">0</data>
<data key="g">0</data>
<data key="b">0</data>
<data key="x">32.21264</data>
<data key="y">415.55322</data>
</node>
<node id="91.0">
<data key="label">The Exception to the Rulers</data>
<data key="value">l</data>
<data key="size">4.0</data>
<data key="r">0</data>
<data key="g">0</data>
<data key="b">0</data>
<data key="x">-53.12154</data>
<data key="y">326.5602</data>
</node>
<node id="92.0">
<data key="label">Freethinkers</data>
<data key="value">l</data>
<data key="size">4.0</data>
<data key="r">0</data>
<data key="g">0</data>
<data key="b">0</data>
<data key="x">82.603836</data>
<data key="y">399.71143</data>
</node>
<node id="93.0">
<data key="label">Had Enough?</data>
<data key="value">l</data>
<data key="size">4.0</data>
<data key="r">0</data>
<data key="g">0</data>
<data key="b">0</data>
<data key="x">-174.41318</data>
<data key="y">160.35197</data>
</node>
<node id="94.0">
<data key="label">It's Still the Economy, Stupid!</data>
<data key="value">l</data>
<data key="size">4.0</data>
<data key="r">0</data>
<data key="g">0</data>
<data key="b">0</data>
<data key="x">-268.20392</data>
<data key="y">160.89297</data>
</node>
<node id="95.0">
<data key="label">We're Right They're Wrong</data>
<data key="value">l</data>
<data key="size">4.0</data>
<data key="r">0</data>
<data key="g">0</data>
<data key="b">0</data>
<data key="x">-332.77142</data>
<data key="y">115.882286</data>
</node>
<node id="96.0">
<data key="label">What Liberal Media?</data>
<data key="value">l</data>
<data key="size">4.0</data>
<data key="r">0</data>
<data key="g">0</data>
<data key="b">0</data>
<data key="x">-222.48831</data>
<data key="y">290.43732</data>
</node>
<node id="97.0">
<data key="label">The Clinton Wars</data>
<data key="value">l</data>
<data key="size">4.0</data>
<data key="r">0</data>
<data key="g">0</data>
<data key="b">0</data>
<data key="x">-155.45482</data>
<data key="y">393.12762</data>
</node>
<node id="98.0">
<data key="label">Weapons of Mass Deception</data>
<data key="value">l</data>
<data key="size">4.0</data>
<data key="r">0</data>
<data key="g">0</data>
<data key="b">0</data>
<data key="x">-201.83127</data>
<data key="y">225.2487</data>
</node>
<node id="99.0">
<data key="label">Dude, Where's My Country?</data>
<data key="value">l</data>
<data key="size">4.0</data>
<data key="r">0</data>
<data key="g">0</data>
<data key="b">0</data>
<data key="x">-169.86743</data>
<data key="y">335.54388</data>
</node>
<node id="100.0">
<data key="label">Thieves in High Places</data>
<data key="value">l</data>
<data key="size">4.0</data>
<data key="r">0</data>
<data key="g">0</data>
<data key="b">0</data>
<data key="x">-172.96962</data>
<data key="y">299.75967</data>
</node>
<node id="101.0">
<data key="label">Shrub</data>
<data key="value">l</data>
<data key="size">4.0</data>
<data key="r">0</data>
<data key="g">0</data>
<data key="b">0</data>
<data key="x">-300.64603</data>
<data key="y">233.6063</data>
</node>
<node id="102.0">
<data key="label">Buck Up Suck Up</data>
<data key="value">l</data>
<data key="size">4.0</data>
<data key="r">0</data>
<data key="g">0</data>
<data key="b">0</data>
<data key="x">-316.1964</data>
<data key="y">12.883068</data>
</node>
<node id="103.0">
<data key="label">The Future of Freedom</data>
<data key="value">n</data>
<data key="size">4.0</data>
<data key="r">0</data>
<data key="g">0</data>
<data key="b">0</data>
<data key="x">414.67413</data>
<data key="y">315.41455</data>
</node>
<node id="104.0">
<data key="label">Empire</data>
<data key="value">n</data>
<data key="size">4.0</data>
<data key="r">0</data>
<data key="g">0</data>
<data key="b">0</data>
<data key="x">440.31824</data>
<data key="y">228.58795</data>
</node>
<edge source="1.0" target="0.0">
<data key="edgeid">0</data>
<data key="weight">1.0</data>
</edge>
<edge source="2.0" target="0.0">
<data key="edgeid">1</data>
<data key="weight">1.0</data>
</edge>
<edge source="3.0" target="0.0">
<data key="edgeid">2</data>
<data key="weight">1.0</data>
</edge>
<edge source="3.0" target="1.0">
<data key="edgeid">3</data>
<data key="weight">1.0</data>
</edge>
<edge source="4.0" target="0.0">
<data key="edgeid">4</data>
<data key="weight">1.0</data>
</edge>
<edge source="4.0" target="2.0">
<data key="edgeid">5</data>
<data key="weight">1.0</data>
</edge>
<edge source="5.0" target="0.0">
<data key="edgeid">6</data>
<data key="weight">1.0</data>
</edge>
<edge source="5.0" target="1.0">
<data key="edgeid">7</data>
<data key="weight">1.0</data>
</edge>
<edge source="5.0" target="2.0">
<data key="edgeid">8</data>
<data key="weight">1.0</data>
</edge>
<edge source="5.0" target="3.0">
<data key="edgeid">9</data>
<data key="weight">1.0</data>
</edge>
<edge source="5.0" target="4.0">
<data key="edgeid">10</data>
<data key="weight">1.0</data>
</edge>
<edge source="6.0" target="0.0">
<data key="edgeid">11</data>
<data key="weight">1.0</data>
</edge>
<edge source="6.0" target="1.0">
<data key="edgeid">12</data>
<data key="weight">1.0</data>
</edge>
<edge source="6.0" target="4.0">
<data key="edgeid">13</data>
<data key="weight">1.0</data>
</edge>
<edge source="6.0" target="5.0">
<data key="edgeid">14</data>
<data key="weight">1.0</data>
</edge>
<edge source="7.0" target="2.0">
<data key="edgeid">15</data>
<data key="weight">1.0</data>
</edge>
<edge source="7.0" target="5.0">
<data key="edgeid">16</data>
<data key="weight">1.0</data>
</edge>
<edge source="7.0" target="6.0">
<data key="edgeid">17</data>
<data key="weight">1.0</data>
</edge>
<edge source="8.0" target="3.0">
<data key="edgeid">18</data>
<data key="weight">1.0</data>
</edge>
<edge source="9.0" target="3.0">
<data key="edgeid">19</data>
<data key="weight">1.0</data>
</edge>
<edge source="9.0" target="8.0">
<data key="edgeid">20</data>
<data key="weight">1.0</data>
</edge>
<edge source="10.0" target="3.0">
<data key="edgeid">21</data>
<data key="weight">1.0</data>
</edge>
<edge source="10.0" target="6.0">
<data key="edgeid">22</data>
<data key="weight">1.0</data>
</edge>
<edge source="10.0" target="8.0">
<data key="edgeid">23</data>
<data key="weight">1.0</data>
</edge>
<edge source="11.0" target="3.0">
<data key="edgeid">24</data>
<data key="weight">1.0</data>
</edge>
<edge source="11.0" target="8.0">
<data key="edgeid">25</data>
<data key="weight">1.0</data>
</edge>
<edge source="11.0" target="9.0">
<data key="edgeid">26</data>
<data key="weight">1.0</data>
</edge>
<edge source="11.0" target="10.0">
<data key="edgeid">27</data>
<data key="weight">1.0</data>
</edge>
<edge source="12.0" target="3.0">
<data key="edgeid">28</data>
<data key="weight">1.0</data>
</edge>
<edge source="12.0" target="6.0">
<data key="edgeid">29</data>
<data key="weight">1.0</data>
</edge>
<edge source="12.0" target="8.0">
<data key="edgeid">30</data>
<data key="weight">1.0</data>
</edge>
<edge source="12.0" target="9.0">
<data key="edgeid">31</data>
<data key="weight">1.0</data>
</edge>
<edge source="12.0" target="10.0">
<data key="edgeid">32</data>
<data key="weight">1.0</data>
</edge>
<edge source="12.0" target="11.0">
<data key="edgeid">33</data>
<data key="weight">1.0</data>
</edge>
<edge source="13.0" target="3.0">
<data key="edgeid">34</data>
<data key="weight">1.0</data>
</edge>
<edge source="13.0" target="8.0">
<data key="edgeid">35</data>
<data key="weight">1.0</data>
</edge>
<edge source="13.0" target="11.0">
<data key="edgeid">36</data>
<data key="weight">1.0</data>
</edge>
<edge source="13.0" target="12.0">
<data key="edgeid">37</data>
<data key="weight">1.0</data>
</edge>
<edge source="14.0" target="3.0">
<data key="edgeid">38</data>
<data key="weight">1.0</data>
</edge>
<edge source="14.0" target="8.0">
<data key="edgeid">39</data>
<data key="weight">1.0</data>
</edge>
<edge source="14.0" target="9.0">
<data key="edgeid">40</data>
<data key="weight">1.0</data>
</edge>
<edge source="14.0" target="11.0">
<data key="edgeid">41</data>
<data key="weight">1.0</data>
</edge>
<edge source="14.0" target="12.0">
<data key="edgeid">42</data>
<data key="weight">1.0</data>
</edge>
<edge source="14.0" target="7.0">
<data key="edgeid">43</data>
<data key="weight">1.0</data>
</edge>
<edge source="15.0" target="3.0">
<data key="edgeid">44</data>
<data key="weight">1.0</data>
</edge>
<edge source="15.0" target="10.0">
<data key="edgeid">45</data>
<data key="weight">1.0</data>
</edge>
<edge source="15.0" target="12.0">
<data key="edgeid">46</data>
<data key="weight">1.0</data>
</edge>
<edge source="16.0" target="3.0">
<data key="edgeid">47</data>
<data key="weight">1.0</data>
</edge>
<edge source="16.0" target="10.0">
<data key="edgeid">48</data>
<data key="weight">1.0</data>
</edge>
<edge source="16.0" target="15.0">
<data key="edgeid">49</data>
<data key="weight">1.0</data>
</edge>
<edge source="17.0" target="3.0">
<data key="edgeid">50</data>
<data key="weight">1.0</data>
</edge>
<edge source="17.0" target="11.0">
<data key="edgeid">51</data>
<data key="weight">1.0</data>
</edge>
<edge source="17.0" target="12.0">
<data key="edgeid">52</data>
<data key="weight">1.0</data>
</edge>
<edge source="17.0" target="13.0">
<data key="edgeid">53</data>
<data key="weight">1.0</data>
</edge>
<edge source="18.0" target="3.0">
<data key="edgeid">54</data>
<data key="weight">1.0</data>
</edge>
<edge source="18.0" target="6.0">
<data key="edgeid">55</data>
<data key="weight">1.0</data>
</edge>
<edge source="18.0" target="12.0">
<data key="edgeid">56</data>
<data key="weight">1.0</data>
</edge>
<edge source="19.0" target="3.0">
<data key="edgeid">57</data>
<data key="weight">1.0</data>
</edge>
<edge source="19.0" target="10.0">
<data key="edgeid">58</data>
<data key="weight">1.0</data>
</edge>
<edge source="20.0" target="3.0">
<data key="edgeid">59</data>
<data key="weight">1.0</data>
</edge>
<edge source="20.0" target="8.0">
<data key="edgeid">60</data>
<data key="weight">1.0</data>
</edge>
<edge source="20.0" target="9.0">
<data key="edgeid">61</data>
<data key="weight">1.0</data>
</edge>
<edge source="20.0" target="11.0">
<data key="edgeid">62</data>
<data key="weight">1.0</data>
</edge>
<edge source="21.0" target="3.0">
<data key="edgeid">63</data>
<data key="weight">1.0</data>
</edge>
<edge source="21.0" target="8.0">
<data key="edgeid">64</data>
<data key="weight">1.0</data>
</edge>
<edge source="21.0" target="10.0">
<data key="edgeid">65</data>
<data key="weight">1.0</data>
</edge>
<edge source="21.0" target="11.0">
<data key="edgeid">66</data>
<data key="weight">1.0</data>
</edge>
<edge source="22.0" target="3.0">
<data key="edgeid">67</data>
<data key="weight">1.0</data>
</edge>
<edge source="22.0" target="6.0">
<data key="edgeid">68</data>
<data key="weight">1.0</data>
</edge>
<edge source="22.0" target="8.0">
<data key="edgeid">69</data>
<data key="weight">1.0</data>
</edge>
<edge source="22.0" target="11.0">
<data key="edgeid">70</data>
<data key="weight">1.0</data>
</edge>
<edge source="23.0" target="3.0">
<data key="edgeid">71</data>
<data key="weight">1.0</data>
</edge>
<edge source="23.0" target="8.0">
<data key="edgeid">72</data>
<data key="weight">1.0</data>
</edge>
<edge source="23.0" target="12.0">
<data key="edgeid">73</data>
<data key="weight">1.0</data>
</edge>
<edge source="23.0" target="21.0">
<data key="edgeid">74</data>
<data key="weight">1.0</data>
</edge>
<edge source="24.0" target="3.0">
<data key="edgeid">75</data>
<data key="weight">1.0</data>
</edge>
<edge source="24.0" target="8.0">
<data key="edgeid">76</data>
<data key="weight">1.0</data>
</edge>
<edge source="24.0" target="9.0">
<data key="edgeid">77</data>
<data key="weight">1.0</data>
</edge>
<edge source="24.0" target="12.0">
<data key="edgeid">78</data>
<data key="weight">1.0</data>
</edge>
<edge source="24.0" target="20.0">
<data key="edgeid">79</data>
<data key="weight">1.0</data>
</edge>
<edge source="25.0" target="3.0">
<data key="edgeid">80</data>
<data key="weight">1.0</data>
</edge>
<edge source="25.0" target="6.0">
<data key="edgeid">81</data>
<data key="weight">1.0</data>
</edge>
<edge source="25.0" target="14.0">
<data key="edgeid">82</data>
<data key="weight">1.0</data>
</edge>
<edge source="25.0" target="22.0">
<data key="edgeid">83</data>
<data key="weight">1.0</data>
</edge>
<edge source="26.0" target="3.0">
<data key="edgeid">84</data>
<data key="weight">1.0</data>
</edge>
<edge source="26.0" target="8.0">
<data key="edgeid">85</data>
<data key="weight">1.0</data>
</edge>
<edge source="26.0" target="11.0">
<data key="edgeid">86</data>
<data key="weight">1.0</data>
</edge>
<edge source="26.0" target="14.0">
<data key="edgeid">87</data>
<data key="weight">1.0</data>
</edge>
<edge source="26.0" target="24.0">
<data key="edgeid">88</data>
<data key="weight">1.0</data>
</edge>
<edge source="27.0" target="3.0">
<data key="edgeid">89</data>
<data key="weight">1.0</data>
</edge>
<edge source="27.0" target="8.0">
<data key="edgeid">90</data>
<data key="weight">1.0</data>
</edge>
<edge source="27.0" target="9.0">
<data key="edgeid">91</data>
<data key="weight">1.0</data>
</edge>
<edge source="27.0" target="11.0">
<data key="edgeid">92</data>
<data key="weight">1.0</data>
</edge>
<edge source="27.0" target="23.0">
<data key="edgeid">93</data>
<data key="weight">1.0</data>
</edge>
<edge source="28.0" target="4.0">
<data key="edgeid">94</data>
<data key="weight">1.0</data>
</edge>
<edge source="29.0" target="4.0">
<data key="edgeid">95</data>
<data key="weight">1.0</data>
</edge>
<edge source="29.0" target="6.0">
<data key="edgeid">96</data>
<data key="weight">1.0</data>
</edge>
<edge source="29.0" target="11.0">
<data key="edgeid">97</data>
<data key="weight">1.0</data>
</edge>
<edge source="29.0" target="13.0">
<data key="edgeid">98</data>
<data key="weight">1.0</data>
</edge>
<edge source="30.0" target="4.0">
<data key="edgeid">99</data>
<data key="weight">1.0</data>
</edge>
<edge source="30.0" target="7.0">
<data key="edgeid">100</data>
<data key="weight">1.0</data>
</edge>
<edge source="31.0" target="4.0">
<data key="edgeid">101</data>
<data key="weight">1.0</data>
</edge>
<edge source="31.0" target="30.0">
<data key="edgeid">102</data>
<data key="weight">1.0</data>
</edge>
<edge source="32.0" target="8.0">
<data key="edgeid">103</data>
<data key="weight">1.0</data>
</edge>
<edge source="32.0" target="12.0">
<data key="edgeid">104</data>
<data key="weight">1.0</data>
</edge>
<edge source="32.0" target="13.0">
<data key="edgeid">105</data>
<data key="weight">1.0</data>
</edge>
<edge source="32.0" target="23.0">
<data key="edgeid">106</data>
<data key="weight">1.0</data>
</edge>
<edge source="33.0" target="32.0">
<data key="edgeid">107</data>
<data key="weight">1.0</data>
</edge>
<edge source="33.0" target="8.0">
<data key="edgeid">108</data>
<data key="weight">1.0</data>
</edge>
<edge source="33.0" target="10.0">
<data key="edgeid">109</data>
<data key="weight">1.0</data>
</edge>
<edge source="33.0" target="12.0">
<data key="edgeid">110</data>
<data key="weight">1.0</data>
</edge>
<edge source="33.0" target="23.0">
<data key="edgeid">111</data>
<data key="weight">1.0</data>
</edge>
<edge source="35.0" target="34.0">
<data key="edgeid">112</data>
<data key="weight">1.0</data>
</edge>
<edge source="35.0" target="8.0">
<data key="edgeid">113</data>
<data key="weight">1.0</data>
</edge>
<edge source="35.0" target="10.0">
<data key="edgeid">114</data>
<data key="weight">1.0</data>
</edge>
<edge source="36.0" target="34.0">
<data key="edgeid">115</data>
<data key="weight">1.0</data>
</edge>
<edge source="36.0" target="35.0">
<data key="edgeid">116</data>
<data key="weight">1.0</data>
</edge>
<edge source="36.0" target="12.0">
<data key="edgeid">117</data>
<data key="weight">1.0</data>
</edge>
<edge source="37.0" target="34.0">
<data key="edgeid">118</data>
<data key="weight">1.0</data>
</edge>
<edge source="37.0" target="8.0">
<data key="edgeid">119</data>
<data key="weight">1.0</data>
</edge>
<edge source="37.0" target="10.0">
<data key="edgeid">120</data>
<data key="weight">1.0</data>
</edge>
<edge source="37.0" target="35.0">
<data key="edgeid">121</data>
<data key="weight">1.0</data>
</edge>
<edge source="37.0" target="33.0">
<data key="edgeid">122</data>
<data key="weight">1.0</data>
</edge>
<edge source="38.0" target="34.0">
<data key="edgeid">123</data>
<data key="weight">1.0</data>
</edge>
<edge source="38.0" target="10.0">
<data key="edgeid">124</data>
<data key="weight">1.0</data>
</edge>
<edge source="38.0" target="35.0">
<data key="edgeid">125</data>
<data key="weight">1.0</data>
</edge>
<edge source="38.0" target="12.0">
<data key="edgeid">126</data>
<data key="weight">1.0</data>
</edge>
<edge source="38.0" target="37.0">
<data key="edgeid">127</data>
<data key="weight">1.0</data>
</edge>
<edge source="38.0" target="33.0">
<data key="edgeid">128</data>
<data key="weight">1.0</data>
</edge>
<edge source="39.0" target="34.0">
<data key="edgeid">129</data>
<data key="weight">1.0</data>
</edge>
<edge source="39.0" target="10.0">
<data key="edgeid">130</data>
<data key="weight">1.0</data>
</edge>
<edge source="39.0" target="35.0">
<data key="edgeid">131</data>
<data key="weight">1.0</data>
</edge>
<edge source="39.0" target="12.0">
<data key="edgeid">132</data>
<data key="weight">1.0</data>
</edge>
<edge source="39.0" target="38.0">
<data key="edgeid">133</data>
<data key="weight">1.0</data>
</edge>
<edge source="39.0" target="33.0">
<data key="edgeid">134</data>
<data key="weight">1.0</data>
</edge>
<edge source="40.0" target="8.0">
<data key="edgeid">135</data>
<data key="weight">1.0</data>
</edge>
<edge source="40.0" target="35.0">
<data key="edgeid">136</data>
<data key="weight">1.0</data>
</edge>
<edge source="40.0" target="12.0">
<data key="edgeid">137</data>
<data key="weight">1.0</data>
</edge>
<edge source="40.0" target="13.0">
<data key="edgeid">138</data>
<data key="weight">1.0</data>
</edge>
<edge source="40.0" target="20.0">
<data key="edgeid">139</data>
<data key="weight">1.0</data>
</edge>
<edge source="40.0" target="22.0">
<data key="edgeid">140</data>
<data key="weight">1.0</data>
</edge>
<edge source="40.0" target="39.0">
<data key="edgeid">141</data>
<data key="weight">1.0</data>
</edge>
<edge source="40.0" target="24.0">
<data key="edgeid">142</data>
<data key="weight">1.0</data>
</edge>
<edge source="40.0" target="25.0">
<data key="edgeid">143</data>
<data key="weight">1.0</data>
</edge>
<edge source="40.0" target="26.0">
<data key="edgeid">144</data>
<data key="weight">1.0</data>
</edge>
<edge source="40.0" target="27.0">
<data key="edgeid">145</data>
<data key="weight">1.0</data>
</edge>
<edge source="41.0" target="8.0">
<data key="edgeid">146</data>
<data key="weight">1.0</data>
</edge>
<edge source="41.0" target="9.0">
<data key="edgeid">147</data>
<data key="weight">1.0</data>
</edge>
<edge source="41.0" target="40.0">
<data key="edgeid">148</data>
<data key="weight">1.0</data>
</edge>
<edge source="41.0" target="12.0">
<data key="edgeid">149</data>
<data key="weight">1.0</data>
</edge>
<edge source="41.0" target="36.0">
<data key="edgeid">150</data>
<data key="weight">1.0</data>
</edge>
<edge source="41.0" target="27.0">
<data key="edgeid">151</data>
<data key="weight">1.0</data>
</edge>
<edge source="42.0" target="8.0">
<data key="edgeid">152</data>
<data key="weight">1.0</data>
</edge>
<edge source="42.0" target="40.0">
<data key="edgeid">153</data>
<data key="weight">1.0</data>
</edge>
<edge source="42.0" target="13.0">
<data key="edgeid">154</data>
<data key="weight">1.0</data>
</edge>
<edge source="42.0" target="39.0">
<data key="edgeid">155</data>
<data key="weight">1.0</data>
</edge>
<edge source="43.0" target="8.0">
<data key="edgeid">156</data>
<data key="weight">1.0</data>
</edge>
<edge source="43.0" target="35.0">
<data key="edgeid">157</data>
<data key="weight">1.0</data>
</edge>
<edge source="43.0" target="13.0">
<data key="edgeid">158</data>
<data key="weight">1.0</data>
</edge>
<edge source="43.0" target="42.0">
<data key="edgeid">159</data>
<data key="weight">1.0</data>
</edge>
<edge source="44.0" target="8.0">
<data key="edgeid">160</data>
<data key="weight">1.0</data>
</edge>
<edge source="44.0" target="40.0">
<data key="edgeid">161</data>
<data key="weight">1.0</data>
</edge>
<edge source="44.0" target="35.0">
<data key="edgeid">162</data>
<data key="weight">1.0</data>
</edge>
<edge source="44.0" target="12.0">
<data key="edgeid">163</data>
<data key="weight">1.0</data>
</edge>
<edge source="44.0" target="13.0">
<data key="edgeid">164</data>
<data key="weight">1.0</data>
</edge>
<edge source="45.0" target="8.0">
<data key="edgeid">165</data>
<data key="weight">1.0</data>
</edge>
<edge source="45.0" target="9.0">
<data key="edgeid">166</data>
<data key="weight">1.0</data>
</edge>
<edge source="45.0" target="40.0">
<data key="edgeid">167</data>
<data key="weight">1.0</data>
</edge>
<edge source="45.0" target="11.0">
<data key="edgeid">168</data>
<data key="weight">1.0</data>
</edge>
<edge source="45.0" target="26.0">
<data key="edgeid">169</data>
<data key="weight">1.0</data>
</edge>
<edge source="46.0" target="8.0">
<data key="edgeid">170</data>
<data key="weight">1.0</data>
</edge>
<edge source="46.0" target="12.0">
<data key="edgeid">171</data>
<data key="weight">1.0</data>
</edge>
<edge source="47.0" target="9.0">
<data key="edgeid">172</data>
<data key="weight">1.0</data>
</edge>
<edge source="47.0" target="40.0">
<data key="edgeid">173</data>
<data key="weight">1.0</data>
</edge>
<edge source="47.0" target="41.0">
<data key="edgeid">174</data>
<data key="weight">1.0</data>
</edge>
<edge source="47.0" target="11.0">
<data key="edgeid">175</data>
<data key="weight">1.0</data>
</edge>
<edge source="47.0" target="12.0">
<data key="edgeid">176</data>
<data key="weight">1.0</data>
</edge>
<edge source="47.0" target="13.0">
<data key="edgeid">177</data>
<data key="weight">1.0</data>
</edge>
<edge source="47.0" target="42.0">
<data key="edgeid">178</data>
<data key="weight">1.0</data>
</edge>
<edge source="47.0" target="36.0">
<data key="edgeid">179</data>
<data key="weight">1.0</data>
</edge>
<edge source="47.0" target="37.0">
<data key="edgeid">180</data>
<data key="weight">1.0</data>
</edge>
<edge source="47.0" target="17.0">
<data key="edgeid">181</data>
<data key="weight">1.0</data>
</edge>
<edge source="47.0" target="33.0">
<data key="edgeid">182</data>
<data key="weight">1.0</data>
</edge>
<edge source="47.0" target="45.0">
<data key="edgeid">183</data>
<data key="weight">1.0</data>
</edge>
<edge source="47.0" target="46.0">
<data key="edgeid">184</data>
<data key="weight">1.0</data>
</edge>
<edge source="47.0" target="23.0">
<data key="edgeid">185</data>
<data key="weight">1.0</data>
</edge>
<edge source="47.0" target="24.0">
<data key="edgeid">186</data>
<data key="weight">1.0</data>
</edge>
<edge source="47.0" target="26.0">
<data key="edgeid">187</data>
<data key="weight">1.0</data>
</edge>
<edge source="47.0" target="27.0">
<data key="edgeid">188</data>
<data key="weight">1.0</data>
</edge>
<edge source="48.0" target="9.0">
<data key="edgeid">189</data>
<data key="weight">1.0</data>
</edge>
<edge source="48.0" target="20.0">
<data key="edgeid">190</data>
<data key="weight">1.0</data>
</edge>
<edge source="49.0" target="9.0">
<data key="edgeid">191</data>
<data key="weight">1.0</data>
</edge>
<edge source="49.0" target="20.0">
<data key="edgeid">192</data>
<data key="weight">1.0</data>
</edge>
<edge source="49.0" target="31.0">
<data key="edgeid">193</data>
<data key="weight">1.0</data>
</edge>
<edge source="49.0" target="48.0">
<data key="edgeid">194</data>
<data key="weight">1.0</data>
</edge>
<edge source="50.0" target="9.0">
<data key="edgeid">195</data>
<data key="weight">1.0</data>
</edge>
<edge source="50.0" target="11.0">
<data key="edgeid">196</data>
<data key="weight">1.0</data>
</edge>
<edge source="51.0" target="9.0">
<data key="edgeid">197</data>
<data key="weight">1.0</data>
</edge>
<edge source="52.0" target="9.0">
<data key="edgeid">198</data>
<data key="weight">1.0</data>
</edge>
<edge source="52.0" target="22.0">
<data key="edgeid">199</data>
<data key="weight">1.0</data>
</edge>
<edge source="52.0" target="51.0">
<data key="edgeid">200</data>
<data key="weight">1.0</data>
</edge>
<edge source="53.0" target="40.0">
<data key="edgeid">201</data>
<data key="weight">1.0</data>
</edge>
<edge source="53.0" target="20.0">
<data key="edgeid">202</data>
<data key="weight">1.0</data>
</edge>
<edge source="53.0" target="24.0">
<data key="edgeid">203</data>
<data key="weight">1.0</data>
</edge>
<edge source="53.0" target="26.0">
<data key="edgeid">204</data>
<data key="weight">1.0</data>
</edge>
<edge source="54.0" target="40.0">
<data key="edgeid">205</data>
<data key="weight">1.0</data>
</edge>
<edge source="54.0" target="41.0">
<data key="edgeid">206</data>
<data key="weight">1.0</data>
</edge>
<edge source="54.0" target="12.0">
<data key="edgeid">207</data>
<data key="weight">1.0</data>
</edge>
<edge source="54.0" target="47.0">
<data key="edgeid">208</data>
<data key="weight">1.0</data>
</edge>
<edge source="54.0" target="23.0">
<data key="edgeid">209</data>
<data key="weight">1.0</data>
</edge>
<edge source="54.0" target="27.0">
<data key="edgeid">210</data>
<data key="weight">1.0</data>
</edge>
<edge source="55.0" target="10.0">
<data key="edgeid">211</data>
<data key="weight">1.0</data>
</edge>
<edge source="55.0" target="12.0">
<data key="edgeid">212</data>
<data key="weight">1.0</data>
</edge>
<edge source="55.0" target="15.0">
<data key="edgeid">213</data>
<data key="weight">1.0</data>
</edge>
<edge source="55.0" target="19.0">
<data key="edgeid">214</data>
<data key="weight">1.0</data>
</edge>
<edge source="56.0" target="11.0">
<data key="edgeid">215</data>
<data key="weight">1.0</data>
</edge>
<edge source="56.0" target="19.0">
<data key="edgeid">216</data>
<data key="weight">1.0</data>
</edge>
<edge source="56.0" target="43.0">
<data key="edgeid">217</data>
<data key="weight">1.0</data>
</edge>
<edge source="57.0" target="13.0">
<data key="edgeid">218</data>
<data key="weight">1.0</data>
</edge>
<edge source="57.0" target="56.0">
<data key="edgeid">219</data>
<data key="weight">1.0</data>
</edge>
<edge source="57.0" target="20.0">
<data key="edgeid">220</data>
<data key="weight">1.0</data>
</edge>
<edge source="57.0" target="48.0">
<data key="edgeid">221</data>
<data key="weight">1.0</data>
</edge>
<edge source="57.0" target="49.0">
<data key="edgeid">222</data>
<data key="weight">1.0</data>
</edge>
<edge source="58.0" target="14.0">
<data key="edgeid">223</data>
<data key="weight">1.0</data>
</edge>
<edge source="58.0" target="7.0">
<data key="edgeid">224</data>
<data key="weight">1.0</data>
</edge>
<edge source="58.0" target="30.0">
<data key="edgeid">225</data>
<data key="weight">1.0</data>
</edge>
<edge source="58.0" target="49.0">
<data key="edgeid">226</data>
<data key="weight">1.0</data>
</edge>
<edge source="58.0" target="50.0">
<data key="edgeid">227</data>
<data key="weight">1.0</data>
</edge>
<edge source="58.0" target="51.0">
<data key="edgeid">228</data>
<data key="weight">1.0</data>
</edge>
<edge source="58.0" target="52.0">
<data key="edgeid">229</data>
<data key="weight">1.0</data>
</edge>
<edge source="60.0" target="59.0">
<data key="edgeid">230</data>
<data key="weight">1.0</data>
</edge>
<edge source="61.0" target="59.0">
<data key="edgeid">231</data>
<data key="weight">1.0</data>
</edge>
<edge source="62.0" target="59.0">
<data key="edgeid">232</data>
<data key="weight">1.0</data>
</edge>
<edge source="62.0" target="60.0">
<data key="edgeid">233</data>
<data key="weight">1.0</data>
</edge>
<edge source="63.0" target="59.0">
<data key="edgeid">234</data>
<data key="weight">1.0</data>
</edge>
<edge source="63.0" target="60.0">
<data key="edgeid">235</data>
<data key="weight">1.0</data>
</edge>
<edge source="63.0" target="62.0">
<data key="edgeid">236</data>
<data key="weight">1.0</data>
</edge>
<edge source="64.0" target="58.0">
<data key="edgeid">237</data>
<data key="weight">1.0</data>
</edge>
<edge source="64.0" target="51.0">
<data key="edgeid">238</data>
<data key="weight">1.0</data>
</edge>
<edge source="64.0" target="52.0">
<data key="edgeid">239</data>
<data key="weight">1.0</data>
</edge>
<edge source="65.0" target="64.0">
<data key="edgeid">240</data>
<data key="weight">1.0</data>
</edge>
<edge source="65.0" target="58.0">
<data key="edgeid">241</data>
<data key="weight">1.0</data>
</edge>
<edge source="65.0" target="51.0">
<data key="edgeid">242</data>
<data key="weight">1.0</data>
</edge>
<edge source="66.0" target="64.0">
<data key="edgeid">243</data>
<data key="weight">1.0</data>
</edge>
<edge source="66.0" target="28.0">
<data key="edgeid">244</data>
<data key="weight">1.0</data>
</edge>
<edge source="66.0" target="30.0">
<data key="edgeid">245</data>
<data key="weight">1.0</data>
</edge>
<edge source="67.0" target="64.0">
<data key="edgeid">246</data>
<data key="weight">1.0</data>
</edge>
<edge source="67.0" target="65.0">
<data key="edgeid">247</data>
<data key="weight">1.0</data>
</edge>
<edge source="67.0" target="66.0">
<data key="edgeid">248</data>
<data key="weight">1.0</data>
</edge>
<edge source="67.0" target="30.0">
<data key="edgeid">249</data>
<data key="weight">1.0</data>
</edge>
<edge source="68.0" target="64.0">
<data key="edgeid">250</data>
<data key="weight">1.0</data>
</edge>
<edge source="68.0" target="58.0">
<data key="edgeid">251</data>
<data key="weight">1.0</data>
</edge>
<edge source="68.0" target="65.0">
<data key="edgeid">252</data>
<data key="weight">1.0</data>
</edge>
<edge source="69.0" target="64.0">
<data key="edgeid">253</data>
<data key="weight">1.0</data>
</edge>
<edge source="69.0" target="58.0">
<data key="edgeid">254</data>
<data key="weight">1.0</data>
</edge>
<edge source="69.0" target="65.0">
<data key="edgeid">255</data>
<data key="weight">1.0</data>
</edge>
<edge source="69.0" target="51.0">
<data key="edgeid">256</data>
<data key="weight">1.0</data>
</edge>
<edge source="70.0" target="64.0">
<data key="edgeid">257</data>
<data key="weight">1.0</data>
</edge>
<edge source="70.0" target="66.0">
<data key="edgeid">258</data>
<data key="weight">1.0</data>
</edge>
<edge source="70.0" target="30.0">
<data key="edgeid">259</data>
<data key="weight">1.0</data>
</edge>
<edge source="71.0" target="7.0">
<data key="edgeid">260</data>
<data key="weight">1.0</data>
</edge>
<edge source="71.0" target="68.0">
<data key="edgeid">261</data>
<data key="weight">1.0</data>
</edge>
<edge source="71.0" target="70.0">
<data key="edgeid">262</data>
<data key="weight">1.0</data>
</edge>
<edge source="72.0" target="71.0">
<data key="edgeid">263</data>
<data key="weight">1.0</data>
</edge>
<edge source="72.0" target="28.0">
<data key="edgeid">264</data>
<data key="weight">1.0</data>
</edge>
<edge source="72.0" target="66.0">
<data key="edgeid">265</data>
<data key="weight">1.0</data>
</edge>
<edge source="72.0" target="49.0">
<data key="edgeid">266</data>
<data key="weight">1.0</data>
</edge>
<edge source="72.0" target="70.0">
<data key="edgeid">267</data>
<data key="weight">1.0</data>
</edge>
<edge source="73.0" target="71.0">
<data key="edgeid">268</data>
<data key="weight">1.0</data>
</edge>
<edge source="73.0" target="72.0">
<data key="edgeid">269</data>
<data key="weight">1.0</data>
</edge>
<edge source="73.0" target="66.0">
<data key="edgeid">270</data>
<data key="weight">1.0</data>
</edge>
<edge source="73.0" target="30.0">
<data key="edgeid">271</data>
<data key="weight">1.0</data>
</edge>
<edge source="73.0" target="31.0">
<data key="edgeid">272</data>
<data key="weight">1.0</data>
</edge>
<edge source="74.0" target="71.0">
<data key="edgeid">273</data>
<data key="weight">1.0</data>
</edge>
<edge source="74.0" target="72.0">
<data key="edgeid">274</data>
<data key="weight">1.0</data>
</edge>
<edge source="74.0" target="73.0">
<data key="edgeid">275</data>
<data key="weight">1.0</data>
</edge>
<edge source="74.0" target="66.0">
<data key="edgeid">276</data>
<data key="weight">1.0</data>
</edge>
<edge source="74.0" target="30.0">
<data key="edgeid">277</data>
<data key="weight">1.0</data>
</edge>
<edge source="74.0" target="31.0">
<data key="edgeid">278</data>
<data key="weight">1.0</data>
</edge>
<edge source="75.0" target="71.0">
<data key="edgeid">279</data>
<data key="weight">1.0</data>
</edge>
<edge source="75.0" target="72.0">
<data key="edgeid">280</data>
<data key="weight">1.0</data>
</edge>
<edge source="75.0" target="73.0">
<data key="edgeid">281</data>
<data key="weight">1.0</data>
</edge>
<edge source="75.0" target="74.0">
<data key="edgeid">282</data>
<data key="weight">1.0</data>
</edge>
<edge source="75.0" target="30.0">
<data key="edgeid">283</data>
<data key="weight">1.0</data>
</edge>
<edge source="75.0" target="31.0">
<data key="edgeid">284</data>
<data key="weight">1.0</data>
</edge>
<edge source="75.0" target="70.0">
<data key="edgeid">285</data>
<data key="weight">1.0</data>
</edge>
<edge source="76.0" target="71.0">
<data key="edgeid">286</data>
<data key="weight">1.0</data>
</edge>
<edge source="76.0" target="72.0">
<data key="edgeid">287</data>
<data key="weight">1.0</data>
</edge>
<edge source="76.0" target="75.0">
<data key="edgeid">288</data>
<data key="weight">1.0</data>
</edge>
<edge source="76.0" target="66.0">
<data key="edgeid">289</data>
<data key="weight">1.0</data>
</edge>
<edge source="76.0" target="30.0">
<data key="edgeid">290</data>
<data key="weight">1.0</data>
</edge>
<edge source="76.0" target="31.0">
<data key="edgeid">291</data>
<data key="weight">1.0</data>
</edge>
<edge source="76.0" target="49.0">
<data key="edgeid">292</data>
<data key="weight">1.0</data>
</edge>
<edge source="76.0" target="53.0">
<data key="edgeid">293</data>
<data key="weight">1.0</data>
</edge>
<edge source="77.0" target="71.0">
<data key="edgeid">294</data>
<data key="weight">1.0</data>
</edge>
<edge source="77.0" target="75.0">
<data key="edgeid">295</data>
<data key="weight">1.0</data>
</edge>
<edge source="77.0" target="58.0">
<data key="edgeid">296</data>
<data key="weight">1.0</data>
</edge>
<edge source="77.0" target="30.0">
<data key="edgeid">297</data>
<data key="weight">1.0</data>
</edge>
<edge source="77.0" target="19.0">
<data key="edgeid">298</data>
<data key="weight">1.0</data>
</edge>
<edge source="77.0" target="31.0">
<data key="edgeid">299</data>
<data key="weight">1.0</data>
</edge>
<edge source="77.0" target="76.0">
<data key="edgeid">300</data>
<data key="weight">1.0</data>
</edge>
<edge source="78.0" target="71.0">
<data key="edgeid">301</data>
<data key="weight">1.0</data>
</edge>
<edge source="78.0" target="72.0">
<data key="edgeid">302</data>
<data key="weight">1.0</data>
</edge>
<edge source="78.0" target="74.0">
<data key="edgeid">303</data>
<data key="weight">1.0</data>
</edge>
<edge source="78.0" target="75.0">
<data key="edgeid">304</data>
<data key="weight">1.0</data>
</edge>
<edge source="78.0" target="31.0">
<data key="edgeid">305</data>
<data key="weight">1.0</data>
</edge>
<edge source="79.0" target="71.0">
<data key="edgeid">306</data>
<data key="weight">1.0</data>
</edge>
<edge source="79.0" target="72.0">
<data key="edgeid">307</data>
<data key="weight">1.0</data>
</edge>
<edge source="79.0" target="74.0">
<data key="edgeid">308</data>
<data key="weight">1.0</data>
</edge>
<edge source="79.0" target="75.0">
<data key="edgeid">309</data>
<data key="weight">1.0</data>
</edge>
<edge source="79.0" target="30.0">
<data key="edgeid">310</data>
<data key="weight">1.0</data>
</edge>
<edge source="80.0" target="71.0">
<data key="edgeid">311</data>
<data key="weight">1.0</data>
</edge>
<edge source="80.0" target="72.0">
<data key="edgeid">312</data>
<data key="weight">1.0</data>
</edge>
<edge source="80.0" target="66.0">
<data key="edgeid">313</data>
<data key="weight">1.0</data>
</edge>
<edge source="80.0" target="30.0">
<data key="edgeid">314</data>
<data key="weight">1.0</data>
</edge>
<edge source="81.0" target="71.0">
<data key="edgeid">315</data>
<data key="weight">1.0</data>
</edge>
<edge source="82.0" target="71.0">
<data key="edgeid">316</data>
<data key="weight">1.0</data>
</edge>
<edge source="82.0" target="72.0">
<data key="edgeid">317</data>
<data key="weight">1.0</data>
</edge>
<edge source="82.0" target="73.0">
<data key="edgeid">318</data>
<data key="weight">1.0</data>
</edge>
<edge source="82.0" target="74.0">
<data key="edgeid">319</data>
<data key="weight">1.0</data>
</edge>
<edge source="82.0" target="75.0">
<data key="edgeid">320</data>
<data key="weight">1.0</data>
</edge>
<edge source="82.0" target="30.0">
<data key="edgeid">321</data>
<data key="weight">1.0</data>
</edge>
<edge source="82.0" target="31.0">
<data key="edgeid">322</data>
<data key="weight">1.0</data>
</edge>
<edge source="82.0" target="76.0">
<data key="edgeid">323</data>
<data key="weight">1.0</data>
</edge>
<edge source="83.0" target="71.0">
<data key="edgeid">324</data>
<data key="weight">1.0</data>
</edge>
<edge source="83.0" target="73.0">
<data key="edgeid">325</data>
<data key="weight">1.0</data>
</edge>
<edge source="83.0" target="75.0">
<data key="edgeid">326</data>
<data key="weight">1.0</data>
</edge>
<edge source="83.0" target="30.0">
<data key="edgeid">327</data>
<data key="weight">1.0</data>
</edge>
<edge source="83.0" target="76.0">
<data key="edgeid">328</data>
<data key="weight">1.0</data>
</edge>
<edge source="84.0" target="72.0">
<data key="edgeid">329</data>
<data key="weight">1.0</data>
</edge>
<edge source="84.0" target="74.0">
<data key="edgeid">330</data>
<data key="weight">1.0</data>
</edge>
<edge source="84.0" target="75.0">
<data key="edgeid">331</data>
<data key="weight">1.0</data>
</edge>
<edge source="84.0" target="66.0">
<data key="edgeid">332</data>
<data key="weight">1.0</data>
</edge>
<edge source="84.0" target="73.0">
<data key="edgeid">333</data>
<data key="weight">1.0</data>
</edge>
<edge source="84.0" target="60.0">
<data key="edgeid">334</data>
<data key="weight">1.0</data>
</edge>
<edge source="84.0" target="30.0">
<data key="edgeid">335</data>
<data key="weight">1.0</data>
</edge>
<edge source="84.0" target="62.0">
<data key="edgeid">336</data>
<data key="weight">1.0</data>
</edge>
<edge source="84.0" target="76.0">
<data key="edgeid">337</data>
<data key="weight">1.0</data>
</edge>
<edge source="84.0" target="79.0">
<data key="edgeid">338</data>
<data key="weight">1.0</data>
</edge>
<edge source="84.0" target="81.0">
<data key="edgeid">339</data>
<data key="weight">1.0</data>
</edge>
<edge source="84.0" target="82.0">
<data key="edgeid">340</data>
<data key="weight">1.0</data>
</edge>
<edge source="84.0" target="83.0">
<data key="edgeid">341</data>
<data key="weight">1.0</data>
</edge>
<edge source="85.0" target="72.0">
<data key="edgeid">342</data>
<data key="weight">1.0</data>
</edge>
<edge source="85.0" target="7.0">
<data key="edgeid">343</data>
<data key="weight">1.0</data>
</edge>
<edge source="85.0" target="58.0">
<data key="edgeid">344</data>
<data key="weight">1.0</data>
</edge>
<edge source="85.0" target="65.0">
<data key="edgeid">345</data>
<data key="weight">1.0</data>
</edge>
<edge source="85.0" target="66.0">
<data key="edgeid">346</data>
<data key="weight">1.0</data>
</edge>
<edge source="86.0" target="72.0">
<data key="edgeid">347</data>
<data key="weight">1.0</data>
</edge>
<edge source="86.0" target="73.0">
<data key="edgeid">348</data>
<data key="weight">1.0</data>
</edge>
<edge source="86.0" target="66.0">
<data key="edgeid">349</data>
<data key="weight">1.0</data>
</edge>
<edge source="86.0" target="84.0">
<data key="edgeid">350</data>
<data key="weight">1.0</data>
</edge>
<edge source="86.0" target="60.0">
<data key="edgeid">351</data>
<data key="weight">1.0</data>
</edge>
<edge source="86.0" target="30.0">
<data key="edgeid">352</data>
<data key="weight">1.0</data>
</edge>
<edge source="86.0" target="61.0">
<data key="edgeid">353</data>
<data key="weight">1.0</data>
</edge>
<edge source="86.0" target="76.0">
<data key="edgeid">354</data>
<data key="weight">1.0</data>
</edge>
<edge source="86.0" target="81.0">
<data key="edgeid">355</data>
<data key="weight">1.0</data>
</edge>
<edge source="87.0" target="72.0">
<data key="edgeid">356</data>
<data key="weight">1.0</data>
</edge>
<edge source="87.0" target="74.0">
<data key="edgeid">357</data>
<data key="weight">1.0</data>
</edge>
<edge source="87.0" target="84.0">
<data key="edgeid">358</data>
<data key="weight">1.0</data>
</edge>
<edge source="87.0" target="83.0">
<data key="edgeid">359</data>
<data key="weight">1.0</data>
</edge>
<edge source="88.0" target="72.0">
<data key="edgeid">360</data>
<data key="weight">1.0</data>
</edge>
<edge source="88.0" target="74.0">
<data key="edgeid">361</data>
<data key="weight">1.0</data>
</edge>
<edge source="88.0" target="66.0">
<data key="edgeid">362</data>
<data key="weight">1.0</data>
</edge>
<edge source="88.0" target="84.0">
<data key="edgeid">363</data>
<data key="weight">1.0</data>
</edge>
<edge source="89.0" target="72.0">
<data key="edgeid">364</data>
<data key="weight">1.0</data>
</edge>
<edge source="89.0" target="73.0">
<data key="edgeid">365</data>
<data key="weight">1.0</data>
</edge>
<edge source="89.0" target="66.0">
<data key="edgeid">366</data>
<data key="weight">1.0</data>
</edge>
<edge source="89.0" target="84.0">
<data key="edgeid">367</data>
<data key="weight">1.0</data>
</edge>
<edge source="89.0" target="86.0">
<data key="edgeid">368</data>
<data key="weight">1.0</data>
</edge>
<edge source="89.0" target="88.0">
<data key="edgeid">369</data>
<data key="weight">1.0</data>
</edge>
<edge source="90.0" target="72.0">
<data key="edgeid">370</data>
<data key="weight">1.0</data>
</edge>
<edge source="90.0" target="66.0">
<data key="edgeid">371</data>
<data key="weight">1.0</data>
</edge>
<edge source="90.0" target="70.0">
<data key="edgeid">372</data>
<data key="weight">1.0</data>
</edge>
<edge source="91.0" target="72.0">
<data key="edgeid">373</data>
<data key="weight">1.0</data>
</edge>
<edge source="91.0" target="74.0">
<data key="edgeid">374</data>
<data key="weight">1.0</data>
</edge>
<edge source="91.0" target="75.0">
<data key="edgeid">375</data>
<data key="weight">1.0</data>
</edge>
<edge source="91.0" target="31.0">
<data key="edgeid">376</data>
<data key="weight">1.0</data>
</edge>
<edge source="91.0" target="90.0">
<data key="edgeid">377</data>
<data key="weight">1.0</data>
</edge>
<edge source="91.0" target="79.0">
<data key="edgeid">378</data>
<data key="weight">1.0</data>
</edge>
<edge source="92.0" target="72.0">
<data key="edgeid">379</data>
<data key="weight">1.0</data>
</edge>
<edge source="92.0" target="73.0">
<data key="edgeid">380</data>
<data key="weight">1.0</data>
</edge>
<edge source="92.0" target="75.0">
<data key="edgeid">381</data>
<data key="weight">1.0</data>
</edge>
<edge source="93.0" target="73.0">
<data key="edgeid">382</data>
<data key="weight">1.0</data>
</edge>
<edge source="93.0" target="66.0">
<data key="edgeid">383</data>
<data key="weight">1.0</data>
</edge>
<edge source="93.0" target="86.0">
<data key="edgeid">384</data>
<data key="weight">1.0</data>
</edge>
<edge source="93.0" target="30.0">
<data key="edgeid">385</data>
<data key="weight">1.0</data>
</edge>
<edge source="94.0" target="73.0">
<data key="edgeid">386</data>
<data key="weight">1.0</data>
</edge>
<edge source="94.0" target="84.0">
<data key="edgeid">387</data>
<data key="weight">1.0</data>
</edge>
<edge source="94.0" target="93.0">
<data key="edgeid">388</data>
<data key="weight">1.0</data>
</edge>
<edge source="95.0" target="73.0">
<data key="edgeid">389</data>
<data key="weight">1.0</data>
</edge>
<edge source="95.0" target="94.0">
<data key="edgeid">390</data>
<data key="weight">1.0</data>
</edge>
<edge source="95.0" target="61.0">
<data key="edgeid">391</data>
<data key="weight">1.0</data>
</edge>
<edge source="96.0" target="73.0">
<data key="edgeid">392</data>
<data key="weight">1.0</data>
</edge>
<edge source="96.0" target="66.0">
<data key="edgeid">393</data>
<data key="weight">1.0</data>
</edge>
<edge source="96.0" target="84.0">
<data key="edgeid">394</data>
<data key="weight">1.0</data>
</edge>
<edge source="96.0" target="94.0">
<data key="edgeid">395</data>
<data key="weight">1.0</data>
</edge>
<edge source="97.0" target="73.0">
<data key="edgeid">396</data>
<data key="weight">1.0</data>
</edge>
<edge source="97.0" target="66.0">
<data key="edgeid">397</data>
<data key="weight">1.0</data>
</edge>
<edge source="97.0" target="84.0">
<data key="edgeid">398</data>
<data key="weight">1.0</data>
</edge>
<edge source="97.0" target="86.0">
<data key="edgeid">399</data>
<data key="weight">1.0</data>
</edge>
<edge source="97.0" target="96.0">
<data key="edgeid">400</data>
<data key="weight">1.0</data>
</edge>
<edge source="97.0" target="81.0">
<data key="edgeid">401</data>
<data key="weight">1.0</data>
</edge>
<edge source="98.0" target="73.0">
<data key="edgeid">402</data>
<data key="weight">1.0</data>
</edge>
<edge source="98.0" target="74.0">
<data key="edgeid">403</data>
<data key="weight">1.0</data>
</edge>
<edge source="98.0" target="87.0">
<data key="edgeid">404</data>
<data key="weight">1.0</data>
</edge>
<edge source="98.0" target="91.0">
<data key="edgeid">405</data>
<data key="weight">1.0</data>
</edge>
<edge source="99.0" target="73.0">
<data key="edgeid">406</data>
<data key="weight">1.0</data>
</edge>
<edge source="99.0" target="74.0">
<data key="edgeid">407</data>
<data key="weight">1.0</data>
</edge>
<edge source="99.0" target="66.0">
<data key="edgeid">408</data>
<data key="weight">1.0</data>
</edge>
<edge source="99.0" target="84.0">
<data key="edgeid">409</data>
<data key="weight">1.0</data>
</edge>
<edge source="99.0" target="93.0">
<data key="edgeid">410</data>
<data key="weight">1.0</data>
</edge>
<edge source="99.0" target="60.0">
<data key="edgeid">411</data>
<data key="weight">1.0</data>
</edge>
<edge source="99.0" target="59.0">
<data key="edgeid">412</data>
<data key="weight">1.0</data>
</edge>
<edge source="99.0" target="30.0">
<data key="edgeid">413</data>
<data key="weight">1.0</data>
</edge>
<edge source="99.0" target="62.0">
<data key="edgeid">414</data>
<data key="weight">1.0</data>
</edge>
<edge source="99.0" target="63.0">
<data key="edgeid">415</data>
<data key="weight">1.0</data>
</edge>
<edge source="99.0" target="90.0">
<data key="edgeid">416</data>
<data key="weight">1.0</data>
</edge>
<edge source="100.0" target="73.0">
<data key="edgeid">417</data>
<data key="weight">1.0</data>
</edge>
<edge source="100.0" target="66.0">
<data key="edgeid">418</data>
<data key="weight">1.0</data>
</edge>
<edge source="100.0" target="84.0">
<data key="edgeid">419</data>
<data key="weight">1.0</data>
</edge>
<edge source="100.0" target="86.0">
<data key="edgeid">420</data>
<data key="weight">1.0</data>
</edge>
<edge source="100.0" target="96.0">
<data key="edgeid">421</data>
<data key="weight">1.0</data>
</edge>
<edge source="100.0" target="98.0">
<data key="edgeid">422</data>
<data key="weight">1.0</data>
</edge>
<edge source="100.0" target="99.0">
<data key="edgeid">423</data>
<data key="weight">1.0</data>
</edge>
<edge source="100.0" target="62.0">
<data key="edgeid">424</data>
<data key="weight">1.0</data>
</edge>
<edge source="100.0" target="79.0">
<data key="edgeid">425</data>
<data key="weight">1.0</data>
</edge>
<edge source="100.0" target="91.0">
<data key="edgeid">426</data>
<data key="weight">1.0</data>
</edge>
<edge source="100.0" target="83.0">
<data key="edgeid">427</data>
<data key="weight">1.0</data>
</edge>
<edge source="101.0" target="84.0">
<data key="edgeid">428</data>
<data key="weight">1.0</data>
</edge>
<edge source="101.0" target="86.0">
<data key="edgeid">429</data>
<data key="weight">1.0</data>
</edge>
<edge source="101.0" target="94.0">
<data key="edgeid">430</data>
<data key="weight">1.0</data>
</edge>
<edge source="101.0" target="100.0">
<data key="edgeid">431</data>
<data key="weight">1.0</data>
</edge>
<edge source="101.0" target="61.0">
<data key="edgeid">432</data>
<data key="weight">1.0</data>
</edge>
<edge source="102.0" target="93.0">
<data key="edgeid">433</data>
<data key="weight">1.0</data>
</edge>
<edge source="102.0" target="94.0">
<data key="edgeid">434</data>
<data key="weight">1.0</data>
</edge>
<edge source="102.0" target="95.0">
<data key="edgeid">435</data>
<data key="weight">1.0</data>
</edge>
<edge source="102.0" target="46.0">
<data key="edgeid">436</data>
<data key="weight">1.0</data>
</edge>
<edge source="103.0" target="67.0">
<data key="edgeid">437</data>
<data key="weight">1.0</data>
</edge>
<edge source="104.0" target="67.0">
<data key="edgeid">438</data>
<data key="weight">1.0</data>
</edge>
<edge source="104.0" target="69.0">
<data key="edgeid">439</data>
<data key="weight">1.0</data>
</edge>
<edge source="104.0" target="103.0">
<data key="edgeid">440</data>
<data key="weight">1.0</data>
</edge>
</graph>
</graphml>
