0	http://web.archive.org/web/20160623054516/http://www.uow.edu.au:80/~bmartin/pubs/86sa.html
1	http://web.archive.org/web/20161010062057/http://atomicinsights.com/the-left-needs-to-reconsider-its-automatic-position-against-nuclear-energy/
2	http://web.archive.org/web/20170127104548/https://en.wikipedia.org/wiki/Nuclear_power_debate
3	http://web.archive.org/web/20160802090500/http://www.triplepundit.com:80/special/energy-options-pros-and-cons/nuclear-energy-pros-and-cons
4	http://web.archive.org/web/20170208214332/https://www.cleanenergywire.org/factsheets/history-behind-germanys-nuclear-phase-out
5	http://web.archive.org/web/20161110052015/https://en.wikipedia.org/wiki/Campaign_Against_Nuclear_Energy
6	http://web.archive.org/web/20150209215255/http://alternativeenergy.procon.org/view.answers.php?questionID=001270
7	http://web.archive.org/web/20160801192637/http://www.clearpictureonline.com:80/SO-Nuclear%20Power.html
8	http://web.archive.org/web/20160720150233/http://energyinformative.org:80/nuclear-energy-pros-and-cons/
9	http://web.archive.org/web/20160608110749/http://www.slate.com:80/articles/health_and_science/the_green_lantern/2010/07/the_nuclear_option.html
10	http://web.archive.org/web/20160724162935/http://www.cnduk.org:80/campaigns/nuclear-power
11	http://web.archive.org/web/20160627081957/http://debatepedia.idebate.org:80/en/index.php/Debate:_Nuclear_energy
12	http://web.archive.org/web/20160721050325/http://greenliving.lovetoknow.com:80/Advantages_and_Disadvantages_of_Nuclear_Energy
13	http://web.archive.org/web/20170128194758/http://www.nytimes.com/2012/02/26/opinion/sunday/sunday-dialogue-nuclear-energy-pro-and-con.html
14	http://web.archive.org/web/20160123173345/http://www.environmentalscience.org:80/nuclear-power-facts
15	http://web.archive.org/web/20160622214133/http://www.abc.net.au:80/btn/story/s4178056.htm
16	http://web.archive.org/web/20170128200518/http://www.greenpeace.org/international/en/campaigns/nuclear/
17	http://web.archive.org/web/20160408025329/http://www.scientificamerican.com:80/article/nuclear-power-must-make-a-comeback-for-climate-s-sake/
18	http://web.archive.org/web/20160702111824/http://thoriummsr.com:80/intro/pros-and-cons-list/
19	http://web.archive.org/web/20160718063846/http://www.conserve-energy-future.com:80/pros-and-cons-of-nuclear-energy.php
20	http://web.archive.org/web/20160716223743/http://www.world-nuclear.org:80/information-library/current-and-future-generation/the-nuclear-debate.aspx
21	http://web.archive.org/web/20160502145050/http://isreview.org:80/issue/77/case-against-nuclear-power
22	http://web.archive.org/web/20160815033728/http://www.ted.com:80/talks/debate_does_the_world_need_nuclear_energy
23	http://web.archive.org/web/20160829075722/http://www.wsj.com/articles/SB121432182593500119
24	http://web.archive.org/web/20160713200806/http://www.livescience.com:80/5227-energy-debates-nuclear-power.html
25	http://web.archive.org/web/20170128234253/https://futurism.com/theres-no-argument-against-nuclear-power/
26	http://web.archive.org/web/20160201044536/http://www.amazon.com:80/Nuclear-Power-Arguments-Controversial-Technology/dp/0393301281
27	http://web.archive.org/web/20170201015432/http://www.globalresearch.ca/reject-nuclear-power-heres-why/5321374
28	http://web.archive.org/web/20160910183256/http://caselaw.findlaw.com/us-supreme-court/460/766.html
29	http://web.archive.org/web/20161207054716/https://curiosity.com/topics/the-pros-and-cons-of-nuclear-power-l2cqsgAg/
30	http://web.archive.org/web/20100606142728/http://www.cnn.com:80/2010/OPINION/02/22/jacobson.nuclear.power.con/
31	http://web.archive.org/web/20160423080532/http://www.cnbc.com/2014/04/24/nuclear-energy-tries-to-win-over-environmental-skeptics.html
32	http://web.archive.org/web/20170126181408/http://www.gallup.com/poll/190064/first-time-majority-oppose-nuclear-energy.aspx
33	http://web.archive.org/web/20161206220444/http://www.apa.org/about/offices/ogc/amicus/nuclear.aspx
34	http://web.archive.org/web/20160707092634/http://timeforchange.org:80/pros-and-cons-of-nuclear-power-and-sustainability
35	http://web.archive.org/web/20130629174125/http://www.beyondnuclear.org:80/nuclear-power/2009/6/4/the-argument-against-nuclear-power.html
36	http://web.archive.org/web/20160730065520/http://www.nuclearpowerprocon.org:80/pop/coal.htm
37	http://web.archive.org/web/20061023150003/http://www.nuclearpowerprocon.org:80/
38	http://web.archive.org/web/20151118210356/http://www.slideshare.net:80/wintryblossom/nuclear-power-pros-and-cons
39	http://web.archive.org/web/20160819165722/http://theconversation.com/nuclear-power-deserves-a-level-playing-field-62149
40	http://web.archive.org/web/20161211172514/http://2016election.procon.org/view.answers.election.php?questionID=002113
41	http://web.archive.org/web/20170118021822/http://fukushimawatch.com/2015-11-30-six-reasons-to-oppose-nuclear-power.html
42	http://web.archive.org/web/20170220101124/http://www.france24.com/en/20161127-switzerland-nuclear-energy-swiss-referendum-reject-speedy-exit-atomic-power
43	http://web.archive.org/web/20160622001940/http://www.latimes.com/opinion/readersreact/la-le-1117-tuesday-cliamte-change-nuclear-20151117-story.html
44	http://web.archive.org/web/20160519213704/http://www.debatingeurope.eu:80/focus/infobox-arguments-for-and-against-nuclear/
45	http://web.archive.org/web/20170209230327/http://www.sciencemag.org/news/2017/02/nuclear-power-industry-revamps-climate-pitch-trump-era
46	http://web.archive.org/web/20160612054234/http://politicalaffairs.net:80/power-argument-the-need-for-nuclear-energy
47	http://web.archive.org/web/20170206212230/http://science.howstuffworks.com/nuclear-power4.htm
48	http://web.archive.org/web/20161208223138/http://www.dw.com/en/exit-polls-show-swiss-voting-against-quick-nuclear-power-exit/a-36541287
49	http://web.archive.org/web/20170128012129/https://www.climate.gov/climate-and-energy-topics/nuclear-energy
