<?xml version="1.0" standalone="no"?>
<!DOCTYPE svg PUBLIC "-//W3C//DTD SVG 1.1//EN" "http://www.w3.org/Graphics/SVG/1.1/DTD/svg11.dtd">
  <svg width="3269.6124999999997" height="2737.6000000000004" viewBox="-40, -40, 3309.6124999999997, 2777.6000000000004" version="1.1" xmlns="http://www.w3.org/2000/svg">
  <defs>
    <marker id="arrow" markerUnits="strokeWidth" markerWidth="13.440000000000001" markerHeight="13.440000000000001" viewBox="0 0 13.440000000000001 13.440000000000001" refX="6.720000000000001" refY="0">
      <polyline fill="none" stroke="purple" stroke-width="1" points="0,13.440000000000001,6.720000000000001,0,13.440000000000001,13.440000000000001" />
    </marker>
    <marker id="arrowSolid" viewBox="0 0 10 10" refX="5" refY="5" markerWidth="8.4" markerHeight="8.4" orient="auto-start-reverse">
      <path d="M 0 0 L 10 5 L 0 10 z" stroke="black"/>
    </marker>
    <pattern id="hatchBlack" x="10" y="10" width="10" height="10" patternUnits="userSpaceOnUse" patternTransform="rotate(45)">
      <line x1="0" y="0" x2="0" y2="10" stroke="black" stroke-width="4"></line>
    </pattern>
    <pattern id="hatchForNode" x="10" y="10" width="10" height="10" patternUnits="userSpaceOnUse" patternTransform="rotate(45)">
      <line x1="0" y="0" x2="0" y2="10" stroke="blue" stroke-width="4"></line>
    </pattern>
    <pattern id="hatchForLeaf" x="10" y="10" width="10" height="10" patternUnits="userSpaceOnUse" patternTransform="rotate(45)">
      <line x1="0" y="0" x2="0" y2="10" stroke="green" stroke-width="4"></line>
    </pattern>
  </defs>
<rect x="-40" y="-40" width="3309.6124999999997" height="2777.6000000000004" stroke="none" fill="white" />"
<text white-space='pre' alignment-baseline='text-top' style='fill: blue; font-size: 64px;' x='688.0955810546875' y='132.0'><tspan x='688.0955810546875' y='132.0' style="" text-decoration="" font-family="'Noto Serif', 'Noto Serif JP', OpenMoji, 'OpenMoji Color', 'OpenMoji Black', serif">S</tspan>
</text>
<text white-space='pre' alignment-baseline='text-top' style='fill: blue; font-size: 64px;' x='233.41718750000007' y='431.2'><tspan x='233.41718750000007' y='431.2' style="" text-decoration="" font-family="'Noto Serif', 'Noto Serif JP', OpenMoji, 'OpenMoji Color', 'OpenMoji Black', serif">NPi</tspan>
</text>
<text white-space='pre' alignment-baseline='text-top' style='fill: blue; font-size: 64px;' x='40.17812500000002' y='730.4'><tspan x='40.17812500000002' y='730.4' style="" text-decoration="" font-family="'Noto Serif', 'Noto Serif JP', OpenMoji, 'OpenMoji Color', 'OpenMoji Black', serif">AdvP</tspan>
</text>
<text white-space='pre' alignment-baseline='text-top' style='fill: green; font-size: 64px;' x='33.60000000000002' y='1029.6'><tspan x='33.60000000000002' y='1029.6' style="" text-decoration="" font-family="'Noto Serif', 'Noto Serif JP', OpenMoji, 'OpenMoji Color', 'OpenMoji Black', serif">Many</tspan>
</text>
<text white-space='pre' alignment-baseline='text-top' style='fill: blue; font-size: 64px;' x='430.1562500000001' y='730.4'><tspan x='430.1562500000001' y='730.4' style="" text-decoration="" font-family="'Noto Serif', 'Noto Serif JP', OpenMoji, 'OpenMoji Color', 'OpenMoji Black', serif">N</tspan>
</text>
<text white-space='pre' alignment-baseline='text-top' style='fill: green; font-size: 64px;' x='341.1562500000001' y='1029.6'><tspan x='341.1562500000001' y='1029.6' style="" text-decoration="" font-family="'Noto Serif', 'Noto Serif JP', OpenMoji, 'OpenMoji Color', 'OpenMoji Black', serif">women</tspan>
</text>
<text white-space='pre' alignment-baseline='text-top' style='fill: blue; font-size: 64px;' x='1095.2739746093748' y='431.2'><tspan x='1095.2739746093748' y='431.2' style="" text-decoration="" font-family="'Noto Serif', 'Noto Serif JP', OpenMoji, 'OpenMoji Color', 'OpenMoji Black', serif">V'</tspan>
</text>
<text white-space='pre' alignment-baseline='text-top' style='fill: blue; font-size: 64px;' x='748.2046875' y='730.4'><tspan x='748.2046875' y='730.4' style="" text-decoration="" font-family="'Noto Serif', 'Noto Serif JP', OpenMoji, 'OpenMoji Color', 'OpenMoji Black', serif">V</tspan>
</text>
<text white-space='pre' alignment-baseline='text-top' style='fill: green; font-size: 64px;' x='702.55625' y='1029.6'><tspan x='702.55625' y='1029.6' style="" text-decoration="" font-family="'Noto Serif', 'Noto Serif JP', OpenMoji, 'OpenMoji Color', 'OpenMoji Black', serif">seek</tspan>
</text>
<text white-space='pre' alignment-baseline='text-top' style='fill: blue; font-size: 64px;' x='1433.74169921875' y='730.4'><tspan x='1433.74169921875' y='730.4' style="" text-decoration="" font-family="'Noto Serif', 'Noto Serif JP', OpenMoji, 'OpenMoji Color', 'OpenMoji Black', serif">NP</tspan>
</text>
<text white-space='pre' alignment-baseline='text-top' style='fill: blue; font-size: 64px;' x='1092.9562499999997' y='1029.6'><tspan x='1092.9562499999997' y='1029.6' style="" text-decoration="" font-family="'Noto Serif', 'Noto Serif JP', OpenMoji, 'OpenMoji Color', 'OpenMoji Black', serif">N</tspan>
</text>
<text white-space='pre' alignment-baseline='text-top' style='fill: green; font-size: 64px;' x='971.4562499999997' y='1328.8000000000002'><tspan x='971.4562499999997' y='1328.8000000000002' style="" text-decoration="" font-family="'Noto Serif', 'Noto Serif JP', OpenMoji, 'OpenMoji Color', 'OpenMoji Black', serif">abortions</tspan>
</text>
<text white-space='pre' alignment-baseline='text-top' style='fill: blue; font-size: 64px;' x='1799.0271484374998' y='1029.6'><tspan x='1799.0271484374998' y='1029.6' style="" text-decoration="" font-family="'Noto Serif', 'Noto Serif JP', OpenMoji, 'OpenMoji Color', 'OpenMoji Black', serif">CP</tspan>
</text>
<text white-space='pre' alignment-baseline='text-top' style='fill: blue; font-size: 64px;' x='1500.3562499999998' y='1328.8000000000002'><tspan x='1500.3562499999998' y='1328.8000000000002' style="" text-decoration="" font-family="'Noto Serif', 'Noto Serif JP', OpenMoji, 'OpenMoji Color', 'OpenMoji Black', serif">C</tspan>
</text>
<text white-space='pre' alignment-baseline='text-top' style='fill: green; font-size: 64px;' x='1397.8562499999998' y='1628.0000000000002'><tspan x='1397.8562499999998' y='1628.0000000000002' style="" text-decoration="" font-family="'Noto Serif', 'Noto Serif JP', OpenMoji, 'OpenMoji Color', 'OpenMoji Black', serif">because</tspan>
</text>
<text white-space='pre' alignment-baseline='text-top' style='fill: blue; font-size: 64px;' x='2102.198046875' y='1328.8000000000002'><tspan x='2102.198046875' y='1328.8000000000002' style="" text-decoration="" font-family="'Noto Serif', 'Noto Serif JP', OpenMoji, 'OpenMoji Color', 'OpenMoji Black', serif">NPi</tspan>
</text>
<text white-space='pre' alignment-baseline='text-top' style='fill: blue; font-size: 64px;' x='1837.25625' y='1628.0000000000002'><tspan x='1837.25625' y='1628.0000000000002' style="" text-decoration="" font-family="'Noto Serif', 'Noto Serif JP', OpenMoji, 'OpenMoji Color', 'OpenMoji Black', serif">N</tspan>
</text>
<text white-space='pre' alignment-baseline='text-top' style='fill: green; font-size: 64px;' x='1776.25625' y='1927.2000000000003'><tspan x='1776.25625' y='1927.2000000000003' style="" text-decoration="" font-family="'Noto Serif', 'Noto Serif JP', OpenMoji, 'OpenMoji Color', 'OpenMoji Black', serif">they<tspan style='fill:none;'>￭</tspan></tspan>
</text>
<text white-space='pre' alignment-baseline='text-top' style='fill: blue; font-size: 64px;' x='2409.6398437499997' y='1628.0000000000002'><tspan x='2409.6398437499997' y='1628.0000000000002' style="" text-decoration="" font-family="'Noto Serif', 'Noto Serif JP', OpenMoji, 'OpenMoji Color', 'OpenMoji Black', serif">VP</tspan>
</text>
<text white-space='pre' alignment-baseline='text-top' style='fill: blue; font-size: 64px;' x='2110.0546875' y='1927.2000000000003'><tspan x='2110.0546875' y='1927.2000000000003' style="" text-decoration="" font-family="'Noto Serif', 'Noto Serif JP', OpenMoji, 'OpenMoji Color', 'OpenMoji Black', serif">V</tspan>
</text>
<text white-space='pre' alignment-baseline='text-top' style='fill: green; font-size: 64px;' x='2081.65625' y='2226.4000000000005'><tspan x='2081.65625' y='2226.4000000000005' style="" text-decoration="" font-family="'Noto Serif', 'Noto Serif JP', OpenMoji, 'OpenMoji Color', 'OpenMoji Black', serif">are</tspan>
</text>
<text white-space='pre' alignment-baseline='text-top' style='fill: blue; font-size: 64px;' x='2727.6234375' y='1927.2000000000003'><tspan x='2727.6234375' y='1927.2000000000003' style="" text-decoration="" font-family="'Noto Serif', 'Noto Serif JP', OpenMoji, 'OpenMoji Color', 'OpenMoji Black', serif">AP</tspan>
</text>
<text white-space='pre' alignment-baseline='text-top' style='fill: blue; font-size: 64px;' x='2450.0328124999996' y='2226.4000000000005'><tspan x='2450.0328124999996' y='2226.4000000000005' style="" text-decoration="" font-family="'Noto Serif', 'Noto Serif JP', OpenMoji, 'OpenMoji Color', 'OpenMoji Black', serif">ADV</tspan>
</text>
<text white-space='pre' alignment-baseline='text-top' style='fill: green; font-size: 64px;' x='2316.0562499999996' y='2525.6000000000004'><tspan x='2316.0562499999996' y='2525.6000000000004' style="" text-decoration="" font-family="'Noto Serif', 'Noto Serif JP', OpenMoji, 'OpenMoji Color', 'OpenMoji Black', serif">economically</tspan>
</text>
<text white-space='pre' alignment-baseline='text-top' style='fill: blue; font-size: 64px;' x='2964.1124999999997' y='2226.4000000000005'><tspan x='2964.1124999999997' y='2226.4000000000005' style="" text-decoration="" font-family="'Noto Serif', 'Noto Serif JP', OpenMoji, 'OpenMoji Color', 'OpenMoji Black', serif">ADJ</tspan>
</text>
<text white-space='pre' alignment-baseline='text-top' style='fill: green; font-size: 64px;' x='2853.6124999999997' y='2525.6000000000004'><tspan x='2853.6124999999997' y='2525.6000000000004' style="" text-decoration="" font-family="'Noto Serif', 'Noto Serif JP', OpenMoji, 'OpenMoji Color', 'OpenMoji Black', serif">disparaged</tspan>
</text>
<line style='stroke:black; stroke-width:2;' x1='287.41718750000007' y1='321.2' x2='705.5955810546875' y2='187.0' />
<line style='stroke:black; stroke-width:2;' x1='1123.7739746093748' y1='321.2' x2='705.5955810546875' y2='187.0' />
<line style='stroke:black; stroke-width:2;' x1='120.17812500000002' y1='620.4' x2='287.41718750000007' y2='486.2' />
<line style='stroke:black; stroke-width:2;' x1='454.6562500000001' y1='620.4' x2='287.41718750000007' y2='486.2' />
<line style='stroke:black; stroke-width:2;' x1='120.17812500000002' y1='919.6' x2='120.17812500000002' y2='785.4' />
<line style='stroke:black; stroke-width:2;' x1='454.6562500000001' y1='919.6' x2='454.6562500000001' y2='785.4' />
<line style='stroke:black; stroke-width:2;' x1='769.80625' y1='620.4' x2='1123.7739746093748' y2='486.2' />
<line style='stroke:black; stroke-width:2;' x1='1477.74169921875' y1='620.4' x2='1123.7739746093748' y2='486.2' />
<line style='stroke:black; stroke-width:2;' x1='769.80625' y1='919.6' x2='769.80625' y2='785.4' />
<line style='stroke:black; stroke-width:2;' x1='1117.4562499999997' y1='919.6' x2='1477.74169921875' y2='785.4' />
<line style='stroke:black; stroke-width:2;' x1='1838.0271484374998' y1='919.6' x2='1477.74169921875' y2='785.4' />
<line style='stroke:black; stroke-width:2;' x1='1117.4562499999997' y1='1218.8000000000002' x2='1117.4562499999997' y2='1084.6' />
<line style='stroke:black; stroke-width:2;' x1='1519.8562499999998' y1='1218.8000000000002' x2='1838.0271484374998' y2='1084.6' />
<line style='stroke:black; stroke-width:2;' x1='2156.198046875' y1='1218.8000000000002' x2='1838.0271484374998' y2='1084.6' />
<line style='stroke:black; stroke-width:2;' x1='1519.8562499999998' y1='1518.0000000000002' x2='1519.8562499999998' y2='1383.8000000000002' />
<line style='stroke:black; stroke-width:2;' x1='1861.75625' y1='1518.0000000000002' x2='2156.198046875' y2='1383.8000000000002' />
<line style='stroke:black; stroke-width:2;' x1='2450.6398437499997' y1='1518.0000000000002' x2='2156.198046875' y2='1383.8000000000002' />
<polygon style='fill: none; stroke: black; stroke-width:2;' points='1776.25625 1817.2000000000003 1947.25625 1817.2000000000003 1861.75625 1683.0000000000002' />
<line style='stroke:black; stroke-width:2;' x1='2131.65625' y1='1817.2000000000003' x2='2450.6398437499997' y2='1683.0000000000002' />
<line style='stroke:black; stroke-width:2;' x1='2769.6234375' y1='1817.2000000000003' x2='2450.6398437499997' y2='1683.0000000000002' />
<line style='stroke:black; stroke-width:2;' x1='2131.65625' y1='2116.4000000000005' x2='2131.65625' y2='1982.2000000000003' />
<line style='stroke:black; stroke-width:2;' x1='2517.6343749999996' y1='2116.4000000000005' x2='2769.6234375' y2='1982.2000000000003' />
<line style='stroke:black; stroke-width:2;' x1='3021.6124999999997' y1='2116.4000000000005' x2='2769.6234375' y2='1982.2000000000003' />
<line style='stroke:black; stroke-width:2;' x1='2517.6343749999996' y1='2415.6000000000004' x2='2517.6343749999996' y2='2281.4000000000005' />
<line style='stroke:black; stroke-width:2;' x1='3021.6124999999997' y1='2415.6000000000004' x2='3021.6124999999997' y2='2281.4000000000005' />
<line x1='1861.75625' y1='1982.2000000000003' x2='1861.75625' y2='2657.6000000000004' style='fill: none; stroke: purple; stroke-width:2'  />
<line x1='1861.75625' y1='1982.2000000000003' x2='1861.75625' y2='2657.6000000000004' style='fill: none; stroke: purple; stroke-width:2'  />
<line x1='1861.75625' y1='2657.6000000000004' x2='454.6562500000001' y2='2657.6000000000004' style='fill: none; stroke: purple; stroke-width:2'  />
<line x1='454.6562500000001' y1='2657.6000000000004' x2='454.6562500000001' y2='1084.6' style='fill: none; stroke: purple; stroke-width:2'  marker-end='url(#arrow)' /></svg>