%YAML 1.1
%TAG !u! tag:unity3d.com,2011:
--- !u!114 &11400000
MonoBehaviour:
  m_ObjectHideFlags: 0
  m_PrefabParentObject: {fileID: 0}
  m_PrefabInternal: {fileID: 0}
  m_GameObject: {fileID: 0}
  m_Enabled: 1
  m_EditorHideFlags: 0
  m_Script: {fileID: 11500000, guid: a8d342d38ae103540966b0e54b202c36, type: 3}
  m_Name: RainbowFoldersSettings
  m_EditorClassIdentifier: 
  Folders:
  - Type: 0
    Key: Audio
    IsRecursive: 0
    SmallIcon: {fileID: 2800000, guid: 4372cfb8a7d3b5b4d9b899147b193270, type: 3}
    LargeIcon: {fileID: 2800000, guid: 65e13c9890ffa26478506eda78683d5c, type: 3}
  - Type: 0
    Key: Editor
    IsRecursive: 0
    SmallIcon: {fileID: 2800000, guid: ec2951dbd8c22234c8fdf92529d860fd, type: 3}
    LargeIcon: {fileID: 2800000, guid: ad4412933c34d994a9a6daafb8202f4a, type: 3}
  - Type: 1
    Key: Assets/Editor/Data
    IsRecursive: 0
    SmallIcon: {fileID: 2800000, guid: 8d50cf779e5b4f54a831bdefc32b044c, type: 3}
    LargeIcon: {fileID: 2800000, guid: 5c32cf9ad519d0c4aacb16805c45eab3, type: 3}
  - Type: 0
    Key: Extensions
    IsRecursive: 0
    SmallIcon: {fileID: 2800000, guid: 0a498e8f7fbcbef4db91d2d411e3f70f, type: 3}
    LargeIcon: {fileID: 2800000, guid: b88339035f924f94eab1e64bac79149f, type: 3}
  - Type: 0
    Key: Fonts
    IsRecursive: 0
    SmallIcon: {fileID: 2800000, guid: 163b4b589845fee47ac105cdfb911b77, type: 3}
    LargeIcon: {fileID: 2800000, guid: 87a78956e37a460439f1871712ce87fc, type: 3}
  - Type: 0
    Key: Icons
    IsRecursive: 0
    SmallIcon: {fileID: 2800000, guid: c7fff8d7beb81fd4ebdd8693523164a5, type: 3}
    LargeIcon: {fileID: 2800000, guid: dec1526a9b39c934a8e390a67c5f949e, type: 3}
  - Type: 0
    Key: Materials
    IsRecursive: 0
    SmallIcon: {fileID: 2800000, guid: 0508340b76cfbdd43826ca620f578abd, type: 3}
    LargeIcon: {fileID: 2800000, guid: a4decc2460e61e44b9ccd3d2d248738b, type: 3}
  - Type: 0
    Key: Meshes
    IsRecursive: 0
    SmallIcon: {fileID: 2800000, guid: 268edea26d8cd504da659cc71a1d8549, type: 3}
    LargeIcon: {fileID: 2800000, guid: e69e4447e8078c441b3a955855f4f080, type: 3}
  - Type: 0
    Key: Plugins
    IsRecursive: 0
    SmallIcon: {fileID: 2800000, guid: 8f45cff1df9688244b1fa6e2da91e05f, type: 3}
    LargeIcon: {fileID: 2800000, guid: 15c3471930a7ff44aa9a30bc21a5ea06, type: 3}
  - Type: 0
    Key: Prefabs
    IsRecursive: 0
    SmallIcon: {fileID: 2800000, guid: 483d693b3f9d5704b89409016b40bc74, type: 3}
    LargeIcon: {fileID: 2800000, guid: fac7470563f79024ebc244b39080448d, type: 3}
  - Type: 0
    Key: Project
    IsRecursive: 0
    SmallIcon: {fileID: 2800000, guid: 36e0a02c0316e0b40bd7ffc8eb437a7f, type: 3}
    LargeIcon: {fileID: 2800000, guid: ce20e3678b7748244854c06fcd7d7d00, type: 3}
  - Type: 0
    Key: RainbowFolders
    IsRecursive: 0
    SmallIcon: {fileID: 2800000, guid: 8d50cf779e5b4f54a831bdefc32b044c, type: 3}
    LargeIcon: {fileID: 2800000, guid: 5c32cf9ad519d0c4aacb16805c45eab3, type: 3}
  - Type: 0
    Key: Resources
    IsRecursive: 0
    SmallIcon: {fileID: 2800000, guid: 97efd597cd18c564aadb45280476b23a, type: 3}
    LargeIcon: {fileID: 2800000, guid: 650a564eae901434e86dcb456fcc046a, type: 3}
  - Type: 0
    Key: Scenes
    IsRecursive: 0
    SmallIcon: {fileID: 2800000, guid: 40ff06f7c381dcf4391ca8342d04260c, type: 3}
    LargeIcon: {fileID: 2800000, guid: f9d86cd8e960f584a9aa5a8ee61c4115, type: 3}
  - Type: 0
    Key: Scripts
    IsRecursive: 0
    SmallIcon: {fileID: 2800000, guid: ed89c5b2588683046989a2a138f3b343, type: 3}
    LargeIcon: {fileID: 2800000, guid: 9fca1a811da70484494d9e10d46e0636, type: 3}
  - Type: 0
    Key: Shaders
    IsRecursive: 0
    SmallIcon: {fileID: 2800000, guid: 015a543b4163bfa498964b0db1004815, type: 3}
    LargeIcon: {fileID: 2800000, guid: fe053ca6ee802d5478277554f1b356d5, type: 3}
  - Type: 0
    Key: Terrains
    IsRecursive: 0
    SmallIcon: {fileID: 2800000, guid: c75be7d9cde129149bb04f51d452d85a, type: 3}
    LargeIcon: {fileID: 2800000, guid: 4716b9cfe49343c499142d04bb004e0b, type: 3}
  - Type: 0
    Key: Textures
    IsRecursive: 0
    SmallIcon: {fileID: 2800000, guid: 27bb0c12d809b1e4fb2851723d50cde6, type: 3}
    LargeIcon: {fileID: 2800000, guid: f61940b61bdca1843bed2dbc93de9038, type: 3}
  - Type: 0
    Key: Android
    IsRecursive: 0
    SmallIcon: {fileID: 2800000, guid: 6858fce162a9b4744baedb1357e0b690, type: 3}
    LargeIcon: {fileID: 2800000, guid: c1e5c2a549b1b8048a04987738bb9c52, type: 3}
  - Type: 0
    Key: iOS
    IsRecursive: 0
    SmallIcon: {fileID: 2800000, guid: 25e93be6802c63c408e62e4bdfa4e91f, type: 3}
    LargeIcon: {fileID: 2800000, guid: 6888916ad986e2944a731fd320e5f566, type: 3}
  - Type: 0
    Key: Windows
    IsRecursive: 0
    SmallIcon: {fileID: 2800000, guid: 277aff0709e51d2418b61f0c82cb277f, type: 3}
    LargeIcon: {fileID: 2800000, guid: c34025bbb220b844a8e633a414c63632, type: 3}
  - Type: 0
    Key: Mac
    IsRecursive: 0
    SmallIcon: {fileID: 2800000, guid: 54a92a89ce169714a9a00aebb271cdd6, type: 3}
    LargeIcon: {fileID: 2800000, guid: 80ea8e29a9c225e4291234d6ba25a868, type: 3}
  - Type: 0
    Key: WebGL
    IsRecursive: 0
    SmallIcon: {fileID: 2800000, guid: b8e8a328d6527a14783473666c1f8a08, type: 3}
    LargeIcon: {fileID: 2800000, guid: 010e6d817952d434197d318f48b2f16a, type: 3}
  - Type: 0
    Key: VSCode
    IsRecursive: 0
    SmallIcon: {fileID: 2800000, guid: 5b28a8adf7de265498bab91c061d53f6, type: 3}
    LargeIcon: {fileID: 2800000, guid: 0700fc5bee11896448a6a152aba8927c, type: 3}
  - Type: 0
    Key: Content
    IsRecursive: 0
    SmallIcon: {fileID: 2800000, guid: 8fa6946e38e6c6a4199ac8cf27fcb73f, type: 3}
    LargeIcon: {fileID: 2800000, guid: 250d670033ed09c47945f9b799491ff5, type: 3}
  - Type: 0
    Key: Splashes
    IsRecursive: 0
    SmallIcon: {fileID: 2800000, guid: 8bbf3a247765b5d4abf260b69a187680, type: 3}
    LargeIcon: {fileID: 2800000, guid: ca91fe7cb9b9d084b8e6e068612d5650, type: 3}
  - Type: 0
    Key: Atlases
    IsRecursive: 0
    SmallIcon: {fileID: 2800000, guid: 127a902a1b0c8bb4eaac39b3768193c7, type: 3}
    LargeIcon: {fileID: 2800000, guid: 92dde0e2ba189fb4899ba4d06ed2541c, type: 3}
  - Type: 1
    Key: Assets/Scenes/Dialogs
    IsRecursive: 0
    SmallIcon: {fileID: 2800000, guid: 40ff06f7c381dcf4391ca8342d04260c, type: 3}
    LargeIcon: {fileID: 2800000, guid: f9d86cd8e960f584a9aa5a8ee61c4115, type: 3}
  - Type: 0
    Key: Hive
    IsRecursive: 0
    SmallIcon: {fileID: 2800000, guid: 0bea1088f036c6a4ba764766de12eb14, type: 3}
    LargeIcon: {fileID: 2800000, guid: ee66fb803256f7f45ac222ab7318da5a, type: 3}
  - Type: 0
    Key: HiveData
    IsRecursive: 0
    SmallIcon: {fileID: 2800000, guid: ee17b1017d711094abbf0c5a4b1c6a69, type: 3}
    LargeIcon: {fileID: 2800000, guid: 52f39b4406ccd884f9c0d0c08d418aa1, type: 3}
  - Type: 0
    Key: Foundation
    IsRecursive: 0
    SmallIcon: {fileID: 2800000, guid: 36e0a02c0316e0b40bd7ffc8eb437a7f, type: 3}
    LargeIcon: {fileID: 2800000, guid: ce20e3678b7748244854c06fcd7d7d00, type: 3}
  - Type: 0
    Key: GooglePlay
    IsRecursive: 0
    SmallIcon: {fileID: 2800000, guid: 6858fce162a9b4744baedb1357e0b690, type: 3}
    LargeIcon: {fileID: 2800000, guid: c1e5c2a549b1b8048a04987738bb9c52, type: 3}
  - Type: 0
    Key: Appodeal
    IsRecursive: 0
    SmallIcon: {fileID: 2800000, guid: 6bb572e54e117b4439795d8abf1e2650, type: 3}
    LargeIcon: {fileID: 2800000, guid: 4c8bedc8471eb8646a9f08f4e3187ccd, type: 3}
  - Type: 0
    Key: AppsFlyer
    IsRecursive: 0
    SmallIcon: {fileID: 2800000, guid: cca05b303f574c94087d34080ac33285, type: 3}
    LargeIcon: {fileID: 2800000, guid: e5b37084b29634f4cad0bc13a6c632a6, type: 3}
  - Type: 0
    Key: Tapdaq
    IsRecursive: 0
    SmallIcon: {fileID: 2800000, guid: f2955e5592ea8284ea57cc4e61f48f00, type: 3}
    LargeIcon: {fileID: 2800000, guid: ebdd42c787a766a44a1b13c589d55b9b, type: 3}
  - Type: 0
    Key: GameAnalytics
    IsRecursive: 0
    SmallIcon: {fileID: 2800000, guid: ac5cecd9a42486b41906eb4c77816010, type: 3}
    LargeIcon: {fileID: 2800000, guid: 253bf2354e5a2b449ad8fa05752fc075, type: 3}
  - Type: 0
    Key: GameCenter
    IsRecursive: 0
    SmallIcon: {fileID: 2800000, guid: 35e7c023fa59304439cfaac6738318fa, type: 3}
    LargeIcon: {fileID: 2800000, guid: be2088afa4634fe47a827decef120126, type: 3}
  - Type: 0
    Key: InAppPurchases
    IsRecursive: 0
    SmallIcon: {fileID: 2800000, guid: 594d92335f136804ab7c607c75c9d086, type: 3}
    LargeIcon: {fileID: 2800000, guid: a34fa6f73701dff4780557a2565ca85d, type: 3}
  - Type: 0
    Key: Animations
    IsRecursive: 0
    SmallIcon: {fileID: 2800000, guid: b1e98621cdc23ef43b3f8eceee724586, type: 3}
    LargeIcon: {fileID: 2800000, guid: 1e8753beb9a5ed34f9cadcad5ec8c194, type: 3}
  - Type: 0
    Key: Particles
    IsRecursive: 0
    SmallIcon: {fileID: 2800000, guid: 348ba7bee537c7d41ada91fc37cc56bd, type: 3}
    LargeIcon: {fileID: 2800000, guid: 54d365c9dee329f458f0cf1353b1e925, type: 3}
  - Type: 0
    Key: Facebook
    IsRecursive: 0
    SmallIcon: {fileID: 2800000, guid: 80c254a1ff41f4747b9be709e38fe25b, type: 3}
    LargeIcon: {fileID: 2800000, guid: 9cf9ee4a93c42f240b9c8028ec3c39a9, type: 3}
  - Type: 0
    Key: UnityAds
    IsRecursive: 0
    SmallIcon: {fileID: 2800000, guid: 9639dcab26b17d34781dbe551b00ec09, type: 3}
    LargeIcon: {fileID: 2800000, guid: fc31bfeb69337144d9d927828c276748, type: 3}
