{
	"info": {
		"_postman_id": "f525ebaa-28d2-4041-9300-a50812f6d165",
		"name": "LibraryTA",
		"schema": "https://schema.getpostman.com/json/collection/v2.1.0/collection.json"
	},
	"item": [
		{
			"name": "user register",
			"request": {
				"method": "POST",
				"header": [],
				"body": {
					"mode": "formdata",
					"formdata": [
						{
							"key": "username",
							"value": "nadia",
							"type": "text"
						},
						{
							"key": "password",
							"value": "123",
							"type": "text"
						},
						{
							"key": "avatar",
							"type": "file",
							"src": []
						}
					]
				},
				"url": {
					"raw": "localhost:5000/api/v1/users/",
					"host": [
						"localhost"
					],
					"port": "5000",
					"path": [
						"api",
						"v1",
						"users",
						""
					]
				}
			},
			"response": [
				{
					"name": "user register",
					"originalRequest": {
						"method": "POST",
						"header": [],
						"body": {
							"mode": "formdata",
							"formdata": [
								{
									"key": "username",
									"value": "nadia",
									"type": "text"
								},
								{
									"key": "password",
									"value": "123",
									"type": "text"
								},
								{
									"key": "avatar",
									"type": "file",
									"src": []
								}
							],
							"options": {
								"raw": {
									"language": "json"
								}
							}
						},
						"url": {
							"raw": "localhost:5000/api/v1/users/",
							"host": [
								"localhost"
							],
							"port": "5000",
							"path": [
								"api",
								"v1",
								"users",
								""
							]
						}
					},
					"status": "Created",
					"code": 201,
					"_postman_previewlanguage": "json",
					"header": [
						{
							"key": "X-Powered-By",
							"value": "Express"
						},
						{
							"key": "Access-Control-Allow-Origin",
							"value": "*"
						},
						{
							"key": "Content-Type",
							"value": "application/json; charset=utf-8"
						},
						{
							"key": "Content-Length",
							"value": "41"
						},
						{
							"key": "ETag",
							"value": "W/\"29-nZBcU4EM82f1T737FHLPMqILiHM\""
						},
						{
							"key": "Date",
							"value": "Mon, 18 Oct 2021 22:48:49 GMT"
						},
						{
							"key": "Connection",
							"value": "keep-alive"
						},
						{
							"key": "Keep-Alive",
							"value": "timeout=5"
						}
					],
					"cookie": [],
					"body": "{\n    \"id\": 5,\n    \"username\": \"nadia\",\n    \"avatar\": null\n}"
				}
			]
		},
		{
			"name": "user login",
			"request": {
				"method": "POST",
				"header": [],
				"body": {
					"mode": "raw",
					"raw": "{\r\n    \"username\": \"nadia\",\r\n    \"password\": \"123\"\r\n}",
					"options": {
						"raw": {
							"language": "json"
						}
					}
				},
				"url": {
					"raw": "localhost:5000/api/v1/users/login",
					"host": [
						"localhost"
					],
					"port": "5000",
					"path": [
						"api",
						"v1",
						"users",
						"login"
					]
				}
			},
			"response": [
				{
					"name": "user login",
					"originalRequest": {
						"method": "POST",
						"header": [],
						"body": {
							"mode": "raw",
							"raw": "{\r\n    \"username\": \"nadia\",\r\n    \"password\": \"123\"\r\n}",
							"options": {
								"raw": {
									"language": "json"
								}
							}
						},
						"url": {
							"raw": "localhost:5000/api/v1/users/login",
							"host": [
								"localhost"
							],
							"port": "5000",
							"path": [
								"api",
								"v1",
								"users",
								"login"
							]
						}
					},
					"status": "OK",
					"code": 200,
					"_postman_previewlanguage": "json",
					"header": [
						{
							"key": "X-Powered-By",
							"value": "Express"
						},
						{
							"key": "Access-Control-Allow-Origin",
							"value": "*"
						},
						{
							"key": "Content-Type",
							"value": "application/json; charset=utf-8"
						},
						{
							"key": "Content-Length",
							"value": "195"
						},
						{
							"key": "ETag",
							"value": "W/\"c3-rzw/h0bP6ZOOuBQ++pmqf+TGK6M\""
						},
						{
							"key": "Date",
							"value": "Thu, 14 Oct 2021 19:46:23 GMT"
						},
						{
							"key": "Connection",
							"value": "keep-alive"
						},
						{
							"key": "Keep-Alive",
							"value": "timeout=5"
						}
					],
					"cookie": [],
					"body": "{\n    \"token\": \"eyJhbGciOiJIUzI1NiIsInR5cCI6IkpXVCJ9.eyJzdWIiOjMsInVzZXJuYW1lIjoibmFkaWEiLCJyb2xlIjoidXNlciIsImlhdCI6MTYzNDI0MDc4MywiZXhwIjoxNzIwNjQwNzgzfQ.JsNwLCVlvIfzxLDWRPrnyPgJNVM-bNMYqyA3n5HfajM\"\n}"
				},
				{
					"name": "user login",
					"originalRequest": {
						"method": "POST",
						"header": [],
						"body": {
							"mode": "raw",
							"raw": "{\r\n    \"username\": \"mincho\",\r\n    \"password\": \"123\"\r\n}",
							"options": {
								"raw": {
									"language": "json"
								}
							}
						},
						"url": {
							"raw": "localhost:5000/api/v1/users/login",
							"host": [
								"localhost"
							],
							"port": "5000",
							"path": [
								"api",
								"v1",
								"users",
								"login"
							]
						}
					},
					"status": "Not Found",
					"code": 404,
					"_postman_previewlanguage": "json",
					"header": [
						{
							"key": "X-Powered-By",
							"value": "Express"
						},
						{
							"key": "Access-Control-Allow-Origin",
							"value": "*"
						},
						{
							"key": "Content-Type",
							"value": "application/json; charset=utf-8"
						},
						{
							"key": "Content-Length",
							"value": "49"
						},
						{
							"key": "ETag",
							"value": "W/\"31-1JmRimMf0tdjUvzN6qHhPwGutBU\""
						},
						{
							"key": "Date",
							"value": "Mon, 18 Oct 2021 17:38:17 GMT"
						},
						{
							"key": "Connection",
							"value": "keep-alive"
						},
						{
							"key": "Keep-Alive",
							"value": "timeout=5"
						}
					],
					"cookie": [],
					"body": "{\n    \"message\": \"Record does not exist or is deleted\"\n}"
				}
			]
		},
		{
			"name": "user get",
			"request": {
				"auth": {
					"type": "bearer",
					"bearer": [
						{
							"key": "token",
							"value": "{{token}}",
							"type": "string"
						}
					]
				},
				"method": "GET",
				"header": [],
				"url": {
					"raw": "localhost:5000/api/v1/users/3",
					"host": [
						"localhost"
					],
					"port": "5000",
					"path": [
						"api",
						"v1",
						"users",
						"3"
					]
				}
			},
			"response": [
				{
					"name": "user get",
					"originalRequest": {
						"method": "GET",
						"header": [],
						"url": {
							"raw": "localhost:5000/api/v1/users/1",
							"host": [
								"localhost"
							],
							"port": "5000",
							"path": [
								"api",
								"v1",
								"users",
								"1"
							]
						}
					},
					"status": "OK",
					"code": 200,
					"_postman_previewlanguage": "json",
					"header": [
						{
							"key": "X-Powered-By",
							"value": "Express"
						},
						{
							"key": "Access-Control-Allow-Origin",
							"value": "*"
						},
						{
							"key": "Content-Type",
							"value": "application/json; charset=utf-8"
						},
						{
							"key": "Content-Length",
							"value": "180"
						},
						{
							"key": "ETag",
							"value": "W/\"b4-QUFiGzU7Rd4xbjPEldLruFwFBXw\""
						},
						{
							"key": "Date",
							"value": "Fri, 22 Oct 2021 14:34:50 GMT"
						},
						{
							"key": "Connection",
							"value": "keep-alive"
						},
						{
							"key": "Keep-Alive",
							"value": "timeout=5"
						}
					],
					"cookie": [],
					"body": "{\n    \"id\": 1,\n    \"username\": \"neo\",\n    \"role\": \"admin\",\n    \"avatar\": \"neo-avatar.png\",\n    \"points\": 146,\n    \"banstatus\": {\n        \"userId\": 1,\n        \"banned\": 1,\n        \"description\": \"Too many late returns\",\n        \"expiration\": 1633043760304\n    }\n}"
				},
				{
					"name": "user get",
					"originalRequest": {
						"method": "GET",
						"header": [],
						"url": {
							"raw": "localhost:5000/api/v1/users/3",
							"host": [
								"localhost"
							],
							"port": "5000",
							"path": [
								"api",
								"v1",
								"users",
								"3"
							]
						}
					},
					"status": "OK",
					"code": 200,
					"_postman_previewlanguage": "json",
					"header": [
						{
							"key": "X-Powered-By",
							"value": "Express"
						},
						{
							"key": "Access-Control-Allow-Origin",
							"value": "*"
						},
						{
							"key": "Content-Type",
							"value": "application/json; charset=utf-8"
						},
						{
							"key": "Content-Length",
							"value": "103"
						},
						{
							"key": "ETag",
							"value": "W/\"67-T0CecCVv0lNQrbmLxQqTAI+5BEU\""
						},
						{
							"key": "Date",
							"value": "Fri, 22 Oct 2021 14:40:00 GMT"
						},
						{
							"key": "Connection",
							"value": "keep-alive"
						},
						{
							"key": "Keep-Alive",
							"value": "timeout=5"
						}
					],
					"cookie": [],
					"body": "{\n    \"id\": 3,\n    \"username\": \"trinity\",\n    \"role\": \"user\",\n    \"avatar\": \"trinity-avatar.png\",\n    \"points\": 133,\n    \"banstatus\": null\n}"
				}
			]
		},
		{
			"name": "users get all",
			"request": {
				"auth": {
					"type": "bearer",
					"bearer": [
						{
							"key": "token",
							"value": "{{token}}",
							"type": "string"
						}
					]
				},
				"method": "GET",
				"header": [],
				"url": {
					"raw": "localhost:5000/api/v1/users",
					"host": [
						"localhost"
					],
					"port": "5000",
					"path": [
						"api",
						"v1",
						"users"
					]
				}
			},
			"response": [
				{
					"name": "users get all",
					"originalRequest": {
						"method": "GET",
						"header": [],
						"url": {
							"raw": "localhost:5000/api/v1/users",
							"host": [
								"localhost"
							],
							"port": "5000",
							"path": [
								"api",
								"v1",
								"users"
							]
						}
					},
					"status": "OK",
					"code": 200,
					"_postman_previewlanguage": "json",
					"header": [
						{
							"key": "X-Powered-By",
							"value": "Express"
						},
						{
							"key": "Access-Control-Allow-Origin",
							"value": "*"
						},
						{
							"key": "Content-Type",
							"value": "application/json; charset=utf-8"
						},
						{
							"key": "Content-Length",
							"value": "424"
						},
						{
							"key": "ETag",
							"value": "W/\"1a8-6pcSCPBmDYUMPS47WigOyN7qfoo\""
						},
						{
							"key": "Date",
							"value": "Fri, 22 Oct 2021 14:37:09 GMT"
						},
						{
							"key": "Connection",
							"value": "keep-alive"
						},
						{
							"key": "Keep-Alive",
							"value": "timeout=5"
						}
					],
					"cookie": [],
					"body": "[\n    {\n        \"id\": 1,\n        \"username\": \"neo\",\n        \"role\": \"admin\",\n        \"avatar\": \"neo-avatar.png\",\n        \"points\": 146\n    },\n    {\n        \"id\": 2,\n        \"username\": \"morpheus\",\n        \"role\": \"admin\",\n        \"avatar\": \"morpheus-avatar.png\",\n        \"points\": 123\n    },\n    {\n        \"id\": 3,\n        \"username\": \"trinity\",\n        \"role\": \"user\",\n        \"avatar\": \"trinity-avatar.png\",\n        \"points\": 133\n    },\n    {\n        \"id\": 4,\n        \"username\": \"mrsmith\",\n        \"role\": \"user\",\n        \"avatar\": \"private-eye.png\",\n        \"points\": 123\n    },\n    {\n        \"id\": 5,\n        \"username\": \"nadia\",\n        \"role\": \"user\",\n        \"avatar\": \"1634911949361.png\",\n        \"points\": 0\n    }\n]"
				}
			]
		},
		{
			"name": "user update",
			"request": {
				"auth": {
					"type": "bearer",
					"bearer": [
						{
							"key": "token",
							"value": "{{token}}",
							"type": "string"
						}
					]
				},
				"method": "PUT",
				"header": [],
				"body": {
					"mode": "formdata",
					"formdata": [
						{
							"key": "avatar",
							"type": "file",
							"src": "/C:/Users/nadezhda.hristova/OneDrive - Telerik Academy/Pictures/logo-js-avatar.png"
						}
					]
				},
				"url": {
					"raw": "localhost:5000/api/v1/users",
					"host": [
						"localhost"
					],
					"port": "5000",
					"path": [
						"api",
						"v1",
						"users"
					]
				}
			},
			"response": [
				{
					"name": "user update",
					"originalRequest": {
						"method": "PUT",
						"header": [],
						"body": {
							"mode": "formdata",
							"formdata": [
								{
									"key": "avatar",
									"type": "file",
									"src": "/C:/Users/nadezhda.hristova/OneDrive - Telerik Academy/Pictures/logo-js-avatar.png"
								}
							]
						},
						"url": {
							"raw": "localhost:5000/api/v1/users/",
							"host": [
								"localhost"
							],
							"port": "5000",
							"path": [
								"api",
								"v1",
								"users",
								""
							]
						}
					},
					"status": "OK",
					"code": 200,
					"_postman_previewlanguage": "json",
					"header": [
						{
							"key": "X-Powered-By",
							"value": "Express"
						},
						{
							"key": "Access-Control-Allow-Origin",
							"value": "*"
						},
						{
							"key": "Content-Type",
							"value": "application/json; charset=utf-8"
						},
						{
							"key": "Content-Length",
							"value": "177"
						},
						{
							"key": "ETag",
							"value": "W/\"b1-nj/dfrD5kw1kYGORZD9fpR/SYW8\""
						},
						{
							"key": "Date",
							"value": "Thu, 21 Oct 2021 11:48:59 GMT"
						},
						{
							"key": "Connection",
							"value": "keep-alive"
						},
						{
							"key": "Keep-Alive",
							"value": "timeout=5"
						}
					],
					"cookie": [],
					"body": "{\n    \"message\": \"Successfully updated user info, you need to log in again\",\n    \"user\": {\n        \"id\": 5,\n        \"username\": \"nadia\",\n        \"role\": \"user\",\n        \"avatar\": \"1634816939374.png\",\n        \"deleted\": 0,\n        \"banstatus\": null\n    }\n}"
				}
			]
		},
		{
			"name": "user logout",
			"request": {
				"auth": {
					"type": "bearer",
					"bearer": [
						{
							"key": "token",
							"value": "{{token}}",
							"type": "string"
						}
					]
				},
				"method": "POST",
				"header": [],
				"body": {
					"mode": "raw",
					"raw": "",
					"options": {
						"raw": {
							"language": "json"
						}
					}
				},
				"url": {
					"raw": "localhost:5000/api/v1/users/logout",
					"host": [
						"localhost"
					],
					"port": "5000",
					"path": [
						"api",
						"v1",
						"users",
						"logout"
					]
				}
			},
			"response": [
				{
					"name": "user logout",
					"originalRequest": {
						"method": "POST",
						"header": [],
						"body": {
							"mode": "raw",
							"raw": "",
							"options": {
								"raw": {
									"language": "json"
								}
							}
						},
						"url": {
							"raw": "localhost:5000/api/v1/users/logout",
							"host": [
								"localhost"
							],
							"port": "5000",
							"path": [
								"api",
								"v1",
								"users",
								"logout"
							]
						}
					},
					"status": "OK",
					"code": 200,
					"_postman_previewlanguage": "json",
					"header": [
						{
							"key": "X-Powered-By",
							"value": "Express"
						},
						{
							"key": "Access-Control-Allow-Origin",
							"value": "*"
						},
						{
							"key": "Content-Type",
							"value": "application/json; charset=utf-8"
						},
						{
							"key": "Content-Length",
							"value": "29"
						},
						{
							"key": "ETag",
							"value": "W/\"1d-WCC4NKAchvbWBnlOXtss/ZF7bk0\""
						},
						{
							"key": "Date",
							"value": "Thu, 14 Oct 2021 21:54:43 GMT"
						},
						{
							"key": "Connection",
							"value": "keep-alive"
						},
						{
							"key": "Keep-Alive",
							"value": "timeout=5"
						}
					],
					"cookie": [],
					"body": "{\n    \"message\": \"Log out success\"\n}"
				},
				{
					"name": "user logout",
					"originalRequest": {
						"method": "POST",
						"header": [],
						"body": {
							"mode": "raw",
							"raw": "",
							"options": {
								"raw": {
									"language": "json"
								}
							}
						},
						"url": {
							"raw": "localhost:5000/api/v1/users/logout",
							"host": [
								"localhost"
							],
							"port": "5000",
							"path": [
								"api",
								"v1",
								"users",
								"logout"
							]
						}
					},
					"status": "Bad Request",
					"code": 400,
					"_postman_previewlanguage": "json",
					"header": [
						{
							"key": "X-Powered-By",
							"value": "Express"
						},
						{
							"key": "Access-Control-Allow-Origin",
							"value": "*"
						},
						{
							"key": "Content-Type",
							"value": "application/json; charset=utf-8"
						},
						{
							"key": "Content-Length",
							"value": "32"
						},
						{
							"key": "ETag",
							"value": "W/\"20-5JVO3C/H078os4vMCiUgQsFd7oU\""
						},
						{
							"key": "Date",
							"value": "Mon, 18 Oct 2021 17:41:39 GMT"
						},
						{
							"key": "Connection",
							"value": "keep-alive"
						},
						{
							"key": "Keep-Alive",
							"value": "timeout=5"
						}
					],
					"cookie": [],
					"body": "{\n    \"message\": \"User not signed in\"\n}"
				}
			]
		},
		{
			"name": "books  all",
			"request": {
				"auth": {
					"type": "bearer",
					"bearer": [
						{
							"key": "token",
							"value": "{{token}}",
							"type": "string"
						}
					]
				},
				"method": "GET",
				"header": [],
				"url": {
					"raw": "localhost:5000/api/v1/books",
					"host": [
						"localhost"
					],
					"port": "5000",
					"path": [
						"api",
						"v1",
						"books"
					]
				}
			},
			"response": [
				{
					"name": "books  all",
					"originalRequest": {
						"method": "GET",
						"header": [],
						"url": {
							"raw": "localhost:5000/api/v1/books",
							"host": [
								"localhost"
							],
							"port": "5000",
							"path": [
								"api",
								"v1",
								"books"
							]
						}
					},
					"status": "OK",
					"code": 200,
					"_postman_previewlanguage": "json",
					"header": [
						{
							"key": "X-Powered-By",
							"value": "Express"
						},
						{
							"key": "Access-Control-Allow-Origin",
							"value": "*"
						},
						{
							"key": "Content-Type",
							"value": "application/json; charset=utf-8"
						},
						{
							"key": "Content-Length",
							"value": "854"
						},
						{
							"key": "ETag",
							"value": "W/\"356-ZAecUOM7bOL11GkFuQMw7+cUMwg\""
						},
						{
							"key": "Date",
							"value": "Wed, 20 Oct 2021 19:45:19 GMT"
						},
						{
							"key": "Connection",
							"value": "keep-alive"
						},
						{
							"key": "Keep-Alive",
							"value": "timeout=5"
						}
					],
					"cookie": [],
					"body": "[\n    {\n        \"id\": 1,\n        \"title\": \"The Art of Loving\",\n        \"author\": \"Erich From\",\n        \"status\": \"unlisted\",\n        \"cover\": \"art-of-loving.jpg\",\n        \"rating\": null\n    },\n    {\n        \"id\": 2,\n        \"title\": \"Fahrenheit 451\",\n        \"author\": \"Ray Bradbury\",\n        \"status\": \"borrowed\",\n        \"cover\": \"fahrenheit-451.jpg\",\n        \"rating\": 3.33\n    },\n    {\n        \"id\": 3,\n        \"title\": \"1984\",\n        \"author\": \"George Orwell\",\n        \"status\": \"borrowed\",\n        \"cover\": \"1984.jpg\",\n        \"rating\": 2\n    },\n    {\n        \"id\": 4,\n        \"title\": \"The Great Gatsby\",\n        \"author\": \"F. Scott Fitzgerald\",\n        \"status\": \"borrowed\",\n        \"cover\": \"the-great-gatsby.jpg\",\n        \"rating\": null\n    },\n    {\n        \"id\": 5,\n        \"title\": \"The Catcher in the Rye\",\n        \"author\": \"J. D. Salinger\",\n        \"status\": \"available\",\n        \"cover\": \"the-catcher-in-the-rye.jpg\",\n        \"rating\": null\n    },\n    {\n        \"id\": 6,\n        \"title\": \"Brave New World\",\n        \"author\": \"Aldous Huxley\",\n        \"status\": \"available\",\n        \"cover\": \"brave-new-world.jpg\",\n        \"rating\": null\n    },\n    {\n        \"id\": 7,\n        \"title\": \"Catch-22\",\n        \"author\": \"Joseph Heller\",\n        \"status\": \"borrowed\",\n        \"cover\": \"into-the-wild.jpg\",\n        \"rating\": null\n    }\n]"
				}
			]
		},
		{
			"name": "books with query params",
			"request": {
				"auth": {
					"type": "bearer",
					"bearer": [
						{
							"key": "token",
							"value": "{{token}}",
							"type": "string"
						}
					]
				},
				"method": "GET",
				"header": [],
				"url": {
					"raw": "localhost:5000/api/v1/books?title=1&status=borrowed",
					"host": [
						"localhost"
					],
					"port": "5000",
					"path": [
						"api",
						"v1",
						"books"
					],
					"query": [
						{
							"key": "title",
							"value": "1"
						},
						{
							"key": "status",
							"value": "borrowed"
						}
					]
				}
			},
			"response": [
				{
					"name": "books with query params",
					"originalRequest": {
						"method": "GET",
						"header": [],
						"url": {
							"raw": "localhost:5000/api/v1/books?title=1&status=borrowed",
							"host": [
								"localhost"
							],
							"port": "5000",
							"path": [
								"api",
								"v1",
								"books"
							],
							"query": [
								{
									"key": "title",
									"value": "1"
								},
								{
									"key": "status",
									"value": "borrowed"
								}
							]
						}
					},
					"status": "OK",
					"code": 200,
					"_postman_previewlanguage": "json",
					"header": [
						{
							"key": "X-Powered-By",
							"value": "Express"
						},
						{
							"key": "Access-Control-Allow-Origin",
							"value": "*"
						},
						{
							"key": "Content-Type",
							"value": "application/json; charset=utf-8"
						},
						{
							"key": "Content-Length",
							"value": "221"
						},
						{
							"key": "ETag",
							"value": "W/\"dd-JBK4oQ2VoCVNSGGjB4vl4YXGOOk\""
						},
						{
							"key": "Date",
							"value": "Wed, 20 Oct 2021 19:53:21 GMT"
						},
						{
							"key": "Connection",
							"value": "keep-alive"
						},
						{
							"key": "Keep-Alive",
							"value": "timeout=5"
						}
					],
					"cookie": [],
					"body": "[\n    {\n        \"id\": 2,\n        \"title\": \"Fahrenheit 451\",\n        \"author\": \"Ray Bradbury\",\n        \"status\": \"borrowed\",\n        \"cover\": \"fahrenheit-451.jpg\",\n        \"rating\": 3.33\n    },\n    {\n        \"id\": 3,\n        \"title\": \"1984\",\n        \"author\": \"George Orwell\",\n        \"status\": \"borrowed\",\n        \"cover\": \"1984.jpg\",\n        \"rating\": 2\n    }\n]"
				}
			]
		},
		{
			"name": "books  pagination",
			"request": {
				"auth": {
					"type": "bearer",
					"bearer": [
						{
							"key": "token",
							"value": "{{token}}",
							"type": "string"
						}
					]
				},
				"method": "GET",
				"header": [],
				"url": {
					"raw": "localhost:5000/api/v1/books?offset=0&count=3&order_by=rating&order_dir=DESC",
					"host": [
						"localhost"
					],
					"port": "5000",
					"path": [
						"api",
						"v1",
						"books"
					],
					"query": [
						{
							"key": "offset",
							"value": "0"
						},
						{
							"key": "count",
							"value": "3"
						},
						{
							"key": "order_by",
							"value": "rating"
						},
						{
							"key": "order_dir",
							"value": "DESC"
						}
					]
				}
			},
			"response": [
				{
					"name": "books  pagination",
					"originalRequest": {
						"method": "GET",
						"header": [],
						"url": {
							"raw": "localhost:5000/api/v1/books?offset=5&order_by=id&order_dir=DESC",
							"host": [
								"localhost"
							],
							"port": "5000",
							"path": [
								"api",
								"v1",
								"books"
							],
							"query": [
								{
									"key": "offset",
									"value": "5"
								},
								{
									"key": "order_by",
									"value": "id"
								},
								{
									"key": "order_dir",
									"value": "DESC"
								}
							]
						}
					},
					"status": "OK",
					"code": 200,
					"_postman_previewlanguage": "json",
					"header": [
						{
							"key": "X-Powered-By",
							"value": "Express"
						},
						{
							"key": "Access-Control-Allow-Origin",
							"value": "*"
						},
						{
							"key": "Content-Type",
							"value": "application/json; charset=utf-8"
						},
						{
							"key": "Content-Length",
							"value": "306"
						},
						{
							"key": "ETag",
							"value": "W/\"132-TIpFQPGMP6ZBOXOGTnisSXoFszw\""
						},
						{
							"key": "Date",
							"value": "Wed, 20 Oct 2021 21:03:06 GMT"
						},
						{
							"key": "Connection",
							"value": "keep-alive"
						},
						{
							"key": "Keep-Alive",
							"value": "timeout=5"
						}
					],
					"cookie": [],
					"body": "{\n    \"books\": [\n        {\n            \"id\": 2,\n            \"title\": \"Fahrenheit 451\",\n            \"author\": \"Ray Bradbury\",\n            \"status\": \"borrowed\",\n            \"cover\": \"fahrenheit-451.jpg\",\n            \"rating\": 3.33\n        },\n        {\n            \"id\": 1,\n            \"title\": \"The Art of Loving\",\n            \"author\": \"Erich From\",\n            \"status\": \"unlisted\",\n            \"cover\": \"art-of-loving.jpg\",\n            \"rating\": null\n        }\n    ],\n    \"pagination\": {\n        \"totalCount\": 7,\n        \"count\": 2,\n        \"offset\": \"5\"\n    }\n}"
				},
				{
					"name": "books  pagination",
					"originalRequest": {
						"method": "GET",
						"header": [],
						"url": {
							"raw": "localhost:5000/api/v1/books?offset=0&count=10&order_by=title&order_dir=DESC",
							"host": [
								"localhost"
							],
							"port": "5000",
							"path": [
								"api",
								"v1",
								"books"
							],
							"query": [
								{
									"key": "offset",
									"value": "0"
								},
								{
									"key": "count",
									"value": "10"
								},
								{
									"key": "order_by",
									"value": "title"
								},
								{
									"key": "order_dir",
									"value": "DESC"
								}
							]
						}
					},
					"status": "OK",
					"code": 200,
					"_postman_previewlanguage": "json",
					"header": [
						{
							"key": "X-Powered-By",
							"value": "Express"
						},
						{
							"key": "Access-Control-Allow-Origin",
							"value": "*"
						},
						{
							"key": "Content-Type",
							"value": "application/json; charset=utf-8"
						},
						{
							"key": "Content-Length",
							"value": "917"
						},
						{
							"key": "ETag",
							"value": "W/\"395-SF3PjIbvXEzZ5rwnYW48pP5Kaok\""
						},
						{
							"key": "Date",
							"value": "Wed, 20 Oct 2021 21:08:24 GMT"
						},
						{
							"key": "Connection",
							"value": "keep-alive"
						},
						{
							"key": "Keep-Alive",
							"value": "timeout=5"
						}
					],
					"cookie": [],
					"body": "{\n    \"books\": [\n        {\n            \"id\": 4,\n            \"title\": \"The Great Gatsby\",\n            \"author\": \"F. Scott Fitzgerald\",\n            \"status\": \"borrowed\",\n            \"cover\": \"the-great-gatsby.jpg\",\n            \"rating\": null\n        },\n        {\n            \"id\": 5,\n            \"title\": \"The Catcher in the Rye\",\n            \"author\": \"J. D. Salinger\",\n            \"status\": \"available\",\n            \"cover\": \"the-catcher-in-the-rye.jpg\",\n            \"rating\": null\n        },\n        {\n            \"id\": 1,\n            \"title\": \"The Art of Loving\",\n            \"author\": \"Erich From\",\n            \"status\": \"unlisted\",\n            \"cover\": \"art-of-loving.jpg\",\n            \"rating\": null\n        },\n        {\n            \"id\": 2,\n            \"title\": \"Fahrenheit 451\",\n            \"author\": \"Ray Bradbury\",\n            \"status\": \"borrowed\",\n            \"cover\": \"fahrenheit-451.jpg\",\n            \"rating\": 3.33\n        },\n        {\n            \"id\": 7,\n            \"title\": \"Catch-22\",\n            \"author\": \"Joseph Heller\",\n            \"status\": \"borrowed\",\n            \"cover\": \"into-the-wild.jpg\",\n            \"rating\": null\n        },\n        {\n            \"id\": 6,\n            \"title\": \"Brave New World\",\n            \"author\": \"Aldous Huxley\",\n            \"status\": \"available\",\n            \"cover\": \"brave-new-world.jpg\",\n            \"rating\": null\n        },\n        {\n            \"id\": 3,\n            \"title\": \"1984\",\n            \"author\": \"George Orwell\",\n            \"status\": \"borrowed\",\n            \"cover\": \"1984.jpg\",\n            \"rating\": 2\n        }\n    ],\n    \"pagination\": {\n        \"totalCount\": 7,\n        \"count\": 7,\n        \"offset\": \"0\"\n    }\n}"
				}
			]
		},
		{
			"name": "book by id",
			"request": {
				"auth": {
					"type": "bearer",
					"bearer": [
						{
							"key": "token",
							"value": "{{token}}",
							"type": "string"
						}
					]
				},
				"method": "GET",
				"header": [],
				"url": {
					"raw": "localhost:5000/api/v1/books/3",
					"host": [
						"localhost"
					],
					"port": "5000",
					"path": [
						"api",
						"v1",
						"books",
						"3"
					]
				}
			},
			"response": [
				{
					"name": "book by id",
					"originalRequest": {
						"method": "GET",
						"header": [],
						"url": {
							"raw": "localhost:5000/api/v1/books/2",
							"host": [
								"localhost"
							],
							"port": "5000",
							"path": [
								"api",
								"v1",
								"books",
								"2"
							]
						}
					},
					"status": "OK",
					"code": 200,
					"_postman_previewlanguage": "json",
					"header": [
						{
							"key": "X-Powered-By",
							"value": "Express"
						},
						{
							"key": "Access-Control-Allow-Origin",
							"value": "*"
						},
						{
							"key": "Content-Type",
							"value": "application/json; charset=utf-8"
						},
						{
							"key": "Content-Length",
							"value": "375"
						},
						{
							"key": "ETag",
							"value": "W/\"177-c+TVfe7opnFNr3pvw+Ppra7ID+w\""
						},
						{
							"key": "Date",
							"value": "Fri, 22 Oct 2021 13:56:52 GMT"
						},
						{
							"key": "Connection",
							"value": "keep-alive"
						},
						{
							"key": "Keep-Alive",
							"value": "timeout=5"
						}
					],
					"cookie": [],
					"body": "{\n    \"id\": 2,\n    \"title\": \"Fahrenheit 451\",\n    \"author\": \"Ray Bradbury\",\n    \"status\": \"borrowed\",\n    \"cover\": \"fahrenheit-451.jpg\",\n    \"userId\": 1,\n    \"rating\": 3,\n    \"reviews\": [\n        {\n            \"title\": \"All time favorite book\",\n            \"content\": \"If you read one book in your life, let it be this one\",\n            \"userId\": 1,\n            \"username\": \"neo\",\n            \"avatar\": \"neo-avatar.png\",\n            \"bookId\": 2,\n            \"bookTitle\": \"Fahrenheit 451\",\n            \"cover\": \"fahrenheit-451.jpg\",\n            \"votes\": []\n        }\n    ]\n}"
				},
				{
					"name": "book by id",
					"originalRequest": {
						"method": "GET",
						"header": [],
						"url": {
							"raw": "localhost:5000/api/v1/books/3",
							"host": [
								"localhost"
							],
							"port": "5000",
							"path": [
								"api",
								"v1",
								"books",
								"3"
							]
						}
					},
					"status": "OK",
					"code": 200,
					"_postman_previewlanguage": "json",
					"header": [
						{
							"key": "X-Powered-By",
							"value": "Express"
						},
						{
							"key": "Access-Control-Allow-Origin",
							"value": "*"
						},
						{
							"key": "Content-Type",
							"value": "application/json; charset=utf-8"
						},
						{
							"key": "Content-Length",
							"value": "660"
						},
						{
							"key": "ETag",
							"value": "W/\"294-v3S7I6Y/RbjbTE9aqfzOZ8rUEQc\""
						},
						{
							"key": "Date",
							"value": "Fri, 22 Oct 2021 13:58:09 GMT"
						},
						{
							"key": "Connection",
							"value": "keep-alive"
						},
						{
							"key": "Keep-Alive",
							"value": "timeout=5"
						}
					],
					"cookie": [],
					"body": "{\n    \"id\": 3,\n    \"title\": \"1984\",\n    \"author\": \"George Orwell\",\n    \"status\": \"borrowed\",\n    \"cover\": \"1984.jpg\",\n    \"userId\": 2,\n    \"rating\": 2,\n    \"reviews\": [\n        {\n            \"title\": \"A must read\",\n            \"content\": \"Definitely reader's choice!\",\n            \"userId\": 1,\n            \"username\": \"neo\",\n            \"avatar\": \"neo-avatar.png\",\n            \"bookId\": 3,\n            \"bookTitle\": \"1984\",\n            \"cover\": \"1984.jpg\",\n            \"votes\": [\n                {\n                    \"userId\": 1,\n                    \"username\": \"neo\",\n                    \"avatar\": \"neo-avatar.png\"\n                },\n                {\n                    \"userId\": 2,\n                    \"username\": \"morpheus\",\n                    \"avatar\": \"morpheus-avatar.png\"\n                }\n            ]\n        },\n        {\n            \"title\": \"A must!\",\n            \"content\": \"Definitely reader's choice!!\",\n            \"userId\": 2,\n            \"username\": \"morpheus\",\n            \"avatar\": \"morpheus-avatar.png\",\n            \"bookId\": 3,\n            \"bookTitle\": \"1984\",\n            \"cover\": \"1984.jpg\",\n            \"votes\": [\n                {\n                    \"userId\": 1,\n                    \"username\": \"neo\",\n                    \"avatar\": \"neo-avatar.png\"\n                }\n            ]\n        }\n    ]\n}"
				}
			]
		},
		{
			"name": "book borrow",
			"request": {
				"auth": {
					"type": "bearer",
					"bearer": [
						{
							"key": "token",
							"value": "{{token}}",
							"type": "string"
						}
					]
				},
				"method": "POST",
				"header": [],
				"url": {
					"raw": "localhost:5000/api/v1/books/5",
					"host": [
						"localhost"
					],
					"port": "5000",
					"path": [
						"api",
						"v1",
						"books",
						"5"
					]
				}
			},
			"response": [
				{
					"name": "book borrow",
					"originalRequest": {
						"method": "POST",
						"header": [],
						"url": {
							"raw": "localhost:5000/api/v1/books/5",
							"host": [
								"localhost"
							],
							"port": "5000",
							"path": [
								"api",
								"v1",
								"books",
								"5"
							]
						}
					},
					"status": "OK",
					"code": 200,
					"_postman_previewlanguage": "json",
					"header": [
						{
							"key": "X-Powered-By",
							"value": "Express"
						},
						{
							"key": "Access-Control-Allow-Origin",
							"value": "*"
						},
						{
							"key": "Content-Type",
							"value": "application/json; charset=utf-8"
						},
						{
							"key": "Content-Length",
							"value": "135"
						},
						{
							"key": "ETag",
							"value": "W/\"87-+8aoVIx2NesP0nksnlHdzjMd7q4\""
						},
						{
							"key": "Date",
							"value": "Mon, 18 Oct 2021 22:51:05 GMT"
						},
						{
							"key": "Connection",
							"value": "keep-alive"
						},
						{
							"key": "Keep-Alive",
							"value": "timeout=5"
						}
					],
					"cookie": [],
					"body": "{\n    \"id\": 5,\n    \"title\": \"The Catcher in the Rye\",\n    \"author\": \"J. D. Salinger\",\n    \"status\": \"borrowed\",\n    \"cover\": \"the-catcher-in-the-rye.jpg\",\n    \"userId\": 1\n}"
				}
			]
		},
		{
			"name": "book return",
			"request": {
				"auth": {
					"type": "bearer",
					"bearer": [
						{
							"key": "token",
							"value": "{{token}}",
							"type": "string"
						}
					]
				},
				"method": "DELETE",
				"header": [],
				"url": {
					"raw": "localhost:5000/api/v1/books/5",
					"host": [
						"localhost"
					],
					"port": "5000",
					"path": [
						"api",
						"v1",
						"books",
						"5"
					]
				}
			},
			"response": [
				{
					"name": "book return",
					"originalRequest": {
						"method": "DELETE",
						"header": [],
						"url": {
							"raw": "localhost:5000/api/v1/books/5",
							"host": [
								"localhost"
							],
							"port": "5000",
							"path": [
								"api",
								"v1",
								"books",
								"5"
							]
						}
					},
					"status": "OK",
					"code": 200,
					"_postman_previewlanguage": "json",
					"header": [
						{
							"key": "X-Powered-By",
							"value": "Express"
						},
						{
							"key": "Access-Control-Allow-Origin",
							"value": "*"
						},
						{
							"key": "Content-Type",
							"value": "application/json; charset=utf-8"
						},
						{
							"key": "Content-Length",
							"value": "139"
						},
						{
							"key": "ETag",
							"value": "W/\"8b-N2gpzAWBArl4f/r5p9gCPKMQ9zY\""
						},
						{
							"key": "Date",
							"value": "Mon, 18 Oct 2021 22:51:39 GMT"
						},
						{
							"key": "Connection",
							"value": "keep-alive"
						},
						{
							"key": "Keep-Alive",
							"value": "timeout=5"
						}
					],
					"cookie": [],
					"body": "{\n    \"id\": 5,\n    \"title\": \"The Catcher in the Rye\",\n    \"author\": \"J. D. Salinger\",\n    \"status\": \"available\",\n    \"cover\": \"the-catcher-in-the-rye.jpg\",\n    \"userId\": null\n}"
				}
			]
		},
		{
			"name": "user reviews",
			"request": {
				"auth": {
					"type": "bearer",
					"bearer": [
						{
							"key": "token",
							"value": "{{token}}",
							"type": "string"
						}
					]
				},
				"method": "GET",
				"header": [],
				"url": {
					"raw": "localhost:5000/api/v1/users/1/reviews",
					"host": [
						"localhost"
					],
					"port": "5000",
					"path": [
						"api",
						"v1",
						"users",
						"1",
						"reviews"
					]
				}
			},
			"response": [
				{
					"name": "user reviews",
					"originalRequest": {
						"method": "GET",
						"header": [],
						"url": {
							"raw": "localhost:5000/api/v1/users/1/reviews",
							"host": [
								"localhost"
							],
							"port": "5000",
							"path": [
								"api",
								"v1",
								"users",
								"1",
								"reviews"
							]
						}
					},
					"status": "OK",
					"code": 200,
					"_postman_previewlanguage": "json",
					"header": [
						{
							"key": "X-Powered-By",
							"value": "Express"
						},
						{
							"key": "Access-Control-Allow-Origin",
							"value": "*"
						},
						{
							"key": "Content-Type",
							"value": "application/json; charset=utf-8"
						},
						{
							"key": "Content-Length",
							"value": "898"
						},
						{
							"key": "ETag",
							"value": "W/\"382-uCS6NqLRGFUyXDJPNnsdLehr+Io\""
						},
						{
							"key": "Date",
							"value": "Fri, 22 Oct 2021 13:29:01 GMT"
						},
						{
							"key": "Connection",
							"value": "keep-alive"
						},
						{
							"key": "Keep-Alive",
							"value": "timeout=5"
						}
					],
					"cookie": [],
					"body": "[\n    {\n        \"title\": \"title1\",\n        \"content\": \"Greatest book ever\",\n        \"userId\": 1,\n        \"username\": \"neo\",\n        \"avatar\": \"neo-avatar.png\",\n        \"bookId\": 1,\n        \"bookTitle\": \"The Art of Loving\",\n        \"cover\": \"art-of-loving.jpg\",\n        \"votes\": []\n    },\n    {\n        \"title\": \"All time favorite book\",\n        \"content\": \"If you read one book in your life, let it be this one\",\n        \"userId\": 1,\n        \"username\": \"neo\",\n        \"avatar\": \"neo-avatar.png\",\n        \"bookId\": 2,\n        \"bookTitle\": \"Fahrenheit 451\",\n        \"cover\": \"fahrenheit-451.jpg\",\n        \"votes\": []\n    },\n    {\n        \"title\": \"title3\",\n        \"content\": \"My favourite\",\n        \"userId\": 1,\n        \"username\": \"neo\",\n        \"avatar\": \"neo-avatar.png\",\n        \"bookId\": 3,\n        \"bookTitle\": \"1984\",\n        \"cover\": \"1984.jpg\",\n        \"votes\": [\n            {\n                \"userId\": 1,\n                \"username\": \"neo\",\n                \"avatar\": \"neo-avatar.png\"\n            },\n            {\n                \"userId\": 2,\n                \"username\": \"morpheus\",\n                \"avatar\": \"morpheus-avatar.png\"\n            }\n        ]\n    },\n    {\n        \"title\": \"Uber great\",\n        \"content\": \"I still think it's great!\",\n        \"userId\": 1,\n        \"username\": \"neo\",\n        \"avatar\": \"neo-avatar.png\",\n        \"bookId\": 6,\n        \"bookTitle\": \"Brave New World\",\n        \"cover\": \"brave-new-world.jpg\",\n        \"votes\": []\n    }\n]"
				}
			]
		},
		{
			"name": "book reviews",
			"request": {
				"auth": {
					"type": "bearer",
					"bearer": [
						{
							"key": "token",
							"value": "{{token}}",
							"type": "string"
						}
					]
				},
				"method": "GET",
				"header": [],
				"url": {
					"raw": "localhost:5000/api/v1/books/3/reviews",
					"host": [
						"localhost"
					],
					"port": "5000",
					"path": [
						"api",
						"v1",
						"books",
						"3",
						"reviews"
					]
				}
			},
			"response": [
				{
					"name": "book reviews",
					"originalRequest": {
						"method": "GET",
						"header": [],
						"url": {
							"raw": "localhost:5000/api/v1/books/3/reviews",
							"host": [
								"localhost"
							],
							"port": "5000",
							"path": [
								"api",
								"v1",
								"books",
								"3",
								"reviews"
							]
						}
					},
					"status": "OK",
					"code": 200,
					"_postman_previewlanguage": "json",
					"header": [
						{
							"key": "X-Powered-By",
							"value": "Express"
						},
						{
							"key": "Access-Control-Allow-Origin",
							"value": "*"
						},
						{
							"key": "Content-Type",
							"value": "application/json; charset=utf-8"
						},
						{
							"key": "Content-Length",
							"value": "512"
						},
						{
							"key": "ETag",
							"value": "W/\"200-2R/XsIYz9nUT/H53z/z5D9aJ5FE\""
						},
						{
							"key": "Date",
							"value": "Fri, 22 Oct 2021 13:28:46 GMT"
						},
						{
							"key": "Connection",
							"value": "keep-alive"
						},
						{
							"key": "Keep-Alive",
							"value": "timeout=5"
						}
					],
					"cookie": [],
					"body": "[\n    {\n        \"title\": \"title3\",\n        \"content\": \"My favourite\",\n        \"userId\": 1,\n        \"username\": \"neo\",\n        \"avatar\": \"neo-avatar.png\",\n        \"bookId\": 3,\n        \"bookTitle\": \"1984\",\n        \"cover\": \"1984.jpg\",\n        \"votes\": [\n            {\n                \"userId\": 1,\n                \"username\": \"neo\",\n                \"avatar\": \"neo-avatar.png\"\n            },\n            {\n                \"userId\": 2,\n                \"username\": \"morpheus\",\n                \"avatar\": \"morpheus-avatar.png\"\n            }\n        ]\n    },\n    {\n        \"title\": \"Mediocre\",\n        \"content\": \"Didn't like it much\",\n        \"userId\": 2,\n        \"username\": \"morpheus\",\n        \"avatar\": \"morpheus-avatar.png\",\n        \"bookId\": 3,\n        \"bookTitle\": \"1984\",\n        \"cover\": \"1984.jpg\",\n        \"votes\": [\n            {\n                \"userId\": 1,\n                \"username\": \"neo\",\n                \"avatar\": \"neo-avatar.png\"\n            }\n        ]\n    }\n]"
				}
			]
		},
		{
			"name": "book reviews add",
			"request": {
				"auth": {
					"type": "bearer",
					"bearer": [
						{
							"key": "token",
							"value": "{{token}}",
							"type": "string"
						}
					]
				},
				"method": "POST",
				"header": [],
				"body": {
					"mode": "raw",
					"raw": "{\r\n    \"title\": \"Uber great\",\r\n    \"content\": \"I still think it's great!\"\r\n}",
					"options": {
						"raw": {
							"language": "json"
						}
					}
				},
				"url": {
					"raw": "localhost:5000/api/v1/books/6/reviews",
					"host": [
						"localhost"
					],
					"port": "5000",
					"path": [
						"api",
						"v1",
						"books",
						"6",
						"reviews"
					]
				}
			},
			"response": [
				{
					"name": "book reviews add",
					"originalRequest": {
						"method": "POST",
						"header": [],
						"body": {
							"mode": "raw",
							"raw": "{\r\n    \"title\": \"Uber great\",\r\n    \"content\": \"I still think it's great!\"\r\n}",
							"options": {
								"raw": {
									"language": "json"
								}
							}
						},
						"url": {
							"raw": "localhost:5000/api/v1/books/6/reviews",
							"host": [
								"localhost"
							],
							"port": "5000",
							"path": [
								"api",
								"v1",
								"books",
								"6",
								"reviews"
							]
						}
					},
					"status": "OK",
					"code": 200,
					"_postman_previewlanguage": "json",
					"header": [
						{
							"key": "X-Powered-By",
							"value": "Express"
						},
						{
							"key": "Access-Control-Allow-Origin",
							"value": "*"
						},
						{
							"key": "Content-Type",
							"value": "application/json; charset=utf-8"
						},
						{
							"key": "Content-Length",
							"value": "196"
						},
						{
							"key": "ETag",
							"value": "W/\"c4-sTdTVwq63hYSpb6TRkNwNdwKpcc\""
						},
						{
							"key": "Date",
							"value": "Fri, 22 Oct 2021 13:28:20 GMT"
						},
						{
							"key": "Connection",
							"value": "keep-alive"
						},
						{
							"key": "Keep-Alive",
							"value": "timeout=5"
						}
					],
					"cookie": [],
					"body": "{\n    \"title\": \"Uber great\",\n    \"content\": \"I still think it's great!\",\n    \"userId\": 1,\n    \"username\": \"neo\",\n    \"avatar\": \"neo-avatar.png\",\n    \"bookId\": 6,\n    \"bookTitle\": \"Brave New World\",\n    \"cover\": \"brave-new-world.jpg\",\n    \"votes\": []\n}"
				}
			]
		},
		{
			"name": "book reviews update",
			"request": {
				"auth": {
					"type": "bearer",
					"bearer": [
						{
							"key": "token",
							"value": "{{token}}",
							"type": "string"
						}
					]
				},
				"method": "PUT",
				"header": [],
				"body": {
					"mode": "raw",
					"raw": "{\r\n    \"title\": \"A must read\",\r\n    \"content\": \"Definitely reader's choice!\"\r\n}",
					"options": {
						"raw": {
							"language": "json"
						}
					}
				},
				"url": {
					"raw": "localhost:5000/api/v1/books/3/reviews",
					"host": [
						"localhost"
					],
					"port": "5000",
					"path": [
						"api",
						"v1",
						"books",
						"3",
						"reviews"
					]
				}
			},
			"response": [
				{
					"name": "book reviews update",
					"originalRequest": {
						"method": "PUT",
						"header": [],
						"body": {
							"mode": "raw",
							"raw": "{\r\n    \"title\": \"A must read\",\r\n    \"content\": \"Definitely reader's choice!\"\r\n}",
							"options": {
								"raw": {
									"language": "json"
								}
							}
						},
						"url": {
							"raw": "localhost:5000/api/v1/books/6/reviews",
							"host": [
								"localhost"
							],
							"port": "5000",
							"path": [
								"api",
								"v1",
								"books",
								"6",
								"reviews"
							]
						}
					},
					"status": "OK",
					"code": 200,
					"_postman_previewlanguage": "json",
					"header": [
						{
							"key": "X-Powered-By",
							"value": "Express"
						},
						{
							"key": "Access-Control-Allow-Origin",
							"value": "*"
						},
						{
							"key": "Content-Type",
							"value": "application/json; charset=utf-8"
						},
						{
							"key": "Content-Length",
							"value": "199"
						},
						{
							"key": "ETag",
							"value": "W/\"c7-KyqzGwF0zYiIvm+Omul/FKbGPb8\""
						},
						{
							"key": "Date",
							"value": "Fri, 22 Oct 2021 13:31:01 GMT"
						},
						{
							"key": "Connection",
							"value": "keep-alive"
						},
						{
							"key": "Keep-Alive",
							"value": "timeout=5"
						}
					],
					"cookie": [],
					"body": "{\n    \"title\": \"A must read\",\n    \"content\": \"Definitely reader's choice!\",\n    \"userId\": 1,\n    \"username\": \"neo\",\n    \"avatar\": \"neo-avatar.png\",\n    \"bookId\": 6,\n    \"bookTitle\": \"Brave New World\",\n    \"cover\": \"brave-new-world.jpg\",\n    \"votes\": []\n}"
				},
				{
					"name": "book reviews update",
					"originalRequest": {
						"method": "PUT",
						"header": [],
						"body": {
							"mode": "raw",
							"raw": "{\r\n    \"title\": \"A must read\",\r\n    \"content\": \"Definitely reader's choice!\"\r\n}",
							"options": {
								"raw": {
									"language": "json"
								}
							}
						},
						"url": {
							"raw": "localhost:5000/api/v1/books/3/reviews",
							"host": [
								"localhost"
							],
							"port": "5000",
							"path": [
								"api",
								"v1",
								"books",
								"3",
								"reviews"
							]
						}
					},
					"status": "OK",
					"code": 200,
					"_postman_previewlanguage": "json",
					"header": [
						{
							"key": "X-Powered-By",
							"value": "Express"
						},
						{
							"key": "Access-Control-Allow-Origin",
							"value": "*"
						},
						{
							"key": "Content-Type",
							"value": "application/json; charset=utf-8"
						},
						{
							"key": "Content-Length",
							"value": "298"
						},
						{
							"key": "ETag",
							"value": "W/\"12a-J5pTu+OUWPz24YJ5+2oyuZzwZfU\""
						},
						{
							"key": "Date",
							"value": "Fri, 22 Oct 2021 13:53:08 GMT"
						},
						{
							"key": "Connection",
							"value": "keep-alive"
						},
						{
							"key": "Keep-Alive",
							"value": "timeout=5"
						}
					],
					"cookie": [],
					"body": "{\n    \"title\": \"A must read\",\n    \"content\": \"Definitely reader's choice!\",\n    \"userId\": 1,\n    \"username\": \"neo\",\n    \"avatar\": \"neo-avatar.png\",\n    \"bookId\": 3,\n    \"bookTitle\": \"1984\",\n    \"cover\": \"1984.jpg\",\n    \"votes\": [\n        {\n            \"userId\": 1,\n            \"username\": \"neo\",\n            \"avatar\": \"neo-avatar.png\"\n        },\n        {\n            \"userId\": 2,\n            \"username\": \"morpheus\",\n            \"avatar\": \"morpheus-avatar.png\"\n        }\n    ]\n}"
				}
			]
		},
		{
			"name": "book reviews delete",
			"request": {
				"auth": {
					"type": "bearer",
					"bearer": [
						{
							"key": "token",
							"value": "{{token}}",
							"type": "string"
						}
					]
				},
				"method": "DELETE",
				"header": [],
				"body": {
					"mode": "raw",
					"raw": "",
					"options": {
						"raw": {
							"language": "json"
						}
					}
				},
				"url": {
					"raw": "localhost:5000/api/v1/books/3/reviews",
					"host": [
						"localhost"
					],
					"port": "5000",
					"path": [
						"api",
						"v1",
						"books",
						"3",
						"reviews"
					]
				}
			},
			"response": [
				{
					"name": "book reviews delete",
					"originalRequest": {
						"method": "DELETE",
						"header": [],
						"body": {
							"mode": "raw",
							"raw": "",
							"options": {
								"raw": {
									"language": "json"
								}
							}
						},
						"url": {
							"raw": "localhost:5000/api/v1/books/6/reviews",
							"host": [
								"localhost"
							],
							"port": "5000",
							"path": [
								"api",
								"v1",
								"books",
								"6",
								"reviews"
							]
						}
					},
					"status": "OK",
					"code": 200,
					"_postman_previewlanguage": "json",
					"header": [
						{
							"key": "X-Powered-By",
							"value": "Express"
						},
						{
							"key": "Access-Control-Allow-Origin",
							"value": "*"
						},
						{
							"key": "Content-Type",
							"value": "application/json; charset=utf-8"
						},
						{
							"key": "Content-Length",
							"value": "188"
						},
						{
							"key": "ETag",
							"value": "W/\"bc-YR651LJdTmjJ7ElgelOnGR3yU6g\""
						},
						{
							"key": "Date",
							"value": "Fri, 22 Oct 2021 13:31:13 GMT"
						},
						{
							"key": "Connection",
							"value": "keep-alive"
						},
						{
							"key": "Keep-Alive",
							"value": "timeout=5"
						}
					],
					"cookie": [],
					"body": "{\n    \"title\": \"A must read\",\n    \"content\": \"Definitely reader's choice!\",\n    \"userId\": 1,\n    \"username\": \"neo\",\n    \"avatar\": \"neo-avatar.png\",\n    \"bookId\": 6,\n    \"bookTitle\": \"Brave New World\",\n    \"cover\": \"brave-new-world.jpg\"\n}"
				}
			]
		},
		{
			"name": "book rate",
			"request": {
				"auth": {
					"type": "bearer",
					"bearer": [
						{
							"key": "token",
							"value": "{{token}}",
							"type": "string"
						}
					]
				},
				"method": "PUT",
				"header": [],
				"body": {
					"mode": "raw",
					"raw": "{\r\n    \"value\": 5\r\n}",
					"options": {
						"raw": {
							"language": "json"
						}
					}
				},
				"url": {
					"raw": "localhost:5000/api/v1/books/6/rate",
					"host": [
						"localhost"
					],
					"port": "5000",
					"path": [
						"api",
						"v1",
						"books",
						"6",
						"rate"
					]
				}
			},
			"response": [
				{
					"name": "book rate",
					"originalRequest": {
						"method": "PUT",
						"header": [],
						"body": {
							"mode": "raw",
							"raw": "{\r\n    \"value\": 5\r\n}",
							"options": {
								"raw": {
									"language": "json"
								}
							}
						},
						"url": {
							"raw": "localhost:5000/api/v1/books/3/rate",
							"host": [
								"localhost"
							],
							"port": "5000",
							"path": [
								"api",
								"v1",
								"books",
								"3",
								"rate"
							]
						}
					},
					"status": "OK",
					"code": 200,
					"_postman_previewlanguage": "json",
					"header": [
						{
							"key": "X-Powered-By",
							"value": "Express"
						},
						{
							"key": "Access-Control-Allow-Origin",
							"value": "*"
						},
						{
							"key": "Content-Type",
							"value": "application/json; charset=utf-8"
						},
						{
							"key": "Content-Length",
							"value": "115"
						},
						{
							"key": "ETag",
							"value": "W/\"73-YCis2dD4kR/3AHnEz5KfjRiJBAA\""
						},
						{
							"key": "Date",
							"value": "Fri, 22 Oct 2021 14:06:05 GMT"
						},
						{
							"key": "Connection",
							"value": "keep-alive"
						},
						{
							"key": "Keep-Alive",
							"value": "timeout=5"
						}
					],
					"cookie": [],
					"body": "{\n    \"id\": 3,\n    \"title\": \"1984\",\n    \"author\": \"George Orwell\",\n    \"status\": \"available\",\n    \"cover\": \"1984.jpg\",\n    \"userId\": null,\n    \"rating\": 3.5\n}"
				}
			]
		},
		{
			"name": "book reviews toggle like",
			"request": {
				"auth": {
					"type": "bearer",
					"bearer": [
						{
							"key": "token",
							"value": "{{token}}",
							"type": "string"
						}
					]
				},
				"method": "PUT",
				"header": [],
				"body": {
					"mode": "raw",
					"raw": "",
					"options": {
						"raw": {
							"language": "json"
						}
					}
				},
				"url": {
					"raw": "localhost:5000/api/v1/books/3/reviews/1",
					"host": [
						"localhost"
					],
					"port": "5000",
					"path": [
						"api",
						"v1",
						"books",
						"3",
						"reviews",
						"1"
					]
				}
			},
			"response": [
				{
					"name": "book reviews toggle like",
					"originalRequest": {
						"method": "PUT",
						"header": [],
						"body": {
							"mode": "raw",
							"raw": "",
							"options": {
								"raw": {
									"language": "json"
								}
							}
						},
						"url": {
							"raw": "localhost:5000/api/v1/books/3/reviews/1",
							"host": [
								"localhost"
							],
							"port": "5000",
							"path": [
								"api",
								"v1",
								"books",
								"3",
								"reviews",
								"1"
							]
						}
					},
					"status": "OK",
					"code": 200,
					"_postman_previewlanguage": "json",
					"header": [
						{
							"key": "X-Powered-By",
							"value": "Express"
						},
						{
							"key": "Access-Control-Allow-Origin",
							"value": "*"
						},
						{
							"key": "Content-Type",
							"value": "application/json; charset=utf-8"
						},
						{
							"key": "Content-Length",
							"value": "242"
						},
						{
							"key": "ETag",
							"value": "W/\"f2-EgCF+m37k1Pj0JQ/meCs8q4BPjw\""
						},
						{
							"key": "Date",
							"value": "Fri, 22 Oct 2021 14:07:03 GMT"
						},
						{
							"key": "Connection",
							"value": "keep-alive"
						},
						{
							"key": "Keep-Alive",
							"value": "timeout=5"
						}
					],
					"cookie": [],
					"body": "{\n    \"title\": \"A must read\",\n    \"content\": \"Definitely reader's choice!\",\n    \"userId\": 1,\n    \"username\": \"neo\",\n    \"avatar\": \"neo-avatar.png\",\n    \"bookId\": 3,\n    \"bookTitle\": \"1984\",\n    \"cover\": \"1984.jpg\",\n    \"votes\": [\n        {\n            \"userId\": 2,\n            \"username\": \"morpheus\",\n            \"avatar\": \"morpheus-avatar.png\"\n        }\n    ]\n}"
				}
			]
		},
		{
			"name": "admin books all",
			"protocolProfileBehavior": {
				"disableBodyPruning": true
			},
			"request": {
				"auth": {
					"type": "bearer",
					"bearer": [
						{
							"key": "token",
							"value": "{{token}}",
							"type": "string"
						}
					]
				},
				"method": "GET",
				"header": [],
				"body": {
					"mode": "raw",
					"raw": "{\r\n    \"title\": \"Catch-22\",\r\n    \"author\": \"Joseph Heller\"\r\n}",
					"options": {
						"raw": {
							"language": "json"
						}
					}
				},
				"url": {
					"raw": "localhost:5000/api/v1/admin/books",
					"host": [
						"localhost"
					],
					"port": "5000",
					"path": [
						"api",
						"v1",
						"admin",
						"books"
					]
				}
			},
			"response": [
				{
					"name": "admin books all",
					"originalRequest": {
						"method": "GET",
						"header": [],
						"body": {
							"mode": "raw",
							"raw": "{\r\n    \"title\": \"Catch-22\",\r\n    \"author\": \"Joseph Heller\"\r\n}",
							"options": {
								"raw": {
									"language": "json"
								}
							}
						},
						"url": {
							"raw": "localhost:5000/api/v1/admin/books?status=unlisted",
							"host": [
								"localhost"
							],
							"port": "5000",
							"path": [
								"api",
								"v1",
								"admin",
								"books"
							],
							"query": [
								{
									"key": "status",
									"value": "unlisted"
								}
							]
						}
					},
					"status": "OK",
					"code": 200,
					"_postman_previewlanguage": "json",
					"header": [
						{
							"key": "X-Powered-By",
							"value": "Express"
						},
						{
							"key": "Access-Control-Allow-Origin",
							"value": "*"
						},
						{
							"key": "Content-Type",
							"value": "application/json; charset=utf-8"
						},
						{
							"key": "Content-Length",
							"value": "195"
						},
						{
							"key": "ETag",
							"value": "W/\"c3-SuqOKVmakv0W4mYHl3FNBb9UNdA\""
						},
						{
							"key": "Date",
							"value": "Wed, 20 Oct 2021 21:49:42 GMT"
						},
						{
							"key": "Connection",
							"value": "keep-alive"
						},
						{
							"key": "Keep-Alive",
							"value": "timeout=5"
						}
					],
					"cookie": [],
					"body": "{\n    \"books\": [\n        {\n            \"id\": 1,\n            \"title\": \"The Art of Loving\",\n            \"author\": \"Erich From\",\n            \"status\": \"unlisted\",\n            \"cover\": \"art-of-loving.jpg\",\n            \"rating\": null,\n            \"deleted\": 0\n        }\n    ],\n    \"pagination\": {\n        \"totalCount\": 7,\n        \"count\": 1,\n        \"offset\": 0\n    }\n}"
				},
				{
					"name": "admin books all",
					"originalRequest": {
						"method": "GET",
						"header": [],
						"body": {
							"mode": "raw",
							"raw": "{\r\n    \"title\": \"Catch-22\",\r\n    \"author\": \"Joseph Heller\"\r\n}",
							"options": {
								"raw": {
									"language": "json"
								}
							}
						},
						"url": {
							"raw": "localhost:5000/api/v1/admin/books",
							"host": [
								"localhost"
							],
							"port": "5000",
							"path": [
								"api",
								"v1",
								"admin",
								"books"
							]
						}
					},
					"status": "OK",
					"code": 200,
					"_postman_previewlanguage": "json",
					"header": [
						{
							"key": "X-Powered-By",
							"value": "Express"
						},
						{
							"key": "Access-Control-Allow-Origin",
							"value": "*"
						},
						{
							"key": "Content-Type",
							"value": "application/json; charset=utf-8"
						},
						{
							"key": "Content-Length",
							"value": "999"
						},
						{
							"key": "ETag",
							"value": "W/\"3e7-zyQ8ojWXbjmwxMTxH0Ulm5KhKg0\""
						},
						{
							"key": "Date",
							"value": "Wed, 20 Oct 2021 21:52:01 GMT"
						},
						{
							"key": "Connection",
							"value": "keep-alive"
						},
						{
							"key": "Keep-Alive",
							"value": "timeout=5"
						}
					],
					"cookie": [],
					"body": "{\n    \"books\": [\n        {\n            \"id\": 1,\n            \"title\": \"The Art of Loving\",\n            \"author\": \"Erich From\",\n            \"status\": \"unlisted\",\n            \"cover\": \"art-of-loving.jpg\",\n            \"rating\": null,\n            \"deleted\": 0\n        },\n        {\n            \"id\": 2,\n            \"title\": \"Fahrenheit 451\",\n            \"author\": \"Ray Bradbury\",\n            \"status\": \"borrowed\",\n            \"cover\": \"fahrenheit-451.jpg\",\n            \"rating\": 3.33,\n            \"deleted\": 0\n        },\n        {\n            \"id\": 3,\n            \"title\": \"1984\",\n            \"author\": \"George Orwell\",\n            \"status\": \"borrowed\",\n            \"cover\": \"1984.jpg\",\n            \"rating\": 2,\n            \"deleted\": 0\n        },\n        {\n            \"id\": 4,\n            \"title\": \"The Great Gatsby\",\n            \"author\": \"F. Scott Fitzgerald\",\n            \"status\": \"borrowed\",\n            \"cover\": \"the-great-gatsby.jpg\",\n            \"rating\": null,\n            \"deleted\": 0\n        },\n        {\n            \"id\": 5,\n            \"title\": \"The Catcher in the Rye\",\n            \"author\": \"J. D. Salinger\",\n            \"status\": \"available\",\n            \"cover\": \"the-catcher-in-the-rye.jpg\",\n            \"rating\": null,\n            \"deleted\": 0\n        },\n        {\n            \"id\": 6,\n            \"title\": \"Brave New World\",\n            \"author\": \"Aldous Huxley\",\n            \"status\": \"available\",\n            \"cover\": \"brave-new-world.jpg\",\n            \"rating\": null,\n            \"deleted\": 0\n        },\n        {\n            \"id\": 7,\n            \"title\": \"Catch-22\",\n            \"author\": \"Joseph Heller\",\n            \"status\": \"borrowed\",\n            \"cover\": \"into-the-wild.jpg\",\n            \"rating\": null,\n            \"deleted\": 0\n        }\n    ],\n    \"pagination\": {\n        \"totalCount\": 7,\n        \"count\": 7,\n        \"offset\": 0\n    }\n}"
				},
				{
					"name": "admin books all",
					"originalRequest": {
						"method": "GET",
						"header": [],
						"body": {
							"mode": "raw",
							"raw": "{\r\n    \"title\": \"Catch-22\",\r\n    \"author\": \"Joseph Heller\"\r\n}",
							"options": {
								"raw": {
									"language": "json"
								}
							}
						},
						"url": {
							"raw": "localhost:5000/api/v1/admin/books?status=available&title=the",
							"host": [
								"localhost"
							],
							"port": "5000",
							"path": [
								"api",
								"v1",
								"admin",
								"books"
							],
							"query": [
								{
									"key": "status",
									"value": "available"
								},
								{
									"key": "title",
									"value": "the"
								}
							]
						}
					},
					"status": "OK",
					"code": 200,
					"_postman_previewlanguage": "json",
					"header": [
						{
							"key": "X-Powered-By",
							"value": "Express"
						},
						{
							"key": "Access-Control-Allow-Origin",
							"value": "*"
						},
						{
							"key": "Content-Type",
							"value": "application/json; charset=utf-8"
						},
						{
							"key": "Content-Length",
							"value": "214"
						},
						{
							"key": "ETag",
							"value": "W/\"d6-9SbwRukdF2xzSXH+cOOX4P7f+gU\""
						},
						{
							"key": "Date",
							"value": "Wed, 20 Oct 2021 21:53:21 GMT"
						},
						{
							"key": "Connection",
							"value": "keep-alive"
						},
						{
							"key": "Keep-Alive",
							"value": "timeout=5"
						}
					],
					"cookie": [],
					"body": "{\n    \"books\": [\n        {\n            \"id\": 5,\n            \"title\": \"The Catcher in the Rye\",\n            \"author\": \"J. D. Salinger\",\n            \"status\": \"available\",\n            \"cover\": \"the-catcher-in-the-rye.jpg\",\n            \"rating\": null,\n            \"deleted\": 0\n        }\n    ],\n    \"pagination\": {\n        \"totalCount\": 7,\n        \"count\": 1,\n        \"offset\": 0\n    }\n}"
				},
				{
					"name": "admin books all",
					"originalRequest": {
						"method": "GET",
						"header": [],
						"body": {
							"mode": "raw",
							"raw": "{\r\n    \"title\": \"Catch-22\",\r\n    \"author\": \"Joseph Heller\"\r\n}",
							"options": {
								"raw": {
									"language": "json"
								}
							}
						},
						"url": {
							"raw": "localhost:5000/api/v1/admin/books?offset=5&count=5&order_by=title&order_dir=DESC",
							"host": [
								"localhost"
							],
							"port": "5000",
							"path": [
								"api",
								"v1",
								"admin",
								"books"
							],
							"query": [
								{
									"key": "offset",
									"value": "5"
								},
								{
									"key": "count",
									"value": "5"
								},
								{
									"key": "order_by",
									"value": "title"
								},
								{
									"key": "order_dir",
									"value": "DESC"
								}
							]
						}
					},
					"status": "OK",
					"code": 200,
					"_postman_previewlanguage": "json",
					"header": [
						{
							"key": "X-Powered-By",
							"value": "Express"
						},
						{
							"key": "Access-Control-Allow-Origin",
							"value": "*"
						},
						{
							"key": "Content-Type",
							"value": "application/json; charset=utf-8"
						},
						{
							"key": "Content-Length",
							"value": "312"
						},
						{
							"key": "ETag",
							"value": "W/\"138-FaDBLErm5S9Fq5jbgjO6Iq3JD7k\""
						},
						{
							"key": "Date",
							"value": "Wed, 20 Oct 2021 21:54:09 GMT"
						},
						{
							"key": "Connection",
							"value": "keep-alive"
						},
						{
							"key": "Keep-Alive",
							"value": "timeout=5"
						}
					],
					"cookie": [],
					"body": "{\n    \"books\": [\n        {\n            \"id\": 6,\n            \"title\": \"Brave New World\",\n            \"author\": \"Aldous Huxley\",\n            \"status\": \"available\",\n            \"cover\": \"brave-new-world.jpg\",\n            \"rating\": null,\n            \"deleted\": 0\n        },\n        {\n            \"id\": 3,\n            \"title\": \"1984\",\n            \"author\": \"George Orwell\",\n            \"status\": \"borrowed\",\n            \"cover\": \"1984.jpg\",\n            \"rating\": 2,\n            \"deleted\": 0\n        }\n    ],\n    \"pagination\": {\n        \"totalCount\": 7,\n        \"count\": 2,\n        \"offset\": \"5\"\n    }\n}"
				}
			]
		},
		{
			"name": "admin book add",
			"request": {
				"auth": {
					"type": "bearer",
					"bearer": [
						{
							"key": "token",
							"value": "{{token}}",
							"type": "string"
						}
					]
				},
				"method": "POST",
				"header": [],
				"body": {
					"mode": "formdata",
					"formdata": [
						{
							"key": "cover",
							"type": "file",
							"src": []
						},
						{
							"key": "title",
							"value": "Catch-22",
							"type": "text"
						},
						{
							"key": "author",
							"value": "Joseph Heller",
							"type": "text"
						}
					]
				},
				"url": {
					"raw": "localhost:5000/api/v1/admin/books",
					"host": [
						"localhost"
					],
					"port": "5000",
					"path": [
						"api",
						"v1",
						"admin",
						"books"
					]
				}
			},
			"response": [
				{
					"name": "admin book add",
					"originalRequest": {
						"method": "POST",
						"header": [],
						"body": {
							"mode": "formdata",
							"formdata": [
								{
									"key": "cover",
									"type": "file",
									"src": []
								},
								{
									"key": "title",
									"value": "Catch-22",
									"type": "text"
								},
								{
									"key": "author",
									"value": "Joseph Heller",
									"type": "text"
								}
							],
							"options": {
								"raw": {
									"language": "json"
								}
							}
						},
						"url": {
							"raw": "localhost:5000/api/v1/admin/books",
							"host": [
								"localhost"
							],
							"port": "5000",
							"path": [
								"api",
								"v1",
								"admin",
								"books"
							]
						}
					},
					"status": "OK",
					"code": 200,
					"_postman_previewlanguage": "json",
					"header": [
						{
							"key": "X-Powered-By",
							"value": "Express"
						},
						{
							"key": "Access-Control-Allow-Origin",
							"value": "*"
						},
						{
							"key": "Content-Type",
							"value": "application/json; charset=utf-8"
						},
						{
							"key": "Content-Length",
							"value": "86"
						},
						{
							"key": "ETag",
							"value": "W/\"56-ou6JMMBr1aCOZAgDPyiBcZhZOfk\""
						},
						{
							"key": "Date",
							"value": "Mon, 18 Oct 2021 22:54:41 GMT"
						},
						{
							"key": "Connection",
							"value": "keep-alive"
						},
						{
							"key": "Keep-Alive",
							"value": "timeout=5"
						}
					],
					"cookie": [],
					"body": "{\n    \"id\": 8,\n    \"title\": \"Catch-22\",\n    \"author\": \"Joseph Heller\",\n    \"status\": \"available\",\n    \"cover\": null\n}"
				}
			]
		},
		{
			"name": "admin book update",
			"request": {
				"auth": {
					"type": "bearer",
					"bearer": [
						{
							"key": "token",
							"value": "{{token}}",
							"type": "string"
						}
					]
				},
				"method": "PUT",
				"header": [],
				"body": {
					"mode": "formdata",
					"formdata": [
						{
							"key": "cover",
							"type": "file",
							"src": "/C:/Users/nadezhda.hristova/OneDrive - Telerik Academy/Pictures/logo-js-avatar.png"
						},
						{
							"key": "title",
							"value": "Cat 22",
							"type": "text"
						}
					]
				},
				"url": {
					"raw": "localhost:5000/api/v1/admin/books/8",
					"host": [
						"localhost"
					],
					"port": "5000",
					"path": [
						"api",
						"v1",
						"admin",
						"books",
						"8"
					]
				}
			},
			"response": [
				{
					"name": "admin book update",
					"originalRequest": {
						"method": "PUT",
						"header": [],
						"body": {
							"mode": "formdata",
							"formdata": [
								{
									"key": "cover",
									"type": "file",
									"src": "/C:/Users/nadezhda.hristova/OneDrive - Telerik Academy/Pictures/logo-js-avatar.png"
								},
								{
									"key": "title",
									"value": "Cat 22",
									"type": "text"
								}
							],
							"options": {
								"raw": {
									"language": "json"
								}
							}
						},
						"url": {
							"raw": "localhost:5000/api/v1/admin/books/8",
							"host": [
								"localhost"
							],
							"port": "5000",
							"path": [
								"api",
								"v1",
								"admin",
								"books",
								"8"
							]
						}
					},
					"status": "OK",
					"code": 200,
					"_postman_previewlanguage": "json",
					"header": [
						{
							"key": "X-Powered-By",
							"value": "Express"
						},
						{
							"key": "Access-Control-Allow-Origin",
							"value": "*"
						},
						{
							"key": "Content-Type",
							"value": "application/json; charset=utf-8"
						},
						{
							"key": "Content-Length",
							"value": "125"
						},
						{
							"key": "ETag",
							"value": "W/\"7d-PO+ozoim1jg9uuQPGBjShMXc2AQ\""
						},
						{
							"key": "Date",
							"value": "Mon, 18 Oct 2021 22:55:28 GMT"
						},
						{
							"key": "Connection",
							"value": "keep-alive"
						},
						{
							"key": "Keep-Alive",
							"value": "timeout=5"
						}
					],
					"cookie": [],
					"body": "{\n    \"id\": 8,\n    \"title\": \"Cat 22\",\n    \"author\": \"Joseph Heller\",\n    \"status\": \"available\",\n    \"cover\": \"1634597722986.png\",\n    \"userId\": null,\n    \"deleted\": 0\n}"
				}
			]
		},
		{
			"name": "admin book delete",
			"request": {
				"auth": {
					"type": "bearer",
					"bearer": [
						{
							"key": "token",
							"value": "{{token}}",
							"type": "string"
						}
					]
				},
				"method": "DELETE",
				"header": [],
				"body": {
					"mode": "raw",
					"raw": "",
					"options": {
						"raw": {
							"language": "json"
						}
					}
				},
				"url": {
					"raw": "localhost:5000/api/v1/admin/books/7",
					"host": [
						"localhost"
					],
					"port": "5000",
					"path": [
						"api",
						"v1",
						"admin",
						"books",
						"7"
					]
				}
			},
			"response": [
				{
					"name": "admin book delete",
					"originalRequest": {
						"method": "DELETE",
						"header": [],
						"body": {
							"mode": "raw",
							"raw": "",
							"options": {
								"raw": {
									"language": "json"
								}
							}
						},
						"url": {
							"raw": "localhost:5000/api/v1/admin/books/7",
							"host": [
								"localhost"
							],
							"port": "5000",
							"path": [
								"api",
								"v1",
								"admin",
								"books",
								"7"
							]
						}
					},
					"status": "OK",
					"code": 200,
					"_postman_previewlanguage": "json",
					"header": [
						{
							"key": "X-Powered-By",
							"value": "Express"
						},
						{
							"key": "Access-Control-Allow-Origin",
							"value": "*"
						},
						{
							"key": "Content-Type",
							"value": "application/json; charset=utf-8"
						},
						{
							"key": "Content-Length",
							"value": "131"
						},
						{
							"key": "ETag",
							"value": "W/\"83-5nmA1mz4rtTWszdqPpAadzXyd64\""
						},
						{
							"key": "Date",
							"value": "Mon, 18 Oct 2021 22:55:48 GMT"
						},
						{
							"key": "Connection",
							"value": "keep-alive"
						},
						{
							"key": "Keep-Alive",
							"value": "timeout=5"
						}
					],
					"cookie": [],
					"body": "{\n    \"id\": 7,\n    \"title\": \"Into the Wild\",\n    \"author\": \"Jon Krakauer\",\n    \"status\": \"available\",\n    \"cover\": \"into-the-wild.jpg\",\n    \"userId\": null,\n    \"deleted\": 1\n}"
				}
			]
		},
		{
			"name": "admin reviews all",
			"request": {
				"auth": {
					"type": "bearer",
					"bearer": [
						{
							"key": "token",
							"value": "{{token}}",
							"type": "string"
						}
					]
				},
				"method": "GET",
				"header": [],
				"url": {
					"raw": "localhost:5000/api/v1/admin/reviews",
					"host": [
						"localhost"
					],
					"port": "5000",
					"path": [
						"api",
						"v1",
						"admin",
						"reviews"
					]
				}
			},
			"response": [
				{
					"name": "admin reviews all",
					"originalRequest": {
						"method": "GET",
						"header": [],
						"url": {
							"raw": "localhost:5000/api/v1/admin/reviews",
							"host": [
								"localhost"
							],
							"port": "5000",
							"path": [
								"api",
								"v1",
								"admin",
								"reviews"
							]
						}
					},
					"status": "OK",
					"code": 200,
					"_postman_previewlanguage": "json",
					"header": [
						{
							"key": "X-Powered-By",
							"value": "Express"
						},
						{
							"key": "Access-Control-Allow-Origin",
							"value": "*"
						},
						{
							"key": "Content-Type",
							"value": "application/json; charset=utf-8"
						},
						{
							"key": "Content-Length",
							"value": "899"
						},
						{
							"key": "ETag",
							"value": "W/\"383-xYAS1lGg8FwvY5OSNUpyur4mfCI\""
						},
						{
							"key": "Date",
							"value": "Fri, 22 Oct 2021 13:29:25 GMT"
						},
						{
							"key": "Connection",
							"value": "keep-alive"
						},
						{
							"key": "Keep-Alive",
							"value": "timeout=5"
						}
					],
					"cookie": [],
					"body": "[\n    {\n        \"title\": \"title1\",\n        \"content\": \"Greatest book ever\",\n        \"userId\": 1,\n        \"username\": \"neo\",\n        \"avatar\": \"neo-avatar.png\",\n        \"bookId\": 1,\n        \"bookTitle\": \"The Art of Loving\",\n        \"cover\": \"art-of-loving.jpg\"\n    },\n    {\n        \"title\": \"All time favorite book\",\n        \"content\": \"If you read one book in your life, let it be this one\",\n        \"userId\": 1,\n        \"username\": \"neo\",\n        \"avatar\": \"neo-avatar.png\",\n        \"bookId\": 2,\n        \"bookTitle\": \"Fahrenheit 451\",\n        \"cover\": \"fahrenheit-451.jpg\"\n    },\n    {\n        \"title\": \"title3\",\n        \"content\": \"My favourite\",\n        \"userId\": 1,\n        \"username\": \"neo\",\n        \"avatar\": \"neo-avatar.png\",\n        \"bookId\": 3,\n        \"bookTitle\": \"1984\",\n        \"cover\": \"1984.jpg\"\n    },\n    {\n        \"title\": \"Mediocre\",\n        \"content\": \"Didn't like it much\",\n        \"userId\": 2,\n        \"username\": \"morpheus\",\n        \"avatar\": \"morpheus-avatar.png\",\n        \"bookId\": 3,\n        \"bookTitle\": \"1984\",\n        \"cover\": \"1984.jpg\"\n    },\n    {\n        \"title\": \"Uber great\",\n        \"content\": \"I still think it's great!\",\n        \"userId\": 1,\n        \"username\": \"neo\",\n        \"avatar\": \"neo-avatar.png\",\n        \"bookId\": 6,\n        \"bookTitle\": \"Brave New World\",\n        \"cover\": \"brave-new-world.jpg\"\n    }\n]"
				}
			]
		},
		{
			"name": "admin book reviews add",
			"request": {
				"auth": {
					"type": "bearer",
					"bearer": [
						{
							"key": "token",
							"value": "{{token}}",
							"type": "string"
						}
					]
				},
				"method": "POST",
				"header": [],
				"body": {
					"mode": "raw",
					"raw": "{\r\n    \"title\": \"title6\",\r\n    \"content\": \"I still think it's great!\"\r\n}",
					"options": {
						"raw": {
							"language": "json"
						}
					}
				},
				"url": {
					"raw": "localhost:5000/api/v1/admin/books/4/reviews/1",
					"host": [
						"localhost"
					],
					"port": "5000",
					"path": [
						"api",
						"v1",
						"admin",
						"books",
						"4",
						"reviews",
						"1"
					]
				}
			},
			"response": [
				{
					"name": "admin book reviews add",
					"originalRequest": {
						"method": "POST",
						"header": [],
						"body": {
							"mode": "raw",
							"raw": "{\r\n    \"title\": \"title6\",\r\n    \"content\": \"I still think it's great!\"\r\n}",
							"options": {
								"raw": {
									"language": "json"
								}
							}
						},
						"url": {
							"raw": "localhost:5000/api/v1/admin/books/4/reviews/1",
							"host": [
								"localhost"
							],
							"port": "5000",
							"path": [
								"api",
								"v1",
								"admin",
								"books",
								"4",
								"reviews",
								"1"
							]
						}
					},
					"status": "OK",
					"code": 200,
					"_postman_previewlanguage": "json",
					"header": [
						{
							"key": "X-Powered-By",
							"value": "Express"
						},
						{
							"key": "Access-Control-Allow-Origin",
							"value": "*"
						},
						{
							"key": "Content-Type",
							"value": "application/json; charset=utf-8"
						},
						{
							"key": "Content-Length",
							"value": "197"
						},
						{
							"key": "ETag",
							"value": "W/\"c5-gJkGZCqFFHyqRPf277dFsOs87Qo\""
						},
						{
							"key": "Date",
							"value": "Fri, 22 Oct 2021 13:26:27 GMT"
						},
						{
							"key": "Connection",
							"value": "keep-alive"
						},
						{
							"key": "Keep-Alive",
							"value": "timeout=5"
						}
					],
					"cookie": [],
					"body": "{\n    \"title\": \"title6\",\n    \"content\": \"I still think it's great!\",\n    \"userId\": 1,\n    \"username\": \"neo\",\n    \"avatar\": \"into-the-wild.jpg\",\n    \"bookId\": 4,\n    \"bookTitle\": \"The Great Gatsby\",\n    \"cover\": \"the-great-gatsby.jpg\",\n    \"votes\": []\n}"
				}
			]
		},
		{
			"name": "admin book reviews update",
			"request": {
				"auth": {
					"type": "bearer",
					"bearer": [
						{
							"key": "token",
							"value": "{{token}}",
							"type": "string"
						}
					]
				},
				"method": "PUT",
				"header": [],
				"body": {
					"mode": "raw",
					"raw": "{\r\n    \"title\": \"A must!\",\r\n    \"content\": \"Definitely reader's choice!!\"\r\n}",
					"options": {
						"raw": {
							"language": "json"
						}
					}
				},
				"url": {
					"raw": "localhost:5000/api/v1/admin/books/3/reviews/2",
					"host": [
						"localhost"
					],
					"port": "5000",
					"path": [
						"api",
						"v1",
						"admin",
						"books",
						"3",
						"reviews",
						"2"
					]
				}
			},
			"response": [
				{
					"name": "admin book reviews update",
					"originalRequest": {
						"method": "PUT",
						"header": [],
						"body": {
							"mode": "raw",
							"raw": "{\r\n    \"title\": \"A must!\",\r\n    \"content\": \"Definitely reader's choice!!\"\r\n}",
							"options": {
								"raw": {
									"language": "json"
								}
							}
						},
						"url": {
							"raw": "localhost:5000/api/v1/admin/books/3/reviews/2",
							"host": [
								"localhost"
							],
							"port": "5000",
							"path": [
								"api",
								"v1",
								"admin",
								"books",
								"3",
								"reviews",
								"2"
							]
						}
					},
					"status": "OK",
					"code": 200,
					"_postman_previewlanguage": "json",
					"header": [
						{
							"key": "X-Powered-By",
							"value": "Express"
						},
						{
							"key": "Access-Control-Allow-Origin",
							"value": "*"
						},
						{
							"key": "Content-Type",
							"value": "application/json; charset=utf-8"
						},
						{
							"key": "Content-Length",
							"value": "239"
						},
						{
							"key": "ETag",
							"value": "W/\"ef-u+owvuyqqU4u/Wml+Jt+z1eh6zg\""
						},
						{
							"key": "Date",
							"value": "Fri, 22 Oct 2021 13:30:14 GMT"
						},
						{
							"key": "Connection",
							"value": "keep-alive"
						},
						{
							"key": "Keep-Alive",
							"value": "timeout=5"
						}
					],
					"cookie": [],
					"body": "{\n    \"title\": \"A must!\",\n    \"content\": \"Definitely reader's choice!!\",\n    \"userId\": 2,\n    \"username\": \"morpheus\",\n    \"avatar\": \"morpheus-avatar.png\",\n    \"bookId\": 3,\n    \"bookTitle\": \"1984\",\n    \"cover\": \"1984.jpg\",\n    \"votes\": [\n        {\n            \"userId\": 1,\n            \"username\": \"neo\",\n            \"avatar\": \"neo-avatar.png\"\n        }\n    ]\n}"
				}
			]
		},
		{
			"name": "admin book reviews remove",
			"request": {
				"auth": {
					"type": "bearer",
					"bearer": [
						{
							"key": "token",
							"value": "{{token}}",
							"type": "string"
						}
					]
				},
				"method": "DELETE",
				"header": [],
				"body": {
					"mode": "raw",
					"raw": "",
					"options": {
						"raw": {
							"language": "json"
						}
					}
				},
				"url": {
					"raw": "localhost:5000/api/v1/admin/books/3/reviews/2",
					"host": [
						"localhost"
					],
					"port": "5000",
					"path": [
						"api",
						"v1",
						"admin",
						"books",
						"3",
						"reviews",
						"2"
					]
				}
			},
			"response": [
				{
					"name": "admin book reviews remove",
					"originalRequest": {
						"method": "DELETE",
						"header": [],
						"body": {
							"mode": "raw",
							"raw": "",
							"options": {
								"raw": {
									"language": "json"
								}
							}
						},
						"url": {
							"raw": "localhost:5000/api/v1/admin/books/3/reviews/2",
							"host": [
								"localhost"
							],
							"port": "5000",
							"path": [
								"api",
								"v1",
								"admin",
								"books",
								"3",
								"reviews",
								"2"
							]
						}
					},
					"status": "OK",
					"code": 200,
					"_postman_previewlanguage": "json",
					"header": [
						{
							"key": "X-Powered-By",
							"value": "Express"
						},
						{
							"key": "Access-Control-Allow-Origin",
							"value": "*"
						},
						{
							"key": "Content-Type",
							"value": "application/json; charset=utf-8"
						},
						{
							"key": "Content-Length",
							"value": "173"
						},
						{
							"key": "ETag",
							"value": "W/\"ad-ZJ++7D/gCBM4jwuCEtOyvloy4fA\""
						},
						{
							"key": "Date",
							"value": "Fri, 22 Oct 2021 13:30:27 GMT"
						},
						{
							"key": "Connection",
							"value": "keep-alive"
						},
						{
							"key": "Keep-Alive",
							"value": "timeout=5"
						}
					],
					"cookie": [],
					"body": "{\n    \"title\": \"A must!\",\n    \"content\": \"Definitely reader's choice!!\",\n    \"userId\": 2,\n    \"username\": \"morpheus\",\n    \"avatar\": \"morpheus-avatar.png\",\n    \"bookId\": 3,\n    \"bookTitle\": \"1984\",\n    \"cover\": \"1984.jpg\"\n}"
				}
			]
		},
		{
			"name": "admin users all",
			"protocolProfileBehavior": {
				"disableBodyPruning": true
			},
			"request": {
				"auth": {
					"type": "bearer",
					"bearer": [
						{
							"key": "token",
							"value": "{{token}}",
							"type": "string"
						}
					]
				},
				"method": "GET",
				"header": [],
				"body": {
					"mode": "raw",
					"raw": "",
					"options": {
						"raw": {
							"language": "json"
						}
					}
				},
				"url": {
					"raw": "localhost:5000/api/v1/admin/users/",
					"host": [
						"localhost"
					],
					"port": "5000",
					"path": [
						"api",
						"v1",
						"admin",
						"users",
						""
					]
				}
			},
			"response": [
				{
					"name": "admin users all",
					"originalRequest": {
						"method": "GET",
						"header": [],
						"body": {
							"mode": "raw",
							"raw": "",
							"options": {
								"raw": {
									"language": "json"
								}
							}
						},
						"url": {
							"raw": "localhost:5000/api/v1/admin/users/",
							"host": [
								"localhost"
							],
							"port": "5000",
							"path": [
								"api",
								"v1",
								"admin",
								"users",
								""
							]
						}
					},
					"status": "OK",
					"code": 200,
					"_postman_previewlanguage": "json",
					"header": [
						{
							"key": "X-Powered-By",
							"value": "Express"
						},
						{
							"key": "Access-Control-Allow-Origin",
							"value": "*"
						},
						{
							"key": "Content-Type",
							"value": "application/json; charset=utf-8"
						},
						{
							"key": "Content-Length",
							"value": "451"
						},
						{
							"key": "ETag",
							"value": "W/\"1c3-ZfMqq1MFbj6JooEWUxoDPOH3xE0\""
						},
						{
							"key": "Date",
							"value": "Mon, 18 Oct 2021 19:28:42 GMT"
						},
						{
							"key": "Connection",
							"value": "keep-alive"
						},
						{
							"key": "Keep-Alive",
							"value": "timeout=5"
						}
					],
					"cookie": [],
					"body": "[\n    {\n        \"id\": 1,\n        \"username\": \"neo\",\n        \"role\": \"admin\",\n        \"deleted\": 0,\n        \"banstatus\": {\n            \"userId\": 1,\n            \"banned\": 1,\n            \"description\": \"Too many late returns\",\n            \"expiration\": 1633043760304\n        }\n    },\n    {\n        \"id\": 2,\n        \"username\": \"morpheus\",\n        \"role\": \"admin\",\n        \"deleted\": 0,\n        \"banstatus\": {\n            \"userId\": 2,\n            \"banned\": 0,\n            \"description\": \"Mean reviews\",\n            \"expiration\": 1633043666171\n        }\n    },\n    {\n        \"id\": 3,\n        \"username\": \"trinity\",\n        \"role\": \"user\",\n        \"deleted\": 0,\n        \"banstatus\": null\n    },\n    {\n        \"id\": 4,\n        \"username\": \"mrsmith\",\n        \"role\": \"user\",\n        \"deleted\": 0,\n        \"banstatus\": null\n    }\n]"
				}
			]
		},
		{
			"name": "admin user update",
			"request": {
				"auth": {
					"type": "bearer",
					"bearer": [
						{
							"key": "token",
							"value": "{{token}}",
							"type": "string"
						}
					]
				},
				"method": "PUT",
				"header": [],
				"body": {
					"mode": "raw",
					"raw": "{\r\n    \"role\": \"admin\",\r\n    \"deleted\": 0\r\n}",
					"options": {
						"raw": {
							"language": "json"
						}
					}
				},
				"url": {
					"raw": "localhost:5000/api/v1/admin/users/3",
					"host": [
						"localhost"
					],
					"port": "5000",
					"path": [
						"api",
						"v1",
						"admin",
						"users",
						"3"
					]
				}
			},
			"response": [
				{
					"name": "admin user update",
					"originalRequest": {
						"method": "PUT",
						"header": [],
						"body": {
							"mode": "raw",
							"raw": "{\r\n    \"role\": \"admin\",\r\n    \"deleted\": 0\r\n}",
							"options": {
								"raw": {
									"language": "json"
								}
							}
						},
						"url": {
							"raw": "localhost:5000/api/v1/admin/users/3",
							"host": [
								"localhost"
							],
							"port": "5000",
							"path": [
								"api",
								"v1",
								"admin",
								"users",
								"3"
							]
						}
					},
					"status": "OK",
					"code": 200,
					"_postman_previewlanguage": "json",
					"header": [
						{
							"key": "X-Powered-By",
							"value": "Express"
						},
						{
							"key": "Access-Control-Allow-Origin",
							"value": "*"
						},
						{
							"key": "Content-Type",
							"value": "application/json; charset=utf-8"
						},
						{
							"key": "Content-Length",
							"value": "103"
						},
						{
							"key": "ETag",
							"value": "W/\"67-Y42tW3486BjykdbRtYbYQpOL9Tw\""
						},
						{
							"key": "Date",
							"value": "Mon, 18 Oct 2021 23:00:00 GMT"
						},
						{
							"key": "Connection",
							"value": "keep-alive"
						},
						{
							"key": "Keep-Alive",
							"value": "timeout=5"
						}
					],
					"cookie": [],
					"body": "{\n    \"id\": 3,\n    \"username\": \"trinity\",\n    \"role\": \"admin\",\n    \"avatar\": \"trinity-avatar.png\",\n    \"deleted\": 0,\n    \"banstatus\": null\n}"
				}
			]
		},
		{
			"name": "admin user remove",
			"request": {
				"auth": {
					"type": "bearer",
					"bearer": [
						{
							"key": "token",
							"value": "{{token}}",
							"type": "string"
						}
					]
				},
				"method": "DELETE",
				"header": [],
				"body": {
					"mode": "raw",
					"raw": "",
					"options": {
						"raw": {
							"language": "json"
						}
					}
				},
				"url": {
					"raw": "localhost:5000/api/v1/admin/users/3",
					"host": [
						"localhost"
					],
					"port": "5000",
					"path": [
						"api",
						"v1",
						"admin",
						"users",
						"3"
					]
				}
			},
			"response": [
				{
					"name": "admin user remove",
					"originalRequest": {
						"method": "DELETE",
						"header": [],
						"body": {
							"mode": "raw",
							"raw": "",
							"options": {
								"raw": {
									"language": "json"
								}
							}
						},
						"url": {
							"raw": "localhost:5000/api/v1/admin/users/3",
							"host": [
								"localhost"
							],
							"port": "5000",
							"path": [
								"api",
								"v1",
								"admin",
								"users",
								"3"
							]
						}
					},
					"status": "OK",
					"code": 200,
					"_postman_previewlanguage": "json",
					"header": [
						{
							"key": "X-Powered-By",
							"value": "Express"
						},
						{
							"key": "Access-Control-Allow-Origin",
							"value": "*"
						},
						{
							"key": "Content-Type",
							"value": "application/json; charset=utf-8"
						},
						{
							"key": "Content-Length",
							"value": "55"
						},
						{
							"key": "ETag",
							"value": "W/\"37-4XRZZcSStJ+HGLfes26H2qgAnEw\""
						},
						{
							"key": "Date",
							"value": "Mon, 18 Oct 2021 19:39:30 GMT"
						},
						{
							"key": "Connection",
							"value": "keep-alive"
						},
						{
							"key": "Keep-Alive",
							"value": "timeout=5"
						}
					],
					"cookie": [],
					"body": "{\n    \"id\": 3,\n    \"username\": \"trinity\",\n    \"role\": \"user\",\n    \"deleted\": 1\n}"
				}
			]
		},
		{
			"name": "admin user ban",
			"request": {
				"auth": {
					"type": "bearer",
					"bearer": [
						{
							"key": "token",
							"value": "{{token}}",
							"type": "string"
						}
					]
				},
				"method": "PUT",
				"header": [],
				"body": {
					"mode": "raw",
					"raw": "{\r\n    \"description\": \"many late returns\",\r\n    \"expiration\": 1638223200000,\r\n    \"banned\": 0\r\n}",
					"options": {
						"raw": {
							"language": "json"
						}
					}
				},
				"url": {
					"raw": "localhost:5000/api/v1/admin/users/3/ban",
					"host": [
						"localhost"
					],
					"port": "5000",
					"path": [
						"api",
						"v1",
						"admin",
						"users",
						"3",
						"ban"
					]
				}
			},
			"response": [
				{
					"name": "admin user ban",
					"originalRequest": {
						"method": "PUT",
						"header": [],
						"body": {
							"mode": "raw",
							"raw": "{\r\n    \"description\": \"many late returns\",\r\n    \"expiration\": 1638223200000,\r\n    \"banned\": 0\r\n}",
							"options": {
								"raw": {
									"language": "json"
								}
							}
						},
						"url": {
							"raw": "localhost:5000/api/v1/admin/users/3/ban",
							"host": [
								"localhost"
							],
							"port": "5000",
							"path": [
								"api",
								"v1",
								"admin",
								"users",
								"3",
								"ban"
							]
						}
					},
					"status": "OK",
					"code": 200,
					"_postman_previewlanguage": "json",
					"header": [
						{
							"key": "X-Powered-By",
							"value": "Express"
						},
						{
							"key": "Access-Control-Allow-Origin",
							"value": "*"
						},
						{
							"key": "Content-Type",
							"value": "application/json; charset=utf-8"
						},
						{
							"key": "Content-Length",
							"value": "193"
						},
						{
							"key": "ETag",
							"value": "W/\"c1-v5CdTtqSPi64PaFPbeAwuH2XK54\""
						},
						{
							"key": "Date",
							"value": "Thu, 21 Oct 2021 10:55:17 GMT"
						},
						{
							"key": "Connection",
							"value": "keep-alive"
						},
						{
							"key": "Keep-Alive",
							"value": "timeout=5"
						}
					],
					"cookie": [],
					"body": "{\n    \"id\": 3,\n    \"username\": \"trinity\",\n    \"role\": \"user\",\n    \"avatar\": \"trinity-avatar.png\",\n    \"points\": 0,\n    \"deleted\": 0,\n    \"banstatus\": {\n        \"userId\": 3,\n        \"banned\": 0,\n        \"description\": \"many late returns\",\n        \"expiration\": 1638223200000\n    }\n}"
				}
			]
		}
	]
}