Library\Bee\artifacts\mvdfrm\Unity.InputSystem.ref.dll_FD2EC87C14EBE081.mvfrm
Library\Bee\artifacts\mvdfrm\UnityEditor.UI.ref.dll_4C98D3F7040CD4F5.mvfrm
Library\Bee\artifacts\mvdfrm\UnityEngine.UI.ref.dll_08FEAA520A2EFD60.mvfrm
Library\Bee\artifacts\mvdfrm\UnityEditor.Graphs.dll_2DA16FE0D6800DFA.mvfrm
Library\Bee\artifacts\mvdfrm\UnityEditor.CoreModule.dll_8EC1383C74AB4BC8.mvfrm
Library\Bee\artifacts\mvdfrm\UnityEditor.DeviceSimulatorModule.dll_690B3255249F4479.mvfrm
Library\Bee\artifacts\mvdfrm\UnityEditor.DiagnosticsModule.dll_1BCD7C0C5F583087.mvfrm
Library\Bee\artifacts\mvdfrm\UnityEditor.dll_761C9F311C74934D.mvfrm
Library\Bee\artifacts\mvdfrm\UnityEditor.GraphViewModule.dll_2345E78B64EE097E.mvfrm
Library\Bee\artifacts\mvdfrm\UnityEditor.PackageManagerUIModule.dll_14BDFD6C85480F24.mvfrm
Library\Bee\artifacts\mvdfrm\UnityEditor.QuickSearchModule.dll_A6DCFD19B82F2CE0.mvfrm
Library\Bee\artifacts\mvdfrm\UnityEditor.SceneTemplateModule.dll_FEF617DA34C8C761.mvfrm
Library\Bee\artifacts\mvdfrm\UnityEditor.TextCoreFontEngineModule.dll_6E7F4657A232BC46.mvfrm
Library\Bee\artifacts\mvdfrm\UnityEditor.TextCoreTextEngineModule.dll_B6677CC931B67564.mvfrm
Library\Bee\artifacts\mvdfrm\UnityEditor.UIBuilderModule.dll_77CE94A7D7A682B2.mvfrm
Library\Bee\artifacts\mvdfrm\UnityEditor.UIElementsModule.dll_C208D27A76A95604.mvfrm
Library\Bee\artifacts\mvdfrm\UnityEditor.UIElementsSamplesModule.dll_3E85AFE0EC4697A9.mvfrm
Library\Bee\artifacts\mvdfrm\UnityEditor.UIServiceModule.dll_B0C0A60AC0DDD2CC.mvfrm
Library\Bee\artifacts\mvdfrm\UnityEditor.UnityConnectModule.dll_BAC43202750DDE7E.mvfrm
Library\Bee\artifacts\mvdfrm\UnityEngine.AccessibilityModule.dll_319B8371353EEEFE.mvfrm
Library\Bee\artifacts\mvdfrm\UnityEngine.AIModule.dll_BE48FC8B23ED711C.mvfrm
Library\Bee\artifacts\mvdfrm\UnityEngine.AndroidJNIModule.dll_4051BB4DBFC8C4DA.mvfrm
Library\Bee\artifacts\mvdfrm\UnityEngine.AnimationModule.dll_F1CB63B43F4ADE24.mvfrm
Library\Bee\artifacts\mvdfrm\UnityEngine.ARModule.dll_77BBC18E810ACFE5.mvfrm
Library\Bee\artifacts\mvdfrm\UnityEngine.AssetBundleModule.dll_EAC6300B1A95E1D2.mvfrm
Library\Bee\artifacts\mvdfrm\UnityEngine.AudioModule.dll_8C9451F6633A1616.mvfrm
Library\Bee\artifacts\mvdfrm\UnityEngine.ClothModule.dll_F37CAEF13D56F4FA.mvfrm
Library\Bee\artifacts\mvdfrm\UnityEngine.ClusterInputModule.dll_3A60A7182695B144.mvfrm
Library\Bee\artifacts\mvdfrm\UnityEngine.ClusterRendererModule.dll_6EB7F4C6945A51FD.mvfrm
Library\Bee\artifacts\mvdfrm\UnityEngine.CoreModule.dll_B1E20B8F1CB0B6F3.mvfrm
Library\Bee\artifacts\mvdfrm\UnityEngine.CrashReportingModule.dll_94BA83473323A06B.mvfrm
Library\Bee\artifacts\mvdfrm\UnityEngine.DirectorModule.dll_67FC8B298EA1A9D0.mvfrm
Library\Bee\artifacts\mvdfrm\UnityEngine.dll_A8C0E6097AE82032.mvfrm
Library\Bee\artifacts\mvdfrm\UnityEngine.DSPGraphModule.dll_6D4DEC9301027AF1.mvfrm
Library\Bee\artifacts\mvdfrm\UnityEngine.GameCenterModule.dll_6A9F05688609B5CB.mvfrm
Library\Bee\artifacts\mvdfrm\UnityEngine.GIModule.dll_56854598BF9C5936.mvfrm
Library\Bee\artifacts\mvdfrm\UnityEngine.GridModule.dll_8F53277D35054CEA.mvfrm
Library\Bee\artifacts\mvdfrm\UnityEngine.HotReloadModule.dll_731421BA1A7DF9A6.mvfrm
Library\Bee\artifacts\mvdfrm\UnityEngine.ImageConversionModule.dll_DAA9F277167F09F1.mvfrm
Library\Bee\artifacts\mvdfrm\UnityEngine.IMGUIModule.dll_C4F3F15D296BA9F7.mvfrm
Library\Bee\artifacts\mvdfrm\UnityEngine.InputLegacyModule.dll_7C0B4B29B28797C3.mvfrm
Library\Bee\artifacts\mvdfrm\UnityEngine.InputModule.dll_F30A19A6D9723ABA.mvfrm
Library\Bee\artifacts\mvdfrm\UnityEngine.JSONSerializeModule.dll_91B30CAD347A4F88.mvfrm
Library\Bee\artifacts\mvdfrm\UnityEngine.LocalizationModule.dll_78AD716ABE11A43D.mvfrm
Library\Bee\artifacts\mvdfrm\UnityEngine.ParticleSystemModule.dll_E7CCCC93A1352BF9.mvfrm
Library\Bee\artifacts\mvdfrm\UnityEngine.PerformanceReportingModule.dll_D35423AD6C85FEB2.mvfrm
Library\Bee\artifacts\mvdfrm\UnityEngine.Physics2DModule.dll_3E7153A4E047D5B9.mvfrm
Library\Bee\artifacts\mvdfrm\UnityEngine.PhysicsModule.dll_1BC510536370FFA7.mvfrm
Library\Bee\artifacts\mvdfrm\UnityEngine.ProfilerModule.dll_9A42C46027FB30DD.mvfrm
Library\Bee\artifacts\mvdfrm\UnityEngine.RuntimeInitializeOnLoadManagerInitializerModule.dll_5EDE7BBBC61A3882.mvfrm
Library\Bee\artifacts\mvdfrm\UnityEngine.ScreenCaptureModule.dll_AB9ABA3248E67BEA.mvfrm
Library\Bee\artifacts\mvdfrm\UnityEngine.SharedInternalsModule.dll_5EBB314C8DAD0541.mvfrm
Library\Bee\artifacts\mvdfrm\UnityEngine.SpriteMaskModule.dll_53CB77F8A7794B45.mvfrm
Library\Bee\artifacts\mvdfrm\UnityEngine.SpriteShapeModule.dll_04275D65D03819DC.mvfrm
Library\Bee\artifacts\mvdfrm\UnityEngine.StreamingModule.dll_A66051048ED29562.mvfrm
Library\Bee\artifacts\mvdfrm\UnityEngine.SubstanceModule.dll_830B654DDA259370.mvfrm
Library\Bee\artifacts\mvdfrm\UnityEngine.SubsystemsModule.dll_BE78DE5A75C13358.mvfrm
Library\Bee\artifacts\mvdfrm\UnityEngine.TerrainModule.dll_360B8BC2392F4895.mvfrm
Library\Bee\artifacts\mvdfrm\UnityEngine.TerrainPhysicsModule.dll_E8477566BA782686.mvfrm
Library\Bee\artifacts\mvdfrm\UnityEngine.TextCoreFontEngineModule.dll_ECDEC1AAB5307B11.mvfrm
Library\Bee\artifacts\mvdfrm\UnityEngine.TextCoreTextEngineModule.dll_34C6F81C44B4342F.mvfrm
Library\Bee\artifacts\mvdfrm\UnityEngine.TextRenderingModule.dll_D4DA2C3D001DFBDF.mvfrm
Library\Bee\artifacts\mvdfrm\UnityEngine.TilemapModule.dll_D507F34350EC299E.mvfrm
Library\Bee\artifacts\mvdfrm\UnityEngine.TLSModule.dll_FBAF6209AAC48EBB.mvfrm
Library\Bee\artifacts\mvdfrm\UnityEngine.UIElementsModule.dll_C2B73FC278ED6F4F.mvfrm
Library\Bee\artifacts\mvdfrm\UnityEngine.UIElementsNativeModule.dll_5F37B201F6C07F46.mvfrm
Library\Bee\artifacts\mvdfrm\UnityEngine.UIModule.dll_B9BC9AB8803476C8.mvfrm
Library\Bee\artifacts\mvdfrm\UnityEngine.UmbraModule.dll_0768FE0EF060C189.mvfrm
Library\Bee\artifacts\mvdfrm\UnityEngine.UNETModule.dll_4488537869BFAC6C.mvfrm
Library\Bee\artifacts\mvdfrm\UnityEngine.UnityAnalyticsCommonModule.dll_6E92E0F1866E9D10.mvfrm
Library\Bee\artifacts\mvdfrm\UnityEngine.UnityAnalyticsModule.dll_076C3D5D4D5C7DF5.mvfrm
Library\Bee\artifacts\mvdfrm\UnityEngine.UnityConnectModule.dll_A823B6116F95DF29.mvfrm
Library\Bee\artifacts\mvdfrm\UnityEngine.UnityCurlModule.dll_24E804E5AF5ED011.mvfrm
Library\Bee\artifacts\mvdfrm\UnityEngine.UnityTestProtocolModule.dll_FA4865D34641ECFF.mvfrm
Library\Bee\artifacts\mvdfrm\UnityEngine.UnityWebRequestAssetBundleModule.dll_5D0D7AD826269086.mvfrm
Library\Bee\artifacts\mvdfrm\UnityEngine.UnityWebRequestAudioModule.dll_4B50778BF2F0C94A.mvfrm
Library\Bee\artifacts\mvdfrm\UnityEngine.UnityWebRequestModule.dll_EC48FA212173A470.mvfrm
Library\Bee\artifacts\mvdfrm\UnityEngine.UnityWebRequestTextureModule.dll_2FF2D0594813CC5F.mvfrm
Library\Bee\artifacts\mvdfrm\UnityEngine.UnityWebRequestWWWModule.dll_FF893D783473F09B.mvfrm
Library\Bee\artifacts\mvdfrm\UnityEngine.VehiclesModule.dll_DFBF84A908CB796B.mvfrm
Library\Bee\artifacts\mvdfrm\UnityEngine.VFXModule.dll_7C8DFA788131F828.mvfrm
Library\Bee\artifacts\mvdfrm\UnityEngine.VideoModule.dll_B19DD66125CC31BB.mvfrm
Library\Bee\artifacts\mvdfrm\UnityEngine.VirtualTexturingModule.dll_83C46670CF6EFFD1.mvfrm
Library\Bee\artifacts\mvdfrm\UnityEngine.VRModule.dll_0C8EC13E21EEFC40.mvfrm
Library\Bee\artifacts\mvdfrm\UnityEngine.WindModule.dll_2830E6B7ADE7355C.mvfrm
Library\Bee\artifacts\mvdfrm\UnityEngine.XRModule.dll_3F4D8442AB29499E.mvfrm
Library\Bee\artifacts\mvdfrm\Unity.Android.Gradle.dll_50216FDA7DF979B0.mvfrm
Library\Bee\artifacts\mvdfrm\Unity.Android.Types.dll_158108870A6B458C.mvfrm
Library\Bee\artifacts\mvdfrm\UnityEditor.Android.Extensions.dll_5A66C2E943C013F0.mvfrm
Library\Bee\artifacts\mvdfrm\UnityEditor.WindowsStandalone.Extensions.dll_06AA0900ED466A58.mvfrm
Library\Bee\artifacts\mvdfrm\Unity.Burst.Cecil.dll_A3F624564A794E94.mvfrm
Library\Bee\artifacts\mvdfrm\Unity.Burst.Cecil.Mdb.dll_54753224AC1596D1.mvfrm
Library\Bee\artifacts\mvdfrm\Unity.Burst.Cecil.Pdb.dll_6BC7AA942ACA9854.mvfrm
Library\Bee\artifacts\mvdfrm\Unity.Burst.Cecil.Rocks.dll_9860DFF941D02AF4.mvfrm
Library\Bee\artifacts\mvdfrm\Unity.Plastic.Antlr3.Runtime.dll_E8491891C2B41834.mvfrm
Library\Bee\artifacts\mvdfrm\Unity.Plastic.Newtonsoft.Json.dll_F3C510DB43F9F7C1.mvfrm
Library\Bee\artifacts\mvdfrm\Unity.VisualScripting.IonicZip.dll_D3CD9F455975AE56.mvfrm
Library\Bee\artifacts\mvdfrm\Unity.VisualScripting.YamlDotNet.dll_D9568F9084626706.mvfrm
Library\Bee\artifacts\mvdfrm\Unity.VisualScripting.TextureAssets.dll_7074B8E4452FC4FE.mvfrm
Library\Bee\artifacts\mvdfrm\Unity.VisualScripting.Antlr3.Runtime.dll_8AC3B671B52B7725.mvfrm