<?xml version="1.0" encoding="iso-8859-1"?>
<!-- Generator: Adobe Illustrator 18.1.1, SVG Export Plug-In . SVG Version: 6.00 Build 0)  -->
<svg version="1.1" xmlns="http://www.w3.org/2000/svg" xmlns:xlink="http://www.w3.org/1999/xlink" x="0px" y="0px" width="1000px"
	 height="768.5px" viewBox="0 0 1000 768.5" enable-background="new 0 0 1000 768.5" xml:space="preserve">
<g id="Back">
	<rect y="0" fill="#515151" width="1000" height="768.5"/>
</g>
<g id="Exit_button">
	<path fill="#472318" d="M647.9,726.7c-10.8-1.9-11-13.6-11-13.6h-5.1c0.7,15.6,15.2,17.1,15.2,17.1h13v-3.5
		C660,726.7,649.1,726.9,647.9,726.7z"/>
	<rect x="660" y="726.7" fill="#472318" width="264.7" height="3.5"/>
	<path fill="#804F38" d="M631.8,659.8l6.7-1.4c0,0-1.4-11.7,9.5-13.6c1.1-0.2,13.3,0,13.3,0v-3.5H647
		C647,641.3,631,643.6,631.8,659.8z"/>
	<rect x="661" y="641.3" fill="#804F38" width="262.7" height="3.5"/>
	<path fill="#472318" d="M936.7,726.7c-1.2,0.2-12,0-12,0v3.5h13c0,0,14.5-1.5,15.2-17.1h-5.3C947.6,713.1,947.6,724.8,936.7,726.7z
		"/>
	<path fill="#804F38" d="M937.6,641.3h-14.2v3.5c0,0,12.1-0.2,13.3,0c10.8,1.9,10.9,13.6,10.9,13.6l5.2,1.4
		C953.7,643.6,937.6,641.3,937.6,641.3z"/>
	<linearGradient id="SVGID_1_" gradientUnits="userSpaceOnUse" x1="635.1111" y1="712.1198" x2="635.1111" y2="657.7256">
		<stop  offset="0" style="stop-color:#442116"/>
		<stop  offset="0.9961" style="stop-color:#805038"/>
	</linearGradient>
	<polygon fill="url(#SVGID_1_)" points="631.8,713.1 637.4,713.1 638.5,658.4 631.8,659.8 	"/>
	<linearGradient id="SVGID_2_" gradientUnits="userSpaceOnUse" x1="949.9779" y1="711.5984" x2="949.9779" y2="659.2343">
		<stop  offset="0" style="stop-color:#442116"/>
		<stop  offset="0.9961" style="stop-color:#805038"/>
	</linearGradient>
	<polygon fill="url(#SVGID_2_)" points="947.1,713.1 952.9,713.1 952.9,659.8 947.7,658.4 	"/>
	<linearGradient id="SVGID_3_" gradientUnits="userSpaceOnUse" x1="792.3303" y1="645.5337" x2="792.3303" y2="725.6181">
		<stop  offset="0" style="stop-color:#FFE853"/>
		<stop  offset="0.1286" style="stop-color:#FADE4E"/>
		<stop  offset="0.3448" style="stop-color:#ECC441"/>
		<stop  offset="0.6219" style="stop-color:#D59A2C"/>
		<stop  offset="0.9463" style="stop-color:#B75F0E"/>
		<stop  offset="1" style="stop-color:#B15509"/>
	</linearGradient>
	<path fill="url(#SVGID_3_)" d="M948.2,656.5v58.6c0,0-1,10.1-10.4,11.8H646.9c-9.4-1.6-10.4-11.8-10.4-11.8v-58.6
		c0,0,1-10.1,10.4-11.8h290.8C947.1,646.3,948.2,656.5,948.2,656.5z"/>
	<path fill="#DE9D1C" d="M948.1,663.7v44.2c0,0-1,10.1-10.4,11.8H646.9c-9.4-1.6-10.4-11.8-10.4-11.8v-44.2c0,0,0.3-3.1,2.2-6.2
		c-0.2,0.9-0.3,1.5-0.3,1.5v44.9c0,0,1,10.2,10.1,11.8h287.2c9.1-1.6,10.1-11.8,10.1-11.8V659c0,0-0.1-1-0.5-2.4
		C947.8,660,948.1,663.7,948.1,663.7z"/>
	<path opacity="0.4" fill="#FFF0A9" d="M940.3,660.6v15.3c0,0-0.9,8.6-8.9,10H653.6c-8-1.4-8.9-10-8.9-10v-15.3c0,0,0.9-8.6,8.9-10
		h277.9C939.4,651.9,940.3,660.6,940.3,660.6z"/>
	<path fill="#F4F198" d="M948.1,656.5v5.9c0,0-1-10.1-10.4-11.8H646.9c-9.4,1.6-10.4,11.8-10.4,11.8v-5.9c0,0,1-10.1,10.4-11.8
		h290.8C947.1,646.3,948.1,656.5,948.1,656.5z"/>
</g>
<g id="Exit_button_text">
	<g>
		<g>
			<path fill="#601D00" d="M767.3,692.8c0.6,0.6,0.9,1.3,0.9,2.1c0,0.8-0.3,1.5-0.9,2.1c-0.6,0.6-1.3,0.9-2.1,0.9H747
				c-0.8,0-1.5-0.3-2.1-0.9c-0.6-0.6-0.9-1.3-0.9-2.1v-25.7c0-0.6,0.1-1.1,0.4-1.5c0.3-0.5,0.7-0.8,1.1-1.1c0.6-0.5,1.2-0.8,2-0.8
				h17.7c0.8,0,1.5,0.3,2.1,0.9c0.6,0.6,0.9,1.3,0.9,2.1c0,0.9-0.3,1.6-0.9,2.1c-0.6,0.6-1.3,0.9-2.1,0.9H750v6.2h15.2
				c0.8,0,1.5,0.3,2.1,0.9s0.9,1.3,0.9,2.1c0,0.8-0.3,1.5-0.9,2.1s-1.3,0.9-2.1,0.9H764h-0.2H750v7.9h15.2
				C766,692,766.7,692.3,767.3,692.8z"/>
			<path fill="#601D00" d="M797.5,666.6c0.6,0.5,1,1.2,1.1,2s-0.1,1.5-0.7,2.2l-8.9,11.1l8.9,11.1c0.5,0.6,0.8,1.4,0.7,2.2
				s-0.5,1.5-1.1,2c-0.3,0.2-0.6,0.4-0.9,0.5s-0.6,0.2-1,0.2c-0.5,0-0.9-0.1-1.3-0.3c-0.4-0.2-0.8-0.5-1.1-0.8l-8.1-10.1l-8.1,10.1
				c-0.3,0.4-0.6,0.7-1.1,0.8c-0.4,0.2-0.8,0.3-1.3,0.3c-0.7,0-1.3-0.2-1.9-0.7c-0.6-0.5-1-1.2-1.1-2c-0.1-0.8,0.1-1.5,0.6-2.2
				l8.9-11.1l-8.9-11.1c-0.5-0.6-0.7-1.4-0.6-2.2c0.1-0.8,0.4-1.5,1.1-2c0.6-0.5,1.4-0.8,2.2-0.7c0.8,0.1,1.5,0.5,2,1.1l8.1,10.1
				l8.1-10.1c0.5-0.6,1.2-1,2-1.1C796.1,665.9,796.9,666.1,797.5,666.6z"/>
			<path fill="#601D00" d="M806.1,665.9c0.9,0,1.6,0.3,2.1,0.9c0.6,0.6,0.9,1.3,0.9,2.1v26c0,0.8-0.3,1.5-0.9,2.1
				c-0.6,0.6-1.3,0.9-2.1,0.9c-0.8,0-1.5-0.3-2.1-0.9c-0.6-0.6-0.9-1.3-0.9-2.1v-26c0-0.8,0.3-1.5,0.9-2.1
				C804.5,666.2,805.2,665.9,806.1,665.9z"/>
			<path fill="#601D00" d="M825.9,697.9c-0.9,0-1.6-0.3-2.1-0.9c-0.6-0.6-0.9-1.3-0.9-2.1v-23h-7.2c-0.8,0-1.5-0.3-2.1-0.9
				c-0.6-0.6-0.9-1.3-0.9-2.1c0-0.8,0.3-1.5,0.9-2.1c0.6-0.6,1.3-0.9,2.1-0.9H836c0.9,0,1.6,0.3,2.1,0.9c0.6,0.6,0.9,1.3,0.9,2.1
				c0,0.9-0.3,1.6-0.9,2.1c-0.6,0.6-1.3,0.9-2.1,0.9h-7.2v23c0,0.8-0.3,1.5-0.9,2.1C827.4,697.7,826.7,697.9,825.9,697.9z"/>
		</g>
	</g>
</g>
<g id="Restart_button">
	<path fill="#472318" d="M647.9,607.5c-10.8-1.9-11-13.6-11-13.6h-5.1c0.7,15.6,15.2,17.1,15.2,17.1h13v-3.5
		C660,607.5,649.1,607.7,647.9,607.5z"/>
	<rect x="660" y="607.5" fill="#472318" width="264.7" height="3.5"/>
	<path fill="#804F38" d="M631.8,540.7l6.7-1.4c0,0-1.4-11.7,9.5-13.6c1.1-0.2,13.3,0,13.3,0v-3.5H647
		C647,522.1,631,524.5,631.8,540.7z"/>
	<rect x="661" y="522.1" fill="#804F38" width="262.7" height="3.5"/>
	<path fill="#472318" d="M936.7,607.5c-1.2,0.2-12,0-12,0v3.5h13c0,0,14.5-1.5,15.2-17.1h-5.3C947.6,593.9,947.6,605.7,936.7,607.5z
		"/>
	<path fill="#804F38" d="M937.6,522.1h-14.2v3.5c0,0,12.1-0.2,13.3,0c10.8,1.9,10.9,13.6,10.9,13.6l5.2,1.4
		C953.7,524.5,937.6,522.1,937.6,522.1z"/>
	<linearGradient id="SVGID_4_" gradientUnits="userSpaceOnUse" x1="635.1111" y1="592.9753" x2="635.1111" y2="538.5812">
		<stop  offset="0" style="stop-color:#442116"/>
		<stop  offset="0.9961" style="stop-color:#805038"/>
	</linearGradient>
	<polygon fill="url(#SVGID_4_)" points="631.8,593.9 637.4,593.9 638.5,539.3 631.8,540.7 	"/>
	<linearGradient id="SVGID_5_" gradientUnits="userSpaceOnUse" x1="949.9779" y1="592.4539" x2="949.9779" y2="540.0897">
		<stop  offset="0" style="stop-color:#442116"/>
		<stop  offset="0.9961" style="stop-color:#805038"/>
	</linearGradient>
	<polygon fill="url(#SVGID_5_)" points="947.1,593.9 952.9,593.9 952.9,540.7 947.7,539.3 	"/>
	<linearGradient id="SVGID_6_" gradientUnits="userSpaceOnUse" x1="792.3303" y1="526.3892" x2="792.3303" y2="606.4736">
		<stop  offset="0" style="stop-color:#FFE853"/>
		<stop  offset="0.1286" style="stop-color:#FADE4E"/>
		<stop  offset="0.3448" style="stop-color:#ECC441"/>
		<stop  offset="0.6219" style="stop-color:#D59A2C"/>
		<stop  offset="0.9463" style="stop-color:#B75F0E"/>
		<stop  offset="1" style="stop-color:#B15509"/>
	</linearGradient>
	<path fill="url(#SVGID_6_)" d="M948.2,537.3V596c0,0-1,10.1-10.4,11.8H646.9c-9.4-1.6-10.4-11.8-10.4-11.8v-58.6
		c0,0,1-10.1,10.4-11.8h290.8C947.1,527.2,948.2,537.3,948.2,537.3z"/>
	<path fill="#DE9D1C" d="M948.1,544.6v44.2c0,0-1,10.1-10.4,11.8H646.9c-9.4-1.6-10.4-11.8-10.4-11.8v-44.2c0,0,0.3-3.1,2.2-6.2
		c-0.2,0.9-0.3,1.5-0.3,1.5v44.9c0,0,1,10.2,10.1,11.8h287.2c9.1-1.6,10.1-11.8,10.1-11.8v-44.9c0,0-0.1-1-0.5-2.4
		C947.8,540.8,948.1,544.6,948.1,544.6z"/>
	<path opacity="0.4" fill="#FFF0A9" d="M940.3,541.4v15.3c0,0-0.9,8.6-8.9,10H653.6c-8-1.4-8.9-10-8.9-10v-15.3c0,0,0.9-8.6,8.9-10
		h277.9C939.4,532.8,940.3,541.4,940.3,541.4z"/>
	<path fill="#F4F198" d="M948.1,537.3v5.9c0,0-1-10.1-10.4-11.8H646.9c-9.4,1.6-10.4,11.8-10.4,11.8v-5.9c0,0,1-10.1,10.4-11.8
		h290.8C947.1,527.2,948.1,537.3,948.1,537.3z"/>
</g>
<g id="Restart_button_text">
	<g>
		<g>
			<path fill="#601D00" d="M693.6,578.8c-0.8,0-1.5-0.3-2.1-0.9c-0.6-0.6-0.9-1.3-0.9-2.1v-26c0-0.8,0.3-1.5,0.9-2.1
				c0.6-0.6,1.3-0.9,2.1-0.9h13.4c1.4,0,2.7,0.3,3.9,0.8c1.2,0.5,2.3,1.2,3.2,2.1s1.6,2,2.1,3.2c0.5,1.2,0.8,2.5,0.8,3.9
				c0,1.2-0.2,2.3-0.6,3.4c-0.4,1.1-1,2.1-1.7,2.9c-0.7,0.9-1.5,1.6-2.5,2.2c-1,0.6-2,1-3.1,1.3l7,7c0.6,0.6,0.9,1.3,0.9,2.1
				c0,0.8-0.3,1.5-0.9,2.1c-0.3,0.3-0.6,0.5-1,0.7c-0.4,0.1-0.7,0.2-1.1,0.2s-0.7-0.1-1.1-0.2c-0.4-0.1-0.7-0.4-1-0.7l-11.1-11.1
				h-4.2v9c0,0.8-0.3,1.5-0.9,2.1C695.2,578.5,694.5,578.8,693.6,578.8z M711.1,556.8c0-1.1-0.4-2.1-1.2-2.8
				c-0.8-0.8-1.7-1.1-2.8-1.1h-10.4v8h5.5h5c1.1,0,2.1-0.4,2.8-1.2C710.7,558.9,711.1,557.9,711.1,556.8z"/>
			<path fill="#601D00" d="M744.8,573.7c0.6,0.6,0.9,1.3,0.9,2.1c0,0.8-0.3,1.5-0.9,2.1c-0.6,0.6-1.3,0.9-2.1,0.9h-18.2
				c-0.8,0-1.5-0.3-2.1-0.9c-0.6-0.6-0.9-1.3-0.9-2.1v-25.7c0-0.6,0.1-1.1,0.4-1.5c0.3-0.5,0.7-0.8,1.1-1.1c0.6-0.5,1.2-0.8,2-0.8
				h17.7c0.8,0,1.5,0.3,2.1,0.9c0.6,0.6,0.9,1.3,0.9,2.1c0,0.9-0.3,1.6-0.9,2.1c-0.6,0.6-1.3,0.9-2.1,0.9h-15.2v6.2h15.2
				c0.8,0,1.5,0.3,2.1,0.9s0.9,1.3,0.9,2.1c0,0.8-0.3,1.5-0.9,2.1s-1.3,0.9-2.1,0.9h-1.2h-0.2h-13.8v7.9h15.2
				C743.5,572.8,744.2,573.1,744.8,573.7z"/>
			<path fill="#601D00" d="M749.2,557.3c0-1.4,0.4-2.8,1.1-4s1.7-2.4,2.9-3.3s2.6-1.7,4.3-2.3c1.6-0.6,3.3-0.8,5.1-0.8h10.8
				c0.9,0,1.6,0.3,2.1,0.9c0.6,0.6,0.9,1.3,0.9,2.1s-0.3,1.5-0.9,2.1c-0.6,0.6-1.3,0.9-2.1,0.9h-10.8c-1.1,0-2.1,0.2-3,0.5
				s-1.7,0.7-2.3,1.1c-0.6,0.4-1.1,0.9-1.5,1.5c-0.3,0.5-0.5,1-0.5,1.4c0,1,0.2,1.6,0.6,2c0.3,0.3,0.7,0.5,1.2,0.6
				c0.5,0.1,1.2,0.2,1.8,0.3s1.4,0.1,2.1,0.1s1.5,0,2.2,0c1,0,2.1,0,3.1,0c1,0,2,0.1,3,0.2s1.9,0.4,2.7,0.7c0.9,0.3,1.6,0.9,2.3,1.5
				c1.4,1.4,2.1,3.2,2.1,5.6c0,1.5-0.3,2.8-1,4.1s-1.6,2.4-2.8,3.3c-1.2,0.9-2.6,1.7-4.2,2.2c-1.6,0.5-3.4,0.8-5.2,0.8h-10.8
				c-0.8,0-1.5-0.3-2.1-0.9c-0.6-0.6-0.9-1.3-0.9-2.1s0.3-1.5,0.9-2.1c0.6-0.6,1.3-0.9,2.1-0.9H763c1.1,0,2.1-0.1,3-0.4
				c0.9-0.3,1.7-0.6,2.3-1c0.6-0.4,1.1-0.9,1.5-1.4c0.4-0.5,0.5-1.1,0.5-1.6c0-0.2,0-0.5-0.1-0.7c0-0.3-0.1-0.4-0.3-0.6
				c-0.2-0.2-0.6-0.4-1.1-0.5c-0.5-0.1-1.1-0.2-1.7-0.2s-1.3-0.1-2-0.1s-1.4,0-2,0c-1,0-2.1,0-3.2,0c-1.1,0-2.1-0.1-3.1-0.3
				c-1-0.2-2-0.4-2.9-0.8c-0.9-0.4-1.8-0.9-2.5-1.6C750,562,749.2,560,749.2,557.3z"/>
			<path fill="#601D00" d="M793.2,578.8c-0.9,0-1.6-0.3-2.1-0.9c-0.6-0.6-0.9-1.3-0.9-2.1v-23H783c-0.8,0-1.5-0.3-2.1-0.9
				c-0.6-0.6-0.9-1.3-0.9-2.1c0-0.8,0.3-1.5,0.9-2.1c0.6-0.6,1.3-0.9,2.1-0.9h20.4c0.9,0,1.6,0.3,2.1,0.9c0.6,0.6,0.9,1.3,0.9,2.1
				c0,0.9-0.3,1.6-0.9,2.1c-0.6,0.6-1.3,0.9-2.1,0.9h-7.2v23c0,0.8-0.3,1.5-0.9,2.1C794.7,578.5,794,578.8,793.2,578.8z"/>
			<path fill="#601D00" d="M809.9,578.6c-0.4-0.2-0.7-0.4-1-0.7c-0.3-0.3-0.5-0.6-0.6-0.9s-0.2-0.7-0.2-1.1c0-0.4,0-0.8,0.2-1.2
				l10.2-26c0.2-0.6,0.6-1.1,1.1-1.4c0.5-0.3,1.1-0.5,1.7-0.5c0.6,0,1.2,0.2,1.7,0.5c0.5,0.3,0.9,0.8,1.1,1.4l10.2,26
				c0.2,0.4,0.2,0.8,0.2,1.2c0,0.4-0.1,0.8-0.3,1.1s-0.4,0.7-0.7,0.9c-0.3,0.3-0.6,0.5-1,0.7c-0.4,0.1-0.8,0.2-1.1,0.2
				c-0.6,0-1.2-0.2-1.7-0.5c-0.5-0.3-0.9-0.8-1.1-1.4l-2.4-6h-10.1l-2.4,6c-0.2,0.4-0.4,0.7-0.7,1c-0.3,0.3-0.6,0.5-0.9,0.6
				c-0.3,0.1-0.7,0.2-1.1,0.2C810.6,578.8,810.2,578.7,809.9,578.6z M818.5,564.8h5.4l-2.7-6.8L818.5,564.8z"/>
			<path fill="#601D00" d="M841,578.8c-0.8,0-1.5-0.3-2.1-0.9c-0.6-0.6-0.9-1.3-0.9-2.1v-26c0-0.8,0.3-1.5,0.9-2.1
				c0.6-0.6,1.3-0.9,2.1-0.9h13.4c1.4,0,2.7,0.3,3.9,0.8c1.2,0.5,2.3,1.2,3.2,2.1c0.9,0.9,1.6,2,2.1,3.2c0.5,1.2,0.8,2.5,0.8,3.9
				c0,1.2-0.2,2.3-0.6,3.4c-0.4,1.1-1,2.1-1.7,2.9c-0.7,0.9-1.5,1.6-2.5,2.2c-1,0.6-2,1-3.1,1.3l7,7c0.6,0.6,0.9,1.3,0.9,2.1
				c0,0.8-0.3,1.5-0.9,2.1c-0.3,0.3-0.6,0.5-1,0.7c-0.4,0.1-0.7,0.2-1.1,0.2c-0.4,0-0.7-0.1-1.1-0.2c-0.4-0.1-0.7-0.4-1-0.7
				l-11.1-11.1H844v9c0,0.8-0.3,1.5-0.9,2.1C842.5,578.5,841.8,578.8,841,578.8z M858.4,556.8c0-1.1-0.4-2.1-1.2-2.8
				s-1.7-1.1-2.8-1.1H844v8h5.5h5c1.1,0,2.1-0.4,2.8-1.2S858.4,557.9,858.4,556.8z"/>
			<path fill="#601D00" d="M879.2,578.8c-0.9,0-1.6-0.3-2.1-0.9s-0.9-1.3-0.9-2.1v-23H869c-0.8,0-1.5-0.3-2.1-0.9
				c-0.6-0.6-0.9-1.3-0.9-2.1c0-0.8,0.3-1.5,0.9-2.1c0.6-0.6,1.3-0.9,2.1-0.9h20.4c0.9,0,1.6,0.3,2.1,0.9c0.6,0.6,0.9,1.3,0.9,2.1
				c0,0.9-0.3,1.6-0.9,2.1c-0.6,0.6-1.3,0.9-2.1,0.9h-7.2v23c0,0.8-0.3,1.5-0.9,2.1S880.1,578.8,879.2,578.8z"/>
		</g>
	</g>
</g>
<g id="Resume_button">
	<path fill="#472318" d="M647.9,485.9c-10.8-1.9-11-13.6-11-13.6h-5.1c0.7,15.6,15.2,17.1,15.2,17.1h13v-3.5
		C660,485.9,649.1,486.1,647.9,485.9z"/>
	<rect x="660" y="485.9" fill="#472318" width="264.7" height="3.5"/>
	<path fill="#804F38" d="M631.8,419l6.7-1.4c0,0-1.4-11.7,9.5-13.6c1.1-0.2,13.3,0,13.3,0v-3.5H647C647,400.4,631,402.8,631.8,419z"
		/>
	<rect x="661" y="400.4" fill="#804F38" width="262.7" height="3.5"/>
	<path fill="#472318" d="M936.7,485.9c-1.2,0.2-12,0-12,0v3.5h13c0,0,14.5-1.5,15.2-17.1h-5.3C947.6,472.3,947.6,484,936.7,485.9z"
		/>
	<path fill="#804F38" d="M937.6,400.4h-14.2v3.5c0,0,12.1-0.2,13.3,0c10.8,1.9,10.9,13.6,10.9,13.6l5.2,1.4
		C953.7,402.8,937.6,400.4,937.6,400.4z"/>
	<linearGradient id="SVGID_7_" gradientUnits="userSpaceOnUse" x1="635.1111" y1="471.2887" x2="635.1111" y2="416.8946">
		<stop  offset="0" style="stop-color:#442116"/>
		<stop  offset="0.9961" style="stop-color:#805038"/>
	</linearGradient>
	<polygon fill="url(#SVGID_7_)" points="631.8,472.3 637.4,472.3 638.5,417.6 631.8,419 	"/>
	<linearGradient id="SVGID_8_" gradientUnits="userSpaceOnUse" x1="949.9779" y1="470.7674" x2="949.9779" y2="418.4032">
		<stop  offset="0" style="stop-color:#442116"/>
		<stop  offset="0.9961" style="stop-color:#805038"/>
	</linearGradient>
	<polygon fill="url(#SVGID_8_)" points="947.1,472.3 952.9,472.3 952.9,419 947.7,417.6 	"/>
	<linearGradient id="SVGID_9_" gradientUnits="userSpaceOnUse" x1="792.3303" y1="404.7026" x2="792.3303" y2="484.787">
		<stop  offset="0" style="stop-color:#FFE853"/>
		<stop  offset="0.1286" style="stop-color:#FADE4E"/>
		<stop  offset="0.3448" style="stop-color:#ECC441"/>
		<stop  offset="0.6219" style="stop-color:#D59A2C"/>
		<stop  offset="0.9463" style="stop-color:#B75F0E"/>
		<stop  offset="1" style="stop-color:#B15509"/>
	</linearGradient>
	<path fill="url(#SVGID_9_)" d="M948.2,415.6v58.6c0,0-1,10.1-10.4,11.8H646.9c-9.4-1.6-10.4-11.8-10.4-11.8v-58.6
		c0,0,1-10.1,10.4-11.8h290.8C947.1,405.5,948.2,415.6,948.2,415.6z"/>
	<path fill="#DE9D1C" d="M948.1,422.9v44.2c0,0-1,10.1-10.4,11.8H646.9c-9.4-1.6-10.4-11.8-10.4-11.8v-44.2c0,0,0.3-3.1,2.2-6.2
		c-0.2,0.9-0.3,1.5-0.3,1.5v44.9c0,0,1,10.2,10.1,11.8h287.2c9.1-1.6,10.1-11.8,10.1-11.8v-44.9c0,0-0.1-1-0.5-2.4
		C947.8,419.1,948.1,422.9,948.1,422.9z"/>
	<path opacity="0.4" fill="#FFF0A9" d="M940.3,419.8v15.3c0,0-0.9,8.6-8.9,10H653.6c-8-1.4-8.9-10-8.9-10v-15.3c0,0,0.9-8.6,8.9-10
		h277.9C939.4,411.1,940.3,419.8,940.3,419.8z"/>
	<path fill="#F4F198" d="M948.1,415.6v5.9c0,0-1-10.1-10.4-11.8H646.9c-9.4,1.6-10.4,11.8-10.4,11.8v-5.9c0,0,1-10.1,10.4-11.8
		h290.8C947.1,405.5,948.1,415.6,948.1,415.6z"/>
</g>
<g id="Resume_button_text">
	<g>
		<g>
			<path fill="#601D00" d="M701.8,457.1c-0.8,0-1.5-0.3-2.1-0.9c-0.6-0.6-0.9-1.3-0.9-2.1v-26c0-0.8,0.3-1.5,0.9-2.1
				c0.6-0.6,1.3-0.9,2.1-0.9h13.4c1.4,0,2.7,0.3,3.9,0.8c1.2,0.5,2.3,1.2,3.2,2.1c0.9,0.9,1.6,2,2.1,3.2c0.5,1.2,0.8,2.5,0.8,3.9
				c0,1.2-0.2,2.3-0.6,3.4c-0.4,1.1-1,2.1-1.7,2.9c-0.7,0.9-1.5,1.6-2.5,2.2c-1,0.6-2,1-3.1,1.3l7,7c0.6,0.6,0.9,1.3,0.9,2.1
				c0,0.8-0.3,1.5-0.9,2.1c-0.3,0.3-0.6,0.5-1,0.7c-0.4,0.1-0.7,0.2-1.1,0.2c-0.4,0-0.7-0.1-1.1-0.2c-0.4-0.1-0.7-0.4-1-0.7
				l-11.1-11.1h-4.2v9c0,0.8-0.3,1.5-0.9,2.1C703.4,456.8,702.7,457.1,701.8,457.1z M719.3,435.1c0-1.1-0.4-2.1-1.2-2.8
				s-1.7-1.1-2.8-1.1h-10.4v8h5.5h5c1.1,0,2.1-0.4,2.8-1.2S719.3,436.2,719.3,435.1z"/>
			<path fill="#601D00" d="M753,452c0.6,0.6,0.9,1.3,0.9,2.1c0,0.8-0.3,1.5-0.9,2.1c-0.6,0.6-1.3,0.9-2.1,0.9h-18.2
				c-0.8,0-1.5-0.3-2.1-0.9c-0.6-0.6-0.9-1.3-0.9-2.1v-25.7c0-0.6,0.1-1.1,0.4-1.5c0.3-0.5,0.7-0.8,1.1-1.1c0.6-0.5,1.2-0.8,2-0.8
				h17.7c0.8,0,1.5,0.3,2.1,0.9c0.6,0.6,0.9,1.3,0.9,2.1c0,0.9-0.3,1.6-0.9,2.1c-0.6,0.6-1.3,0.9-2.1,0.9h-15.2v6.2h15.2
				c0.8,0,1.5,0.3,2.1,0.9c0.6,0.6,0.9,1.3,0.9,2.1c0,0.8-0.3,1.5-0.9,2.1c-0.6,0.6-1.3,0.9-2.1,0.9h-1.2h-0.2h-13.8v7.9h15.2
				C751.7,451.2,752.4,451.4,753,452z"/>
			<path fill="#601D00" d="M757.4,435.6c0-1.4,0.4-2.8,1.1-4c0.7-1.3,1.7-2.4,2.9-3.3c1.2-1,2.6-1.7,4.3-2.3
				c1.6-0.6,3.3-0.8,5.1-0.8h10.8c0.9,0,1.6,0.3,2.1,0.9c0.6,0.6,0.9,1.3,0.9,2.1s-0.3,1.5-0.9,2.1s-1.3,0.9-2.1,0.9h-10.8
				c-1.1,0-2.1,0.2-3,0.5c-0.9,0.3-1.7,0.7-2.3,1.1c-0.6,0.4-1.1,0.9-1.5,1.5c-0.3,0.5-0.5,1-0.5,1.4c0,1,0.2,1.6,0.6,2
				c0.3,0.3,0.7,0.5,1.2,0.6s1.2,0.2,1.8,0.3c0.7,0.1,1.4,0.1,2.1,0.1s1.5,0,2.2,0c1,0,2.1,0,3.1,0c1,0,2,0.1,3,0.2s1.9,0.4,2.7,0.7
				c0.9,0.3,1.6,0.9,2.3,1.5c1.4,1.4,2.1,3.2,2.1,5.6c0,1.5-0.3,2.8-1,4.1c-0.7,1.3-1.6,2.4-2.8,3.3c-1.2,0.9-2.6,1.7-4.2,2.2
				c-1.6,0.5-3.4,0.8-5.2,0.8h-10.8c-0.8,0-1.5-0.3-2.1-0.9s-0.9-1.3-0.9-2.1s0.3-1.5,0.9-2.1c0.6-0.6,1.3-0.9,2.1-0.9h10.8
				c1.1,0,2.1-0.1,3-0.4c0.9-0.3,1.7-0.6,2.3-1c0.6-0.4,1.1-0.9,1.5-1.4s0.5-1.1,0.5-1.6c0-0.2,0-0.5-0.1-0.7c0-0.3-0.1-0.4-0.3-0.6
				c-0.2-0.2-0.6-0.4-1.1-0.5c-0.5-0.1-1.1-0.2-1.7-0.2c-0.6,0-1.3-0.1-2-0.1c-0.7,0-1.4,0-2,0c-1,0-2.1,0-3.2,0s-2.1-0.1-3.1-0.3
				c-1-0.2-2-0.4-2.9-0.8c-0.9-0.4-1.8-0.9-2.5-1.6C758.2,440.4,757.4,438.3,757.4,435.6z"/>
			<path fill="#601D00" d="M802.4,451.1c0.9,0,1.7-0.1,2.5-0.3s1.5-0.5,2.1-0.9s1.1-0.8,1.4-1.3c0.4-0.5,0.5-1,0.5-1.6v-18.8
				c0-0.8,0.3-1.5,0.9-2.1c0.6-0.6,1.3-0.9,2.1-0.9c0.8,0,1.6,0.3,2.1,0.9c0.6,0.6,0.9,1.3,0.9,2.1v18.8c0,1.4-0.3,2.8-1,4
				c-0.7,1.2-1.6,2.3-2.7,3.2s-2.5,1.6-4,2.2c-1.5,0.5-3.2,0.8-5,0.8h-1.8h-0.4c-0.5,0-1.2,0-1.9-0.1c-0.8-0.1-1.6-0.2-2.4-0.4
				c-0.9-0.2-1.7-0.5-2.6-0.9c-0.9-0.4-1.7-1-2.4-1.7c-1.8-1.8-2.7-4.2-2.7-7.1v-18.8c0-0.8,0.3-1.5,0.9-2.1
				c0.6-0.6,1.3-0.9,2.1-0.9c0.9,0,1.6,0.3,2.1,0.9c0.6,0.6,0.9,1.3,0.9,2.1v18.8c0,1.3,0.3,2.2,0.9,2.9c0.3,0.3,0.8,0.6,1.3,0.8
				c0.5,0.2,1,0.3,1.5,0.4c0.5,0.1,1,0.1,1.5,0.1c0.5,0,0.9,0,1.2,0H802.4z"/>
			<path fill="#601D00" d="M854.7,426c0.6,0.6,0.9,1.3,0.9,2.1v26c0,0.8-0.3,1.5-0.9,2.1c-0.6,0.6-1.3,0.9-2.1,0.9
				c-0.8,0-1.6-0.3-2.1-0.9c-0.6-0.6-0.9-1.3-0.9-2.1v-15.3l-9.4,16.3c-0.1,0.1-0.1,0.1-0.1,0.2s0,0.1-0.1,0.2l0,0
				c-0.1,0.1-0.1,0.1-0.1,0.1c0,0,0,0.1-0.1,0.1l-0.1,0.1c-0.1,0-0.1,0.1-0.1,0.1s0,0.1-0.1,0.1l-0.1,0.1c-0.1,0-0.1,0.1-0.1,0.1
				s-0.1,0.1-0.1,0.1c-0.1,0.1-0.2,0.1-0.3,0.2c0,0-0.1,0-0.1,0c-0.1,0-0.1,0-0.1,0c-0.3,0.1-0.6,0.2-1,0.2c-0.4,0-0.7-0.1-1-0.2
				c0,0,0,0-0.1,0s0,0-0.1,0c0,0-0.1,0-0.1,0c-0.1,0-0.2-0.1-0.3-0.2h0c-0.1,0-0.1-0.1-0.1-0.1c0,0-0.1-0.1-0.1-0.1l-0.1-0.1
				c-0.1-0.1-0.1-0.1-0.2-0.2l-0.1-0.1c-0.1-0.1-0.1-0.1-0.1-0.1c0,0,0-0.1-0.1-0.1l0,0c-0.1-0.1-0.1-0.1-0.1-0.2
				c0-0.1,0-0.1-0.1-0.2l-9.4-16.3v15.3c0,0.8-0.3,1.5-0.9,2.1c-0.6,0.6-1.3,0.9-2.1,0.9c-0.8,0-1.5-0.3-2.1-0.9
				c-0.6-0.6-0.9-1.3-0.9-2.1v-26c0-0.8,0.3-1.5,0.9-2.1c0.6-0.6,1.3-0.9,2.1-0.9h0.2c0.6,0,1.1,0.1,1.6,0.3
				c0.5,0.3,0.9,0.6,1.2,1.2l12.1,21l12.1-21c0.3-0.5,0.7-0.9,1.2-1.2c0.5-0.3,1-0.4,1.6-0.3h0.2C853.4,425.1,854.1,425.4,854.7,426
				z"/>
			<path fill="#601D00" d="M883.3,452c0.6,0.6,0.9,1.3,0.9,2.1c0,0.8-0.3,1.5-0.9,2.1c-0.6,0.6-1.3,0.9-2.1,0.9H863
				c-0.8,0-1.5-0.3-2.1-0.9c-0.6-0.6-0.9-1.3-0.9-2.1v-25.7c0-0.6,0.1-1.1,0.4-1.5c0.3-0.5,0.7-0.8,1.1-1.1c0.6-0.5,1.2-0.8,2-0.8
				h17.7c0.8,0,1.5,0.3,2.1,0.9c0.6,0.6,0.9,1.3,0.9,2.1c0,0.9-0.3,1.6-0.9,2.1c-0.6,0.6-1.3,0.9-2.1,0.9H866v6.2h15.2
				c0.8,0,1.5,0.3,2.1,0.9s0.9,1.3,0.9,2.1c0,0.8-0.3,1.5-0.9,2.1s-1.3,0.9-2.1,0.9H880h-0.2H866v7.9h15.2
				C882,451.2,882.7,451.4,883.3,452z"/>
		</g>
	</g>
</g>
<g id="Next_button">
	<path fill="#472318" d="M647.9,359.7c-10.8-1.9-11-13.6-11-13.6h-5.1c0.7,15.6,15.2,17.1,15.2,17.1h13v-3.5
		C660,359.7,649.1,359.9,647.9,359.7z"/>
	<rect x="660" y="359.7" fill="#472318" width="264.7" height="3.5"/>
	<path fill="#804F38" d="M631.8,292.9l6.7-1.4c0,0-1.4-11.7,9.5-13.6c1.1-0.2,13.3,0,13.3,0v-3.5H647
		C647,274.3,631,276.6,631.8,292.9z"/>
	<rect x="661" y="274.3" fill="#804F38" width="262.7" height="3.5"/>
	<path fill="#472318" d="M936.7,359.7c-1.2,0.2-12,0-12,0v3.5h13c0,0,14.5-1.5,15.2-17.1h-5.3C947.6,346.1,947.6,357.8,936.7,359.7z
		"/>
	<path fill="#804F38" d="M937.6,274.3h-14.2v3.5c0,0,12.1-0.2,13.3,0c10.8,1.9,10.9,13.6,10.9,13.6l5.2,1.4
		C953.7,276.6,937.6,274.3,937.6,274.3z"/>
	<linearGradient id="SVGID_10_" gradientUnits="userSpaceOnUse" x1="635.1111" y1="345.1562" x2="635.1111" y2="290.7621">
		<stop  offset="0" style="stop-color:#442116"/>
		<stop  offset="0.9961" style="stop-color:#805038"/>
	</linearGradient>
	<polygon fill="url(#SVGID_10_)" points="631.8,346.1 637.4,346.1 638.5,291.4 631.8,292.9 	"/>
	<linearGradient id="SVGID_11_" gradientUnits="userSpaceOnUse" x1="949.9779" y1="344.6349" x2="949.9779" y2="292.2707">
		<stop  offset="0" style="stop-color:#442116"/>
		<stop  offset="0.9961" style="stop-color:#805038"/>
	</linearGradient>
	<polygon fill="url(#SVGID_11_)" points="947.1,346.1 952.9,346.1 952.9,292.9 947.7,291.4 	"/>
	<linearGradient id="SVGID_12_" gradientUnits="userSpaceOnUse" x1="792.3303" y1="278.5701" x2="792.3303" y2="358.6545">
		<stop  offset="0" style="stop-color:#FFE853"/>
		<stop  offset="0.1286" style="stop-color:#FADE4E"/>
		<stop  offset="0.3448" style="stop-color:#ECC441"/>
		<stop  offset="0.6219" style="stop-color:#D59A2C"/>
		<stop  offset="0.9463" style="stop-color:#B75F0E"/>
		<stop  offset="1" style="stop-color:#B15509"/>
	</linearGradient>
	<path fill="url(#SVGID_12_)" d="M948.2,289.5v58.6c0,0-1,10.1-10.4,11.8H646.9c-9.4-1.6-10.4-11.8-10.4-11.8v-58.6
		c0,0,1-10.1,10.4-11.8h290.8C947.1,279.4,948.2,289.5,948.2,289.5z"/>
	<path fill="#DE9D1C" d="M948.1,296.8V341c0,0-1,10.1-10.4,11.8H646.9c-9.4-1.6-10.4-11.8-10.4-11.8v-44.2c0,0,0.3-3.1,2.2-6.2
		c-0.2,0.9-0.3,1.5-0.3,1.5V337c0,0,1,10.2,10.1,11.8h287.2c9.1-1.6,10.1-11.8,10.1-11.8v-44.9c0,0-0.1-1-0.5-2.4
		C947.8,293,948.1,296.8,948.1,296.8z"/>
	<path opacity="0.4" fill="#FFF0A9" d="M940.3,293.6v15.3c0,0-0.9,8.6-8.9,10H653.6c-8-1.4-8.9-10-8.9-10v-15.3c0,0,0.9-8.6,8.9-10
		h277.9C939.4,285,940.3,293.6,940.3,293.6z"/>
	<path fill="#F4F198" d="M948.1,289.5v5.9c0,0-1-10.1-10.4-11.8H646.9c-9.4,1.6-10.4,11.8-10.4,11.8v-5.9c0,0,1-10.1,10.4-11.8
		h290.8C947.1,279.4,948.1,289.5,948.1,289.5z"/>
</g>
<g id="Next_button_text">
	<g>
		<g>
			<path fill="#601D00" d="M737.5,331c-0.8,0-1.5-0.3-2.1-0.9c-0.6-0.6-0.9-1.3-0.9-2.1v-26c0-0.8,0.3-1.5,0.9-2.1
				c0.6-0.6,1.3-0.9,2.1-0.9h0.2c0.5,0,1,0.1,1.5,0.3s0.9,0.5,1.2,1l13,18.8v-17c0-0.8,0.3-1.5,0.9-2.1c0.6-0.6,1.3-0.9,2.1-0.9
				s1.6,0.3,2.1,0.9c0.6,0.6,0.9,1.3,0.9,2.1v26c0,0.8-0.3,1.5-0.9,2.1c-0.6,0.6-1.3,0.9-2.1,0.9c-0.5,0-0.9-0.1-1.4-0.3
				c-0.7-0.2-1.3-0.6-1.8-1.2l-12.7-18.4V328c0,0.8-0.3,1.5-0.9,2.1C739.1,330.7,738.4,331,737.5,331z"/>
			<path fill="#601D00" d="M787.1,325.9c0.6,0.6,0.9,1.3,0.9,2.1c0,0.8-0.3,1.5-0.9,2.1c-0.6,0.6-1.3,0.9-2.1,0.9h-18.2
				c-0.8,0-1.5-0.3-2.1-0.9c-0.6-0.6-0.9-1.3-0.9-2.1v-25.7c0-0.6,0.1-1.1,0.4-1.5c0.3-0.5,0.7-0.8,1.1-1.1c0.6-0.5,1.2-0.8,2-0.8
				H785c0.8,0,1.5,0.3,2.1,0.9c0.6,0.6,0.9,1.3,0.9,2.1c0,0.9-0.3,1.6-0.9,2.1c-0.6,0.6-1.3,0.9-2.1,0.9h-15.2v6.2H785
				c0.8,0,1.5,0.3,2.1,0.9c0.6,0.6,0.9,1.3,0.9,2.1s-0.3,1.5-0.9,2.1c-0.6,0.6-1.3,0.9-2.1,0.9h-1.2h-0.2h-13.8v7.9H785
				C785.9,325,786.6,325.3,787.1,325.9z"/>
			<path fill="#601D00" d="M817.4,299.7c0.6,0.5,1,1.2,1.1,2s-0.1,1.5-0.7,2.2l-8.9,11.1l8.9,11.1c0.5,0.6,0.8,1.4,0.7,2.2
				c-0.1,0.8-0.5,1.5-1.1,2c-0.3,0.2-0.6,0.4-0.9,0.5s-0.6,0.2-1,0.2c-0.5,0-0.9-0.1-1.3-0.3c-0.4-0.2-0.8-0.5-1.1-0.8l-8.1-10.1
				l-8.1,10.1c-0.3,0.4-0.6,0.7-1.1,0.8c-0.4,0.2-0.8,0.3-1.3,0.3c-0.7,0-1.3-0.2-1.9-0.7c-0.6-0.5-1-1.2-1.1-2
				c-0.1-0.8,0.1-1.5,0.6-2.2l8.9-11.1l-8.9-11.1c-0.5-0.6-0.7-1.4-0.6-2.2s0.4-1.5,1.1-2c0.6-0.5,1.4-0.8,2.2-0.7s1.5,0.5,2,1.1
				l8.1,10.1l8.1-10.1c0.5-0.6,1.2-1,2-1.1S816.7,299.1,817.4,299.7z"/>
			<path fill="#601D00" d="M835.3,331c-0.9,0-1.6-0.3-2.1-0.9c-0.6-0.6-0.9-1.3-0.9-2.1v-23h-7.2c-0.8,0-1.5-0.3-2.1-0.9
				c-0.6-0.6-0.9-1.3-0.9-2.1c0-0.8,0.3-1.5,0.9-2.1c0.6-0.6,1.3-0.9,2.1-0.9h20.4c0.9,0,1.6,0.3,2.1,0.9c0.6,0.6,0.9,1.3,0.9,2.1
				c0,0.9-0.3,1.6-0.9,2.1c-0.6,0.6-1.3,0.9-2.1,0.9h-7.2v23c0,0.8-0.3,1.5-0.9,2.1C836.8,330.7,836.1,331,835.3,331z"/>
		</g>
	</g>
</g>
<g id="Options_button">
	<path fill="#472318" d="M647.9,241.7c-10.8-1.9-11-13.6-11-13.6h-5.1c0.7,15.6,15.2,17.1,15.2,17.1h13v-3.5
		C660,241.7,649.1,241.9,647.9,241.7z"/>
	<rect x="660" y="241.7" fill="#472318" width="264.7" height="3.5"/>
	<path fill="#804F38" d="M631.8,174.8l6.7-1.4c0,0-1.4-11.7,9.5-13.6c1.1-0.2,13.3,0,13.3,0v-3.5H647
		C647,156.3,631,158.6,631.8,174.8z"/>
	<rect x="661" y="156.3" fill="#804F38" width="262.7" height="3.5"/>
	<path fill="#472318" d="M936.7,241.7c-1.2,0.2-12,0-12,0v3.5h13c0,0,14.5-1.5,15.2-17.1h-5.3C947.6,228.1,947.6,239.8,936.7,241.7z
		"/>
	<path fill="#804F38" d="M937.6,156.3h-14.2v3.5c0,0,12.1-0.2,13.3,0c10.8,1.9,10.9,13.6,10.9,13.6l5.2,1.4
		C953.7,158.6,937.6,156.3,937.6,156.3z"/>
	<linearGradient id="SVGID_13_" gradientUnits="userSpaceOnUse" x1="635.1111" y1="227.1159" x2="635.1111" y2="172.7218">
		<stop  offset="0" style="stop-color:#442116"/>
		<stop  offset="0.9961" style="stop-color:#805038"/>
	</linearGradient>
	<polygon fill="url(#SVGID_13_)" points="631.8,228.1 637.4,228.1 638.5,173.4 631.8,174.8 	"/>
	<linearGradient id="SVGID_14_" gradientUnits="userSpaceOnUse" x1="949.9779" y1="226.5945" x2="949.9779" y2="174.2303">
		<stop  offset="0" style="stop-color:#442116"/>
		<stop  offset="0.9961" style="stop-color:#805038"/>
	</linearGradient>
	<polygon fill="url(#SVGID_14_)" points="947.1,228.1 952.9,228.1 952.9,174.8 947.7,173.4 	"/>
	<linearGradient id="SVGID_15_" gradientUnits="userSpaceOnUse" x1="792.3303" y1="160.5298" x2="792.3303" y2="240.6142">
		<stop  offset="0" style="stop-color:#FFE853"/>
		<stop  offset="0.1286" style="stop-color:#FADE4E"/>
		<stop  offset="0.3448" style="stop-color:#ECC441"/>
		<stop  offset="0.6219" style="stop-color:#D59A2C"/>
		<stop  offset="0.9463" style="stop-color:#B75F0E"/>
		<stop  offset="1" style="stop-color:#B15509"/>
	</linearGradient>
	<path fill="url(#SVGID_15_)" d="M948.2,171.5v58.6c0,0-1,10.1-10.4,11.8H646.9c-9.4-1.6-10.4-11.8-10.4-11.8v-58.6
		c0,0,1-10.1,10.4-11.8h290.8C947.1,161.3,948.2,171.5,948.2,171.5z"/>
	<path fill="#DE9D1C" d="M948.1,178.7v44.2c0,0-1,10.1-10.4,11.8H646.9c-9.4-1.6-10.4-11.8-10.4-11.8v-44.2c0,0,0.3-3.1,2.2-6.2
		c-0.2,0.9-0.3,1.5-0.3,1.5v44.9c0,0,1,10.2,10.1,11.8h287.2c9.1-1.6,10.1-11.8,10.1-11.8V174c0,0-0.1-1-0.5-2.4
		C947.8,175,948.1,178.7,948.1,178.7z"/>
	<path opacity="0.4" fill="#FFF0A9" d="M940.3,175.6v15.3c0,0-0.9,8.6-8.9,10H653.6c-8-1.4-8.9-10-8.9-10v-15.3c0,0,0.9-8.6,8.9-10
		h277.9C939.4,166.9,940.3,175.6,940.3,175.6z"/>
	<path fill="#F4F198" d="M948.1,171.5v5.9c0,0-1-10.1-10.4-11.8H646.9c-9.4,1.6-10.4,11.8-10.4,11.8v-5.9c0,0,1-10.1,10.4-11.8
		h290.8C947.1,161.3,948.1,171.5,948.1,171.5z"/>
</g>
<g id="Options_button_text">
	<g>
		<g>
			<path fill="#601D00" d="M724.1,206.5c-0.7,1.3-1.6,2.4-2.7,3.3s-2.5,1.7-4,2.3c-1.5,0.5-3.2,0.8-4.9,0.8h-0.1h-0.1h-4.8
				c-1.7,0-3.4-0.3-4.9-0.8c-1.5-0.5-2.9-1.3-4-2.3c-1.1-1-2.1-2.1-2.7-3.3c-0.7-1.3-1-2.6-1-4.1v-11c0-1.4,0.3-2.8,1-4.1
				c0.7-1.3,1.6-2.4,2.7-3.3c1.1-1,2.5-1.7,4-2.3c1.5-0.5,3.2-0.8,4.9-0.8h4.8h0.1h0.1c1.7,0,3.4,0.3,4.9,0.8c1.5,0.5,2.9,1.3,4,2.3
				s2.1,2.1,2.7,3.3c0.7,1.3,1,2.6,1,4.1v11C725.1,203.9,724.8,205.3,724.1,206.5z M719.1,191.4c0-0.6-0.2-1.2-0.5-1.7
				c-0.4-0.5-0.8-1-1.4-1.4c-0.6-0.4-1.3-0.7-2.1-1c-0.8-0.2-1.7-0.4-2.6-0.4h-0.1h-0.1h-4.8c-0.9,0-1.8,0.1-2.6,0.4
				c-0.8,0.2-1.5,0.6-2.1,1c-0.6,0.4-1.1,0.9-1.4,1.4c-0.4,0.5-0.5,1.1-0.5,1.7v11c0,0.6,0.2,1.2,0.5,1.7c0.4,0.5,0.8,1,1.4,1.4
				s1.3,0.7,2.1,1c0.8,0.2,1.7,0.4,2.6,0.4h4.8h0.1h0.1c0.9,0,1.8-0.1,2.6-0.4c0.8-0.2,1.5-0.6,2.1-1s1.1-0.9,1.4-1.4
				c0.4-0.5,0.5-1.1,0.5-1.7V191.4z"/>
			<path fill="#601D00" d="M755.9,190.9c0,1.4-0.3,2.7-0.8,3.9s-1.2,2.3-2.1,3.2s-2,1.6-3.2,2.1c-1.2,0.5-2.5,0.8-3.9,0.8h-10.4v9
				c0,0.8-0.3,1.5-0.9,2.1c-0.6,0.6-1.3,0.9-2.1,0.9c-0.8,0-1.5-0.3-2.1-0.9c-0.6-0.6-0.9-1.3-0.9-2.1v-26c0-0.8,0.3-1.5,0.9-2.1
				c0.6-0.6,1.3-0.9,2.1-0.9h13.4c1.4,0,2.7,0.3,3.9,0.8c1.2,0.5,2.3,1.2,3.2,2.1s1.6,2,2.1,3.2
				C755.7,188.3,755.9,189.6,755.9,190.9z M748.8,193.8c0.8-0.8,1.2-1.7,1.2-2.8c0-0.5-0.1-1-0.3-1.5c-0.2-0.5-0.5-0.9-0.9-1.3
				s-0.8-0.6-1.3-0.9c-0.5-0.2-1-0.3-1.6-0.3h-10.4v8h10.4C747,194.9,748,194.6,748.8,193.8z"/>
			<path fill="#601D00" d="M770.7,212.9c-0.9,0-1.6-0.3-2.1-0.9c-0.6-0.6-0.9-1.3-0.9-2.1v-23h-7.2c-0.8,0-1.5-0.3-2.1-0.9
				c-0.6-0.6-0.9-1.3-0.9-2.1c0-0.8,0.3-1.5,0.9-2.1c0.6-0.6,1.3-0.9,2.1-0.9h20.4c0.9,0,1.6,0.3,2.1,0.9c0.6,0.6,0.9,1.3,0.9,2.1
				c0,0.9-0.3,1.6-0.9,2.1c-0.6,0.6-1.3,0.9-2.1,0.9h-7.2v23c0,0.8-0.3,1.5-0.9,2.1C772.3,212.7,771.6,212.9,770.7,212.9z"/>
			<path fill="#601D00" d="M790.5,180.9c0.9,0,1.6,0.3,2.1,0.9c0.6,0.6,0.9,1.3,0.9,2.1v26c0,0.8-0.3,1.5-0.9,2.1
				c-0.6,0.6-1.3,0.9-2.1,0.9c-0.8,0-1.5-0.3-2.1-0.9c-0.6-0.6-0.9-1.3-0.9-2.1v-26c0-0.8,0.3-1.5,0.9-2.1
				C789,181.2,789.7,180.9,790.5,180.9z"/>
			<path fill="#601D00" d="M827.1,206.5c-0.7,1.3-1.6,2.4-2.7,3.3c-1.1,1-2.5,1.7-4,2.3c-1.5,0.5-3.2,0.8-4.9,0.8h-0.1h-0.1h-4.8
				c-1.7,0-3.4-0.3-4.9-0.8c-1.5-0.5-2.9-1.3-4-2.3s-2.1-2.1-2.7-3.3c-0.7-1.3-1-2.6-1-4.1v-11c0-1.4,0.3-2.8,1-4.1
				c0.7-1.3,1.6-2.4,2.7-3.3s2.5-1.7,4-2.3c1.5-0.5,3.2-0.8,4.9-0.8h4.8h0.1h0.1c1.7,0,3.4,0.3,4.9,0.8c1.5,0.5,2.9,1.3,4,2.3
				c1.1,1,2.1,2.1,2.7,3.3c0.7,1.3,1,2.6,1,4.1v11C828.1,203.9,827.8,205.3,827.1,206.5z M822.1,191.4c0-0.6-0.2-1.2-0.5-1.7
				c-0.4-0.5-0.8-1-1.4-1.4c-0.6-0.4-1.3-0.7-2.1-1c-0.8-0.2-1.7-0.4-2.6-0.4h-0.1h-0.1h-4.8c-0.9,0-1.8,0.1-2.6,0.4
				c-0.8,0.2-1.5,0.6-2.1,1c-0.6,0.4-1.1,0.9-1.4,1.4s-0.5,1.1-0.5,1.7v11c0,0.6,0.2,1.2,0.5,1.7c0.4,0.5,0.8,1,1.4,1.4
				c0.6,0.4,1.3,0.7,2.1,1s1.7,0.4,2.6,0.4h4.8h0.1h0.1c0.9,0,1.8-0.1,2.6-0.4s1.5-0.6,2.1-1c0.6-0.4,1.1-0.9,1.4-1.4
				c0.4-0.5,0.5-1.1,0.5-1.7V191.4z"/>
			<path fill="#601D00" d="M835.5,212.9c-0.8,0-1.5-0.3-2.1-0.9c-0.6-0.6-0.9-1.3-0.9-2.1v-26c0-0.8,0.3-1.5,0.9-2.1
				c0.6-0.6,1.3-0.9,2.1-0.9h0.2c0.5,0,1,0.1,1.5,0.3c0.5,0.2,0.9,0.5,1.2,1l13,18.8v-17c0-0.8,0.3-1.5,0.9-2.1
				c0.6-0.6,1.3-0.9,2.1-0.9c0.9,0,1.6,0.3,2.1,0.9c0.6,0.6,0.9,1.3,0.9,2.1v26c0,0.8-0.3,1.5-0.9,2.1c-0.6,0.6-1.3,0.9-2.1,0.9
				c-0.5,0-0.9-0.1-1.4-0.3c-0.7-0.2-1.3-0.6-1.8-1.2l-12.7-18.4v16.9c0,0.8-0.3,1.5-0.9,2.1C837.1,212.7,836.4,212.9,835.5,212.9z"
				/>
			<path fill="#601D00" d="M861,191.4c0-1.4,0.4-2.8,1.1-4c0.7-1.3,1.7-2.4,2.9-3.3c1.2-1,2.6-1.7,4.3-2.3c1.6-0.6,3.3-0.8,5.1-0.8
				h10.8c0.9,0,1.6,0.3,2.1,0.9c0.6,0.6,0.9,1.3,0.9,2.1s-0.3,1.5-0.9,2.1c-0.6,0.6-1.3,0.9-2.1,0.9h-10.8c-1.1,0-2.1,0.2-3,0.5
				s-1.7,0.7-2.3,1.1c-0.6,0.4-1.1,0.9-1.5,1.5s-0.5,1-0.5,1.4c0,1,0.2,1.6,0.6,2c0.3,0.3,0.7,0.5,1.2,0.6c0.5,0.1,1.2,0.2,1.8,0.3
				c0.7,0.1,1.4,0.1,2.1,0.1c0.7,0,1.5,0,2.2,0c1,0,2.1,0,3.1,0s2,0.1,3,0.2c1,0.1,1.9,0.4,2.7,0.7c0.9,0.3,1.6,0.9,2.3,1.5
				c1.4,1.4,2.1,3.2,2.1,5.6c0,1.5-0.3,2.8-1,4.1c-0.7,1.3-1.6,2.4-2.8,3.3s-2.6,1.7-4.2,2.2c-1.6,0.5-3.4,0.8-5.2,0.8H864
				c-0.8,0-1.5-0.3-2.1-0.9c-0.6-0.6-0.9-1.3-0.9-2.1s0.3-1.5,0.9-2.1c0.6-0.6,1.3-0.9,2.1-0.9h10.8c1.1,0,2.1-0.1,3-0.4
				c0.9-0.3,1.7-0.6,2.3-1c0.6-0.4,1.1-0.9,1.5-1.4c0.4-0.5,0.5-1.1,0.5-1.6c0-0.2,0-0.5-0.1-0.7c0-0.3-0.1-0.4-0.3-0.6
				c-0.2-0.2-0.6-0.4-1.1-0.5c-0.5-0.1-1.1-0.2-1.7-0.2c-0.6,0-1.3-0.1-2-0.1c-0.7,0-1.4,0-2,0c-1,0-2.1,0-3.2,0s-2.1-0.1-3.1-0.3
				c-1-0.2-2-0.4-2.9-0.8c-0.9-0.4-1.8-0.9-2.5-1.6C861.8,196.2,861,194.1,861,191.4z"/>
		</g>
	</g>
</g>
<g id="Back_button">
	<path fill="#472318" d="M647.9,121.3c-10.8-1.9-11-13.6-11-13.6h-5.1c0.7,15.6,15.2,17.1,15.2,17.1h13v-3.5
		C660,121.3,649.1,121.5,647.9,121.3z"/>
	<rect x="660" y="121.3" fill="#472318" width="264.7" height="3.5"/>
	<path fill="#804F38" d="M631.8,54.4l6.7-1.4c0,0-1.4-11.7,9.5-13.6c1.1-0.2,13.3,0,13.3,0v-3.5H647C647,35.9,631,38.2,631.8,54.4z"
		/>
	<rect x="661" y="35.9" fill="#804F38" width="262.7" height="3.5"/>
	<path fill="#472318" d="M936.7,121.3c-1.2,0.2-12,0-12,0v3.5h13c0,0,14.5-1.5,15.2-17.1h-5.3C947.6,107.7,947.6,119.4,936.7,121.3z
		"/>
	<path fill="#804F38" d="M937.6,35.9h-14.2v3.5c0,0,12.1-0.2,13.3,0c10.8,1.9,10.9,13.6,10.9,13.6l5.2,1.4
		C953.7,38.2,937.6,35.9,937.6,35.9z"/>
	<linearGradient id="SVGID_16_" gradientUnits="userSpaceOnUse" x1="635.1111" y1="106.7075" x2="635.1111" y2="52.3134">
		<stop  offset="0" style="stop-color:#442116"/>
		<stop  offset="0.9961" style="stop-color:#805038"/>
	</linearGradient>
	<polygon fill="url(#SVGID_16_)" points="631.8,107.7 637.4,107.7 638.5,53 631.8,54.4 	"/>
	<linearGradient id="SVGID_17_" gradientUnits="userSpaceOnUse" x1="949.9779" y1="106.1862" x2="949.9779" y2="53.822">
		<stop  offset="0" style="stop-color:#442116"/>
		<stop  offset="0.9961" style="stop-color:#805038"/>
	</linearGradient>
	<polygon fill="url(#SVGID_17_)" points="947.1,107.7 952.9,107.7 952.9,54.4 947.7,53 	"/>
	<linearGradient id="SVGID_18_" gradientUnits="userSpaceOnUse" x1="792.3303" y1="40.1214" x2="792.3303" y2="120.2059">
		<stop  offset="0" style="stop-color:#FFE853"/>
		<stop  offset="0.1286" style="stop-color:#FADE4E"/>
		<stop  offset="0.3448" style="stop-color:#ECC441"/>
		<stop  offset="0.6219" style="stop-color:#D59A2C"/>
		<stop  offset="0.9463" style="stop-color:#B75F0E"/>
		<stop  offset="1" style="stop-color:#B15509"/>
	</linearGradient>
	<path fill="url(#SVGID_18_)" d="M948.2,51.1v58.6c0,0-1,10.1-10.4,11.8H646.9c-9.4-1.6-10.4-11.8-10.4-11.8V51.1
		c0,0,1-10.1,10.4-11.8h290.8C947.1,40.9,948.2,51.1,948.2,51.1z"/>
	<path fill="#DE9D1C" d="M948.1,58.3v44.2c0,0-1,10.1-10.4,11.8H646.9c-9.4-1.6-10.4-11.8-10.4-11.8V58.3c0,0,0.3-3.1,2.2-6.2
		c-0.2,0.9-0.3,1.5-0.3,1.5v44.9c0,0,1,10.2,10.1,11.8h287.2c9.1-1.6,10.1-11.8,10.1-11.8V53.6c0,0-0.1-1-0.5-2.4
		C947.8,54.6,948.1,58.3,948.1,58.3z"/>
	<path opacity="0.4" fill="#FFF0A9" d="M940.3,55.2v15.3c0,0-0.9,8.6-8.9,10H653.6c-8-1.4-8.9-10-8.9-10V55.2c0,0,0.9-8.6,8.9-10
		h277.9C939.4,46.5,940.3,55.2,940.3,55.2z"/>
	<path fill="#F4F198" d="M948.1,51.1v5.9c0,0-1-10.1-10.4-11.8H646.9c-9.4,1.6-10.4,11.8-10.4,11.8v-5.9c0,0,1-10.1,10.4-11.8h290.8
		C947.1,40.9,948.1,51.1,948.1,51.1z"/>
</g>
<g id="Back_button_text">
	<g>
		<g>
			<path fill="#601D00" d="M752.9,61.3c1.1,0.5,2,1.1,2.8,1.9c0.8,0.8,1.4,1.8,1.9,2.9c0.5,1.1,0.7,2.3,0.7,3.5c0,1-0.1,1.9-0.4,2.7
				c-0.3,0.9-0.7,1.7-1.1,2.4c1.2,0.9,2.2,2,2.9,3.4s1.1,2.9,1.1,4.5c0,1.4-0.3,2.6-0.8,3.8c-0.5,1.2-1.2,2.2-2.1,3.1
				c-0.9,0.9-1.9,1.6-3.1,2.1c-1.2,0.5-2.5,0.8-3.8,0.8h-13.3c-0.8,0-1.5-0.3-2.1-0.9s-0.9-1.3-0.9-2.1V63.9c0-0.6,0.1-1.1,0.4-1.5
				s0.7-0.8,1.1-1.1c0.6-0.5,1.2-0.8,2-0.8h11.4C750.6,60.5,751.8,60.8,752.9,61.3z M752.3,69.6c0-0.9-0.3-1.6-0.9-2.2
				c-0.6-0.6-1.3-0.9-2.1-0.9h-8.9v6.2h9c0.8,0,1.4-0.3,2-0.9S752.3,70.5,752.3,69.6z M753.5,85.4c0.8-0.8,1.1-1.7,1.1-2.8
				c0-1.1-0.4-2.1-1.1-2.8c-0.8-0.8-1.7-1.1-2.8-1.1h-1.2h-0.2h-8.9v7.9h10.3C751.8,86.6,752.8,86.2,753.5,85.4z"/>
			<path fill="#601D00" d="M766.1,92.3c-0.4-0.2-0.7-0.4-1-0.7c-0.3-0.3-0.5-0.6-0.6-0.9c-0.1-0.3-0.2-0.7-0.2-1.1
				c0-0.4,0-0.8,0.2-1.2l10.2-26c0.2-0.6,0.6-1.1,1.1-1.4c0.5-0.3,1.1-0.5,1.7-0.5s1.2,0.2,1.7,0.5c0.5,0.3,0.9,0.8,1.1,1.4l10.2,26
				c0.2,0.4,0.2,0.8,0.2,1.2c0,0.4-0.1,0.8-0.3,1.1c-0.2,0.3-0.4,0.7-0.7,0.9c-0.3,0.3-0.6,0.5-1,0.7c-0.4,0.1-0.8,0.2-1.1,0.2
				c-0.6,0-1.2-0.2-1.7-0.5c-0.5-0.3-0.9-0.8-1.1-1.4l-2.4-6h-10.1l-2.4,6c-0.2,0.4-0.4,0.7-0.7,1c-0.3,0.3-0.6,0.5-0.9,0.6
				c-0.3,0.1-0.7,0.2-1.1,0.2C766.9,92.5,766.5,92.5,766.1,92.3z M774.7,78.6h5.4l-2.7-6.8L774.7,78.6z"/>
			<path fill="#601D00" d="M804.1,66.9c-0.8,0.2-1.5,0.6-2.1,1c-0.6,0.4-1.1,0.9-1.4,1.4c-0.4,0.5-0.5,1.1-0.5,1.7v11
				c0,0.6,0.2,1.2,0.5,1.7c0.4,0.5,0.8,1,1.4,1.4s1.3,0.7,2.1,1c0.8,0.2,1.7,0.4,2.6,0.4h10.1c0.8,0,1.5,0.3,2.1,0.9
				c0.6,0.6,0.9,1.3,0.9,2.1s-0.3,1.5-0.9,2.1c-0.6,0.6-1.3,0.9-2.1,0.9h-10.1c-1.7,0-3.4-0.3-4.9-0.8s-2.9-1.3-4-2.3
				c-1.2-1-2.1-2.1-2.7-3.3c-0.7-1.3-1-2.6-1-4.1V71c0-1.4,0.3-2.8,1-4.1c0.7-1.3,1.6-2.4,2.7-3.3c1.2-1,2.5-1.7,4-2.3
				c1.5-0.5,3.2-0.8,4.9-0.8h10.1c0.8,0,1.5,0.3,2.1,0.9c0.6,0.6,0.9,1.3,0.9,2.1c0,0.8-0.3,1.5-0.9,2.1c-0.6,0.6-1.3,0.9-2.1,0.9
				h-10.1C805.8,66.5,804.9,66.7,804.1,66.9z"/>
			<path fill="#601D00" d="M848.5,88.9c0.1,0.8-0.2,1.6-0.8,2.2c-0.3,0.3-0.6,0.6-1,0.8c-0.4,0.2-0.8,0.2-1.2,0.2
				c-0.3,0-0.7-0.1-1-0.2c-0.3-0.1-0.6-0.3-0.9-0.6l-13.4-11.8v10c0,0.8-0.3,1.5-0.9,2.1c-0.6,0.6-1.3,0.9-2.1,0.9
				c-0.8,0-1.5-0.3-2.1-0.9c-0.6-0.6-0.9-1.3-0.9-2.1v-26c0-0.8,0.3-1.5,0.9-2.1c0.6-0.6,1.3-0.9,2.1-0.9c0.8,0,1.6,0.3,2.1,0.9
				c0.6,0.6,0.9,1.3,0.9,2.1v7.7l10.8-9.6c0.6-0.5,1.3-0.8,2.2-0.7s1.5,0.4,2.1,1c0.6,0.6,0.8,1.3,0.8,2.2c-0.1,0.8-0.4,1.5-1,2.1
				l-10.4,9.2l13,11.4C848.1,87.4,848.4,88.1,848.5,88.9z"/>
		</g>
	</g>
</g>
<g id="red_button_9">
	<path fill="#472318" d="M284.2,732c-10.8-1.9-10.7-13.6-10.7-13.6H268c0.7,15.6,15.2,17.1,15.2,17.1h13V732
		C296.3,732,285.4,732.2,284.2,732z"/>
	<rect x="296.3" y="732" fill="#472318" width="264.7" height="3.5"/>
	<path fill="#804F38" d="M268,665.1l4.1,5.7c0,0,1.2-11.7,12-13.6c1.1-0.2,13.3,0,13.3,0v-10.6h-14.2
		C283.3,646.6,267.3,648.9,268,665.1z"/>
	<rect x="297.3" y="646.6" fill="#804F38" width="262.7" height="9.3"/>
	<path fill="#472318" d="M573,732c-1.2,0.2-12,0-12,0v3.5h13c0,0,14.5-1.5,15.2-17.1h-5.8C583.3,718.4,583.8,730.1,573,732z"/>
	<path fill="#804F38" d="M573.9,646.6h-14.2v10.4c0,0,12.1-0.2,13.3,0c10.8,1.9,12,13.6,12,13.6l4.1-5.4
		C589.9,648.9,573.9,646.6,573.9,646.6z"/>
	<linearGradient id="SVGID_19_" gradientUnits="userSpaceOnUse" x1="270.76" y1="717.4254" x2="270.76" y2="663.0313">
		<stop  offset="0" style="stop-color:#442116"/>
		<stop  offset="0.9961" style="stop-color:#805038"/>
	</linearGradient>
	<polygon fill="url(#SVGID_19_)" points="268,718.4 273.5,718.4 273.5,663.7 268,665.1 	"/>
	<linearGradient id="SVGID_20_" gradientUnits="userSpaceOnUse" x1="586.2544" y1="716.9041" x2="586.2544" y2="664.5399">
		<stop  offset="0" style="stop-color:#442116"/>
		<stop  offset="0.9961" style="stop-color:#805038"/>
	</linearGradient>
	<polygon fill="url(#SVGID_20_)" points="583.3,718.4 589.2,718.4 589.2,665.1 583.3,663.7 	"/>
	<linearGradient id="SVGID_21_" gradientUnits="userSpaceOnUse" x1="428.6068" y1="658.5135" x2="428.6068" y2="731.0437">
		<stop  offset="0" style="stop-color:#FF5757"/>
		<stop  offset="6.747336e-002" style="stop-color:#EE4848"/>
		<stop  offset="0.1766" style="stop-color:#DB3636"/>
		<stop  offset="0.3017" style="stop-color:#CD2929"/>
		<stop  offset="0.4554" style="stop-color:#C42121"/>
		<stop  offset="0.7211" style="stop-color:#C21F1F"/>
		<stop  offset="0.8463" style="stop-color:#C01E1E"/>
		<stop  offset="0.8914" style="stop-color:#B91B1B"/>
		<stop  offset="0.9235" style="stop-color:#AE1616"/>
		<stop  offset="0.9493" style="stop-color:#9D0E0E"/>
		<stop  offset="0.9539" style="stop-color:#990C0C"/>
		<stop  offset="0.9929" style="stop-color:#750C0C"/>
	</linearGradient>
	<path fill="url(#SVGID_21_)" d="M584.4,669.5v50.9c0,0-1,10.1-10.4,11.8H283.2c-9.4-1.6-10.4-11.8-10.4-11.8v-50.9
		c0,0,1-10.1,10.4-11.8H574C583.4,659.4,584.4,669.5,584.4,669.5z"/>
	<path fill="#FF5757" d="M584.4,674.2v44.2c0,0-1,10.1-10.4,11.8H283.2c-9.4-1.6-10.4-11.8-10.4-11.8v-44.2c0,0,0.3-3.1,2.2-6.2
		c-0.2,0.9-0.3,1.5-0.3,1.5v44.9c0,0,1,10.2,10.1,11.8h287.2c9.1-1.6,10.1-11.8,10.1-11.8v-44.9c0,0-0.1-1-0.5-2.4
		C584,670.4,584.4,674.2,584.4,674.2z"/>
	<path opacity="0.2" fill="#FFAEAE" d="M576.6,671v15.3c0,0-0.9,8.6-8.9,10H289.8c-8-1.4-8.9-10-8.9-10V671c0,0,0.9-8.6,8.9-10
		h277.9C575.7,662.4,576.6,671,576.6,671z"/>
	<path fill="#FF8D8D" d="M584.4,666.9v5.9c0,0-1-10.1-10.4-11.8H283.2c-9.4,1.6-10.4,11.8-10.4,11.8v-5.9c0,0,1-10.1,10.4-11.8H574
		C583.4,656.8,584.4,666.9,584.4,666.9z"/>
	<path opacity="0.15" d="M584.4,669.5v-2.6c0,0-1-10.1-10.4-11.8H283.2c-9.4,1.6-10.4,11.8-10.4,11.8v2.6c0,0,0,0,0,0v50.9
		c0,0,1,10.1,10.4,11.8H574c9.4-1.6,10.4-11.8,10.4-11.8L584.4,669.5C584.4,669.5,584.4,669.5,584.4,669.5z"/>
</g>
<g id="red_button_8">
	<path fill="#472318" d="M284.4,611.9c-10.8-1.9-10.5-13.6-10.5-13.6h-5.7c0.7,15.6,15.2,17.1,15.2,17.1h13.7l-0.7-3.5
		C296.5,611.9,285.6,612.1,284.4,611.9z"/>
	<rect x="296.5" y="611.9" fill="#472318" width="264.7" height="3.5"/>
	<path fill="#804F38" d="M268.2,545l5.7-1.4c0,0-0.4-11.7,10.5-13.6c1.1-0.2,13.3,0,13.3,0v-3.5h-14.2
		C283.5,526.5,267.5,528.8,268.2,545z"/>
	<rect x="297.5" y="526.5" fill="#804F38" width="262.7" height="3.5"/>
	<path fill="#472318" d="M573.2,611.9c-1.2,0.2-12,0-12,0v3.5h13c0,0,14.5-1.5,15.2-17.1h-5.4C583.9,598.3,584,610,573.2,611.9z"/>
	<path fill="#804F38" d="M574.1,526.5h-14.2v3.5c0,0,12.1-0.2,13.3,0c10.8,1.9,10.7,13.6,10.7,13.6l5.4,1.4
		C590.1,528.8,574.1,526.5,574.1,526.5z"/>
	<linearGradient id="SVGID_22_" gradientUnits="userSpaceOnUse" x1="271.0915" y1="597.3334" x2="271.0915" y2="542.9393">
		<stop  offset="0" style="stop-color:#442116"/>
		<stop  offset="0.9961" style="stop-color:#805038"/>
	</linearGradient>
	<polygon fill="url(#SVGID_22_)" points="268.2,598.3 273.9,598.3 273.9,543.6 268.2,545 	"/>
	<linearGradient id="SVGID_23_" gradientUnits="userSpaceOnUse" x1="586.6438" y1="596.8121" x2="586.6438" y2="544.4479">
		<stop  offset="0" style="stop-color:#442116"/>
		<stop  offset="0.9961" style="stop-color:#805038"/>
	</linearGradient>
	<polygon fill="url(#SVGID_23_)" points="583.9,598.3 589.4,598.3 589.4,545 583.9,543.6 	"/>
	<linearGradient id="SVGID_24_" gradientUnits="userSpaceOnUse" x1="428.8056" y1="530.7473" x2="428.8056" y2="610.8317">
		<stop  offset="0" style="stop-color:#FF9999"/>
		<stop  offset="5.381064e-002" style="stop-color:#F68585"/>
		<stop  offset="0.1413" style="stop-color:#E96C6C"/>
		<stop  offset="0.2386" style="stop-color:#E05858"/>
		<stop  offset="0.3495" style="stop-color:#D94A4A"/>
		<stop  offset="0.4857" style="stop-color:#D54141"/>
		<stop  offset="0.7211" style="stop-color:#D43F3F"/>
		<stop  offset="0.8044" style="stop-color:#D33D3D"/>
		<stop  offset="0.8345" style="stop-color:#D03636"/>
		<stop  offset="0.8559" style="stop-color:#CA2B2B"/>
		<stop  offset="0.873" style="stop-color:#C11A1A"/>
		<stop  offset="0.883" style="stop-color:#BA0C0C"/>
		<stop  offset="0.9929" style="stop-color:#A30C0C"/>
	</linearGradient>
	<path fill="url(#SVGID_24_)" d="M584.6,541.7v58.6c0,0-1,10.1-10.4,11.8H283.4c-9.4-1.6-10.4-11.8-10.4-11.8v-58.6
		c0,0,1-10.1,10.4-11.8h290.8C583.6,531.5,584.6,541.7,584.6,541.7z"/>
	<path fill="#FF7373" d="M584.6,549v44.2c0,0-1,10.1-10.4,11.8H283.4c-9.4-1.6-10.4-11.8-10.4-11.8V549c0,0,0.3-3.1,2.2-6.2
		c-0.2,0.9-0.3,1.5-0.3,1.5v44.9c0,0,1,10.2,10.1,11.8h287.2c9.1-1.6,10.1-11.8,10.1-11.8v-44.9c0,0-0.1-1-0.5-2.4
		C584.2,545.2,584.6,549,584.6,549z"/>
	<path opacity="0.2" fill="#FFD4D4" d="M576.8,545.8v15.3c0,0-0.9,8.6-8.9,10H290c-8-1.4-8.9-10-8.9-10v-15.3c0,0,0.9-8.6,8.9-10
		h277.9C575.9,537.2,576.8,545.8,576.8,545.8z"/>
	<path fill="#FFB0B0" d="M584.6,541.7v5.9c0,0-1-10.1-10.4-11.8H283.4c-9.4,1.6-10.4,11.8-10.4,11.8v-5.9c0,0,1-10.1,10.4-11.8
		h290.8C583.6,531.5,584.6,541.7,584.6,541.7z"/>
</g>
<g id="red_button_7">
	<path fill="#472318" d="M284.4,491.4c-10.8-1.9-10.5-13.6-10.5-13.6h-5.7c0.7,15.6,15.2,17.1,15.2,17.1h13.7l-0.7-3.5
		C296.5,491.4,285.6,491.6,284.4,491.4z"/>
	<rect x="296.5" y="491.4" fill="#472318" width="264.7" height="3.5"/>
	<path fill="#804F38" d="M268.2,424.5l5.7-1.4c0,0-0.4-11.7,10.5-13.6c1.1-0.2,13.3,0,13.3,0V406h-14.2
		C283.5,406,267.5,408.3,268.2,424.5z"/>
	<rect x="297.5" y="406" fill="#804F38" width="262.7" height="3.5"/>
	<path fill="#472318" d="M573.2,491.4c-1.2,0.2-12,0-12,0v3.5h13c0,0,14.5-1.5,15.2-17.1h-5.4C583.9,477.8,584,489.5,573.2,491.4z"
		/>
	<path fill="#804F38" d="M574.1,406h-14.2v3.5c0,0,12.1-0.2,13.3,0c10.8,1.9,10.7,13.6,10.7,13.6l5.4,1.4
		C590.1,408.3,574.1,406,574.1,406z"/>
	<linearGradient id="SVGID_25_" gradientUnits="userSpaceOnUse" x1="271.0915" y1="476.8304" x2="271.0915" y2="422.4363">
		<stop  offset="0" style="stop-color:#442116"/>
		<stop  offset="0.9961" style="stop-color:#805038"/>
	</linearGradient>
	<polygon fill="url(#SVGID_25_)" points="268.2,477.8 273.9,477.8 273.9,423.1 268.2,424.5 	"/>
	<linearGradient id="SVGID_26_" gradientUnits="userSpaceOnUse" x1="586.6438" y1="476.3091" x2="586.6438" y2="423.9449">
		<stop  offset="0" style="stop-color:#442116"/>
		<stop  offset="0.9961" style="stop-color:#805038"/>
	</linearGradient>
	<polygon fill="url(#SVGID_26_)" points="583.9,477.8 589.4,477.8 589.4,424.5 583.9,423.1 	"/>
	<linearGradient id="SVGID_27_" gradientUnits="userSpaceOnUse" x1="428.8056" y1="410.2444" x2="428.8056" y2="490.3288">
		<stop  offset="0" style="stop-color:#FF5757"/>
		<stop  offset="6.747336e-002" style="stop-color:#EE4848"/>
		<stop  offset="0.1766" style="stop-color:#DB3636"/>
		<stop  offset="0.3017" style="stop-color:#CD2929"/>
		<stop  offset="0.4554" style="stop-color:#C42121"/>
		<stop  offset="0.7211" style="stop-color:#C21F1F"/>
		<stop  offset="0.8082" style="stop-color:#C01E1E"/>
		<stop  offset="0.8395" style="stop-color:#B91B1B"/>
		<stop  offset="0.8618" style="stop-color:#AE1616"/>
		<stop  offset="0.8798" style="stop-color:#9D0E0E"/>
		<stop  offset="0.883" style="stop-color:#990C0C"/>
		<stop  offset="0.9929" style="stop-color:#750C0C"/>
	</linearGradient>
	<path fill="url(#SVGID_27_)" d="M584.6,421.2v58.6c0,0-1,10.1-10.4,11.8H283.4C274,490,273,479.8,273,479.8v-58.6
		c0,0,1-10.1,10.4-11.8h290.8C583.6,411,584.6,421.2,584.6,421.2z"/>
	<path fill="#FF5757" d="M584.6,428.5v44.2c0,0-1,10.1-10.4,11.8H283.4c-9.4-1.6-10.4-11.8-10.4-11.8v-44.2c0,0,0.3-3.1,2.2-6.2
		c-0.2,0.9-0.3,1.5-0.3,1.5v44.9c0,0,1,10.2,10.1,11.8h287.2c9.1-1.6,10.1-11.8,10.1-11.8v-44.9c0,0-0.1-1-0.5-2.4
		C584.2,424.7,584.6,428.5,584.6,428.5z"/>
	<path opacity="0.2" fill="#FFAEAE" d="M576.8,425.3v15.3c0,0-0.9,8.6-8.9,10H290c-8-1.4-8.9-10-8.9-10v-15.3c0,0,0.9-8.6,8.9-10
		h277.9C575.9,416.7,576.8,425.3,576.8,425.3z"/>
	<path fill="#FF8D8D" d="M584.6,421.2v5.9c0,0-1-10.1-10.4-11.8H283.4c-9.4,1.6-10.4,11.8-10.4,11.8v-5.9c0,0,1-10.1,10.4-11.8
		h290.8C583.6,411,584.6,421.2,584.6,421.2z"/>
</g>
<g id="red_button_6">
	<path fill="#30140C" d="M237.1,641.4h-71c-9.5,0-17.2,7.5-17.2,16.8v61.5c0,9.3,7.7,16.8,17.2,16.8h71c9.5,0,17.2-7.5,17.2-16.8
		v-61.5C254.3,649,246.6,641.4,237.1,641.4z"/>
	<linearGradient id="SVGID_28_" gradientUnits="userSpaceOnUse" x1="154.7616" y1="722.4484" x2="163.5274" y2="736.6407">
		<stop  offset="0" style="stop-color:#442116"/>
		<stop  offset="0.9961" style="stop-color:#D79280"/>
	</linearGradient>
	<path fill="url(#SVGID_28_)" d="M161.8,734.8c-10.8-1.9-12-13.6-12-13.6h-4.1c0.7,15.6,15.2,17.1,15.2,17.1h13.8l-0.8-3.5
		C173.8,734.8,162.9,735,161.8,734.8z"/>
	<rect x="173.8" y="734.8" fill="#D79280" width="55" height="3.5"/>
	<path fill="#804F38" d="M145.6,658.2l4.1-1.4c0,0,1.2-11.7,12-13.6c1.1-0.2,13.3,0,13.3,0v-3.5h-14.2
		C160.8,639.7,144.8,642,145.6,658.2z"/>
	<rect x="174.9" y="639.7" fill="#804F38" width="53" height="3.5"/>
	<linearGradient id="SVGID_29_" gradientUnits="userSpaceOnUse" x1="250.4997" y1="728.7064" x2="230.3564" y2="738.6766">
		<stop  offset="0" style="stop-color:#442116"/>
		<stop  offset="0.9961" style="stop-color:#D79280"/>
	</linearGradient>
	<path fill="url(#SVGID_29_)" d="M240.9,734.8c-1.2,0.2-12,0-12,0v3.5h13c0,0,14.5-1.5,15.2-17.1h-4.1
		C252.9,721.2,251.7,732.9,240.9,734.8z"/>
	<path fill="#804F38" d="M241.8,639.7h-14.2v3.5c0,0,12.1-0.2,13.3,0c10.8,1.9,12,13.6,12,13.6l4.1,1.4
		C257.8,642,241.8,639.7,241.8,639.7z"/>
	<linearGradient id="SVGID_30_" gradientUnits="userSpaceOnUse" x1="147.664" y1="720.0531" x2="147.664" y2="656.0126">
		<stop  offset="0" style="stop-color:#442116"/>
		<stop  offset="0.9961" style="stop-color:#805038"/>
	</linearGradient>
	<polygon fill="url(#SVGID_30_)" points="145.6,721.2 149.7,721.2 149.7,656.8 145.6,658.2 	"/>
	<linearGradient id="SVGID_31_" gradientUnits="userSpaceOnUse" x1="254.9684" y1="719.4393" x2="254.9684" y2="657.7887">
		<stop  offset="0" style="stop-color:#442116"/>
		<stop  offset="0.9961" style="stop-color:#805038"/>
	</linearGradient>
	<polygon fill="url(#SVGID_31_)" points="252.9,721.2 257,721.2 257,658.2 252.9,656.8 	"/>
	<linearGradient id="SVGID_32_" gradientUnits="userSpaceOnUse" x1="201.3184" y1="652.2698" x2="201.3184" y2="727.9017">
		<stop  offset="0" style="stop-color:#FF5757"/>
		<stop  offset="6.747336e-002" style="stop-color:#EE4848"/>
		<stop  offset="0.1766" style="stop-color:#DB3636"/>
		<stop  offset="0.3017" style="stop-color:#CD2929"/>
		<stop  offset="0.4554" style="stop-color:#C42121"/>
		<stop  offset="0.7211" style="stop-color:#C21F1F"/>
		<stop  offset="0.8521" style="stop-color:#C01E1E"/>
		<stop  offset="0.8992" style="stop-color:#B91B1B"/>
		<stop  offset="0.9327" style="stop-color:#AE1616"/>
		<stop  offset="0.9598" style="stop-color:#9D0E0E"/>
		<stop  offset="0.9645" style="stop-color:#990C0C"/>
		<stop  offset="0.9929" style="stop-color:#750C0C"/>
	</linearGradient>
	<path fill="url(#SVGID_32_)" d="M248.1,663.3v54.1c0,0-1,10.1-10.4,11.8h-72.8c-9.4-1.6-10.4-11.8-10.4-11.8v-54.1
		c0,0,1-10.1,10.4-11.8h72.8C247.1,653.1,248.1,663.3,248.1,663.3z"/>
	<path fill="#810C0C" d="M248.1,710.1v7.9c0,0-1,10.1-10.4,11.8h-72.8c-9.4-1.6-10.4-11.8-10.4-11.8v-7.9c0,0,1,11.9,10.4,13.6h72.8
		C247.1,722,248.1,710.1,248.1,710.1z"/>
	<path fill="#FF5757" d="M248.1,670.5v44.2c0,0-1,10.1-10.4,11.8h-72.8c-9.4-1.6-10.4-11.8-10.4-11.8v-44.2c0,0,0.3-3.1,2.2-6.2
		c-0.2,0.9-0.3,1.5-0.3,1.5v44.9c0,0,1,10.2,10.1,11.8h69.2c9.1-1.6,10.1-11.8,10.1-11.8v-44.9c0,0-0.1-1-0.5-2.4
		C247.7,666.8,248.1,670.5,248.1,670.5z"/>
	<path opacity="0.2" fill="#FFAEAE" d="M240.3,667.4v15.3c0,0-0.9,8.6-8.9,10h-59.9c-8-1.4-8.9-10-8.9-10v-15.3c0,0,0.9-8.6,8.9-10
		h59.9C239.4,658.7,240.3,667.4,240.3,667.4z"/>
	<path fill="#FF8D8D" d="M248.1,663.3v5.9c0,0-1-10.1-10.4-11.8h-72.8c-9.4,1.6-10.4,11.8-10.4,11.8v-5.9c0,0,1-10.1,10.4-11.8h72.8
		C247.1,653.1,248.1,663.3,248.1,663.3z"/>
	<path opacity="0.15" d="M237.7,651.5h-72.8c-9.4,1.6-10.4,11.8-10.4,11.8v54.1c0,0,1,10.1,10.4,11.8h72.8
		c9.4-1.6,10.4-11.8,10.4-11.8v-54.1C248.1,663.3,247.1,653.1,237.7,651.5z"/>
</g>
<g id="red_button_5">
	<path fill="#30140C" d="M237.1,521.4h-71c-9.5,0-17.2,7.5-17.2,16.8v61.5c0,9.3,7.7,16.8,17.2,16.8h71c9.5,0,17.2-7.5,17.2-16.8
		v-61.5C254.3,528.9,246.6,521.4,237.1,521.4z"/>
	<linearGradient id="SVGID_33_" gradientUnits="userSpaceOnUse" x1="154.7616" y1="602.363" x2="163.5274" y2="616.5552">
		<stop  offset="0" style="stop-color:#442116"/>
		<stop  offset="0.9961" style="stop-color:#D79280"/>
	</linearGradient>
	<path fill="url(#SVGID_33_)" d="M161.8,614.7c-10.8-1.9-12-13.6-12-13.6h-4.1c0.7,15.6,15.2,17.1,15.2,17.1h13.8l-0.8-3.5
		C173.8,614.7,162.9,614.9,161.8,614.7z"/>
	<rect x="173.8" y="614.7" fill="#D79280" width="55" height="3.5"/>
	<path fill="#804F38" d="M145.6,538.1l4.1-1.4c0,0,1.2-11.7,12-13.6c1.1-0.2,13.3,0,13.3,0v-3.5h-14.2
		C160.8,519.6,144.8,521.9,145.6,538.1z"/>
	<rect x="174.9" y="519.6" fill="#804F38" width="53" height="3.5"/>
	<linearGradient id="SVGID_34_" gradientUnits="userSpaceOnUse" x1="250.4997" y1="608.6209" x2="230.3564" y2="618.5912">
		<stop  offset="0" style="stop-color:#442116"/>
		<stop  offset="0.9961" style="stop-color:#D79280"/>
	</linearGradient>
	<path fill="url(#SVGID_34_)" d="M240.9,614.7c-1.2,0.2-12,0-12,0v3.5h13c0,0,14.5-1.5,15.2-17.1h-4.1
		C252.9,601.1,251.7,612.8,240.9,614.7z"/>
	<path fill="#804F38" d="M241.8,519.6h-14.2v3.5c0,0,12.1-0.2,13.3,0c10.8,1.9,12,13.6,12,13.6l4.1,1.4
		C257.8,521.9,241.8,519.6,241.8,519.6z"/>
	<linearGradient id="SVGID_35_" gradientUnits="userSpaceOnUse" x1="147.664" y1="599.9677" x2="147.664" y2="535.9271">
		<stop  offset="0" style="stop-color:#442116"/>
		<stop  offset="0.9961" style="stop-color:#805038"/>
	</linearGradient>
	<polygon fill="url(#SVGID_35_)" points="145.6,601.1 149.7,601.1 149.7,536.7 145.6,538.1 	"/>
	<linearGradient id="SVGID_36_" gradientUnits="userSpaceOnUse" x1="254.9684" y1="599.3539" x2="254.9684" y2="537.7032">
		<stop  offset="0" style="stop-color:#442116"/>
		<stop  offset="0.9961" style="stop-color:#805038"/>
	</linearGradient>
	<polygon fill="url(#SVGID_36_)" points="252.9,601.1 257,601.1 257,538.1 252.9,536.7 	"/>
	<linearGradient id="SVGID_37_" gradientUnits="userSpaceOnUse" x1="201.3184" y1="528.3035" x2="201.3184" y2="608.3879">
		<stop  offset="0" style="stop-color:#FF9999"/>
		<stop  offset="5.381064e-002" style="stop-color:#F68585"/>
		<stop  offset="0.1413" style="stop-color:#E96C6C"/>
		<stop  offset="0.2386" style="stop-color:#E05858"/>
		<stop  offset="0.3495" style="stop-color:#D94A4A"/>
		<stop  offset="0.4857" style="stop-color:#D54141"/>
		<stop  offset="0.7211" style="stop-color:#D43F3F"/>
		<stop  offset="0.8044" style="stop-color:#D33D3D"/>
		<stop  offset="0.8345" style="stop-color:#D03636"/>
		<stop  offset="0.8559" style="stop-color:#CA2B2B"/>
		<stop  offset="0.873" style="stop-color:#C11A1A"/>
		<stop  offset="0.883" style="stop-color:#BA0C0C"/>
		<stop  offset="0.9929" style="stop-color:#A30C0C"/>
	</linearGradient>
	<path fill="url(#SVGID_37_)" d="M248.1,539.2v58.6c0,0-1,10.1-10.4,11.8h-72.8c-9.4-1.6-10.4-11.8-10.4-11.8v-58.6
		c0,0,1-10.1,10.4-11.8h72.8C247.1,529.1,248.1,539.2,248.1,539.2z"/>
	<path fill="#A50C0C" d="M248.1,590v7.9c0,0-1,10.1-10.4,11.8h-72.8c-9.4-1.6-10.4-11.8-10.4-11.8V590c0,0,1,10.1,10.4,11.8h72.8
		C247.1,600.1,248.1,590,248.1,590z"/>
	<path fill="#FF7373" d="M248.1,546.5v44.2c0,0-1,10.1-10.4,11.8h-72.8c-9.4-1.6-10.4-11.8-10.4-11.8v-44.2c0,0,0.3-3.1,2.2-6.2
		c-0.2,0.9-0.3,1.5-0.3,1.5v44.9c0,0,1,10.2,10.1,11.8h69.2c9.1-1.6,10.1-11.8,10.1-11.8v-44.9c0,0-0.1-1-0.5-2.4
		C247.7,542.7,248.1,546.5,248.1,546.5z"/>
	<path opacity="0.2" fill="#FFD4D4" d="M240.3,543.4v15.3c0,0-0.9,8.6-8.9,10h-59.9c-8-1.4-8.9-10-8.9-10v-15.3c0,0,0.9-8.6,8.9-10
		h59.9C239.4,534.7,240.3,543.4,240.3,543.4z"/>
	<path fill="#FFB0B0" d="M248.1,539.2v5.9c0,0-1-10.1-10.4-11.8h-72.8c-9.4,1.6-10.4,11.8-10.4,11.8v-5.9c0,0,1-10.1,10.4-11.8h72.8
		C247.1,529.1,248.1,539.2,248.1,539.2z"/>
</g>
<g id="red_button_4">
	<path fill="#30140C" d="M237.1,400.8h-71c-9.5,0-17.2,7.5-17.2,16.8v61.5c0,9.3,7.7,16.8,17.2,16.8h71c9.5,0,17.2-7.5,17.2-16.8
		v-61.5C254.3,408.4,246.6,400.8,237.1,400.8z"/>
	<linearGradient id="SVGID_38_" gradientUnits="userSpaceOnUse" x1="154.7616" y1="481.86" x2="163.5274" y2="496.0523">
		<stop  offset="0" style="stop-color:#442116"/>
		<stop  offset="0.9961" style="stop-color:#D79280"/>
	</linearGradient>
	<path fill="url(#SVGID_38_)" d="M161.8,494.2c-10.8-1.9-12-13.6-12-13.6h-4.1c0.7,15.6,15.2,17.1,15.2,17.1h13.8l-0.8-3.5
		C173.8,494.2,162.9,494.4,161.8,494.2z"/>
	<rect x="173.8" y="494.2" fill="#D79280" width="55" height="3.5"/>
	<path fill="#804F38" d="M145.6,417.6l4.1-1.4c0,0,1.2-11.7,12-13.6c1.1-0.2,13.3,0,13.3,0v-3.5h-14.2
		C160.8,399.1,144.8,401.4,145.6,417.6z"/>
	<rect x="174.9" y="399.1" fill="#804F38" width="53" height="3.5"/>
	<linearGradient id="SVGID_39_" gradientUnits="userSpaceOnUse" x1="250.4997" y1="488.118" x2="230.3564" y2="498.0882">
		<stop  offset="0" style="stop-color:#442116"/>
		<stop  offset="0.9961" style="stop-color:#D79280"/>
	</linearGradient>
	<path fill="url(#SVGID_39_)" d="M240.9,494.2c-1.2,0.2-12,0-12,0v3.5h13c0,0,14.5-1.5,15.2-17.1h-4.1
		C252.9,480.6,251.7,492.3,240.9,494.2z"/>
	<path fill="#804F38" d="M241.8,399.1h-14.2v3.5c0,0,12.1-0.2,13.3,0c10.8,1.9,12,13.6,12,13.6l4.1,1.4
		C257.8,401.4,241.8,399.1,241.8,399.1z"/>
	<linearGradient id="SVGID_40_" gradientUnits="userSpaceOnUse" x1="147.664" y1="479.4647" x2="147.664" y2="415.4242">
		<stop  offset="0" style="stop-color:#442116"/>
		<stop  offset="0.9961" style="stop-color:#805038"/>
	</linearGradient>
	<polygon fill="url(#SVGID_40_)" points="145.6,480.6 149.7,480.6 149.7,416.2 145.6,417.6 	"/>
	<linearGradient id="SVGID_41_" gradientUnits="userSpaceOnUse" x1="254.9684" y1="478.8509" x2="254.9684" y2="417.2003">
		<stop  offset="0" style="stop-color:#442116"/>
		<stop  offset="0.9961" style="stop-color:#805038"/>
	</linearGradient>
	<polygon fill="url(#SVGID_41_)" points="252.9,480.6 257,480.6 257,417.6 252.9,416.2 	"/>
	<linearGradient id="SVGID_42_" gradientUnits="userSpaceOnUse" x1="201.3184" y1="407.8005" x2="201.3184" y2="487.8849">
		<stop  offset="0" style="stop-color:#FF5757"/>
		<stop  offset="6.747336e-002" style="stop-color:#EE4848"/>
		<stop  offset="0.1766" style="stop-color:#DB3636"/>
		<stop  offset="0.3017" style="stop-color:#CD2929"/>
		<stop  offset="0.4554" style="stop-color:#C42121"/>
		<stop  offset="0.7211" style="stop-color:#C21F1F"/>
		<stop  offset="0.8082" style="stop-color:#C01E1E"/>
		<stop  offset="0.8395" style="stop-color:#B91B1B"/>
		<stop  offset="0.8618" style="stop-color:#AE1616"/>
		<stop  offset="0.8798" style="stop-color:#9D0E0E"/>
		<stop  offset="0.883" style="stop-color:#990C0C"/>
		<stop  offset="0.9929" style="stop-color:#750C0C"/>
	</linearGradient>
	<path fill="url(#SVGID_42_)" d="M248.1,418.7v58.6c0,0-1,10.1-10.4,11.8h-72.8c-9.4-1.6-10.4-11.8-10.4-11.8v-58.6
		c0,0,1-10.1,10.4-11.8h72.8C247.1,408.6,248.1,418.7,248.1,418.7z"/>
	<path fill="#810C0C" d="M248.1,469.5v7.9c0,0-1,10.1-10.4,11.8h-72.8c-9.4-1.6-10.4-11.8-10.4-11.8v-7.9c0,0,1,10.1,10.4,11.8h72.8
		C247.1,479.6,248.1,469.5,248.1,469.5z"/>
	<path fill="#FF5757" d="M248.1,426v44.2c0,0-1,10.1-10.4,11.8h-72.8c-9.4-1.6-10.4-11.8-10.4-11.8V426c0,0,0.3-3.1,2.2-6.2
		c-0.2,0.9-0.3,1.5-0.3,1.5v44.9c0,0,1,10.2,10.1,11.8h69.2c9.1-1.6,10.1-11.8,10.1-11.8v-44.9c0,0-0.1-1-0.5-2.4
		C247.7,422.2,248.1,426,248.1,426z"/>
	<path opacity="0.2" fill="#FFAEAE" d="M240.3,422.9v15.3c0,0-0.9,8.6-8.9,10h-59.9c-8-1.4-8.9-10-8.9-10v-15.3c0,0,0.9-8.6,8.9-10
		h59.9C239.4,414.2,240.3,422.9,240.3,422.9z"/>
	<path fill="#FF8D8D" d="M248.1,418.7v5.9c0,0-1-10.1-10.4-11.8h-72.8c-9.4,1.6-10.4,11.8-10.4,11.8v-5.9c0,0,1-10.1,10.4-11.8h72.8
		C247.1,408.6,248.1,418.7,248.1,418.7z"/>
</g>
<g id="red_button_3">
	<linearGradient id="SVGID_43_" gradientUnits="userSpaceOnUse" x1="79.925" y1="740.2128" x2="79.925" y2="646.3798">
		<stop  offset="0" style="stop-color:#D79280"/>
		<stop  offset="5.966666e-003" style="stop-color:#D4907E"/>
		<stop  offset="9.073454e-002" style="stop-color:#AE7260"/>
		<stop  offset="0.1749" style="stop-color:#905B48"/>
		<stop  offset="0.2573" style="stop-color:#7A4A37"/>
		<stop  offset="0.3372" style="stop-color:#6D402D"/>
		<stop  offset="0.4116" style="stop-color:#693D2A"/>
		<stop  offset="1" style="stop-color:#693D2A"/>
	</linearGradient>
	<ellipse fill="url(#SVGID_43_)" cx="79.9" cy="691.1" rx="49.4" ry="49.6"/>
	<ellipse fill="#30140C" cx="79.9" cy="690.3" rx="46.4" ry="46.7"/>
	<ellipse fill="#810C0C" cx="80" cy="691.9" rx="42.8" ry="40.8"/>
	<linearGradient id="SVGID_44_" gradientUnits="userSpaceOnUse" x1="79.9622" y1="649.3542" x2="79.9622" y2="723.7076">
		<stop  offset="0" style="stop-color:#FF5757"/>
		<stop  offset="6.747336e-002" style="stop-color:#EE4848"/>
		<stop  offset="0.1766" style="stop-color:#DB3636"/>
		<stop  offset="0.3017" style="stop-color:#CD2929"/>
		<stop  offset="0.4554" style="stop-color:#C42121"/>
		<stop  offset="0.7211" style="stop-color:#C21F1F"/>
	</linearGradient>
	<ellipse fill="url(#SVGID_44_)" cx="80" cy="689.4" rx="41" ry="39.1"/>
	<ellipse opacity="0.2" fill="#FFAEAE" cx="80" cy="666.6" rx="30.8" ry="14.4"/>
	<path fill="#FF5757" d="M120.9,691.3c-1,20.7-16.8,38.8-41,38.8c-26.9,0-41-19.1-41-40.7c0-1.3,0.1-2.7,0.2-4c0,0.6,0,1.2,0,1.8
		c0,21.6,18.1,39.3,40.8,39.3C101.1,726.6,118.8,711,120.9,691.3z"/>
	<path fill="#FF8D8D" d="M120.9,687.3c-1-20.7-19-37.2-41-37.2c-22.7,0-41,17.5-41,39.1c0,1.3,0.1,2.7,0.2,4c0-0.6,0-1.2,0-1.8
		c0-21.6,18.1-38,40.8-38C101.1,653.4,118.8,667.6,120.9,687.3z"/>
	<path opacity="0.15" d="M109.7,662.5c-7.5-7.5-18-12.2-29.7-12.2s-22.2,4.7-29.7,12.2c-8.1,7.4-13.1,17.8-13.1,29.4
		c0,22.6,19.2,40.8,42.8,40.8c23.7,0,42.8-18.3,42.8-40.8C122.8,680.3,117.8,669.9,109.7,662.5z"/>
</g>
<g id="red_button_2">
	<linearGradient id="SVGID_45_" gradientUnits="userSpaceOnUse" x1="79.925" y1="620.1274" x2="79.925" y2="526.2943">
		<stop  offset="0" style="stop-color:#D79280"/>
		<stop  offset="5.966666e-003" style="stop-color:#D4907E"/>
		<stop  offset="9.073454e-002" style="stop-color:#AE7260"/>
		<stop  offset="0.1749" style="stop-color:#905B48"/>
		<stop  offset="0.2573" style="stop-color:#7A4A37"/>
		<stop  offset="0.3372" style="stop-color:#6D402D"/>
		<stop  offset="0.4116" style="stop-color:#693D2A"/>
		<stop  offset="1" style="stop-color:#693D2A"/>
	</linearGradient>
	<ellipse fill="url(#SVGID_45_)" cx="79.9" cy="571" rx="49.4" ry="49.6"/>
	<ellipse fill="#30140C" cx="79.9" cy="570.2" rx="46.4" ry="46.7"/>
	<ellipse fill="#A50C0C" cx="80" cy="571.8" rx="42.8" ry="40.8"/>
	<linearGradient id="SVGID_46_" gradientUnits="userSpaceOnUse" x1="79.9622" y1="525.3417" x2="79.9622" y2="599.6951">
		<stop  offset="0" style="stop-color:#FF9999"/>
		<stop  offset="5.381064e-002" style="stop-color:#F68585"/>
		<stop  offset="0.1413" style="stop-color:#E96C6C"/>
		<stop  offset="0.2386" style="stop-color:#E05858"/>
		<stop  offset="0.3495" style="stop-color:#D94A4A"/>
		<stop  offset="0.4857" style="stop-color:#D54141"/>
		<stop  offset="0.7211" style="stop-color:#D43F3F"/>
	</linearGradient>
	<ellipse fill="url(#SVGID_46_)" cx="80" cy="565.4" rx="41" ry="39.1"/>
	<ellipse opacity="0.2" fill="#FFD4D4" cx="80" cy="542.6" rx="30.8" ry="14.4"/>
	<path fill="#FF7373" d="M120.9,567.3c-1,20.7-16.8,38.8-41,38.8c-26.9,0-41-19.1-41-40.7c0-1.3,0.1-2.7,0.2-4c0,0.6,0,1.2,0,1.8
		c0,21.6,18.1,39.3,40.8,39.3C101.1,602.6,118.8,587,120.9,567.3z"/>
	<path fill="#FFB0B0" d="M120.9,563.3c-1-20.7-19-37.2-41-37.2c-22.7,0-41,17.5-41,39.1c0,1.3,0.1,2.7,0.2,4c0-0.6,0-1.2,0-1.8
		c0-21.6,18.1-38,40.8-38C101.1,529.4,118.8,543.6,120.9,563.3z"/>
</g>
<g id="red_button_1">
	<linearGradient id="SVGID_47_" gradientUnits="userSpaceOnUse" x1="79.925" y1="499.6245" x2="79.925" y2="405.7914">
		<stop  offset="0" style="stop-color:#D79280"/>
		<stop  offset="5.966666e-003" style="stop-color:#D4907E"/>
		<stop  offset="9.073454e-002" style="stop-color:#AE7260"/>
		<stop  offset="0.1749" style="stop-color:#905B48"/>
		<stop  offset="0.2573" style="stop-color:#7A4A37"/>
		<stop  offset="0.3372" style="stop-color:#6D402D"/>
		<stop  offset="0.4116" style="stop-color:#693D2A"/>
		<stop  offset="1" style="stop-color:#693D2A"/>
	</linearGradient>
	<ellipse fill="url(#SVGID_47_)" cx="79.9" cy="450.5" rx="49.4" ry="49.6"/>
	<ellipse fill="#30140C" cx="79.9" cy="449.7" rx="46.4" ry="46.7"/>
	<ellipse fill="#810C0C" cx="80" cy="451.3" rx="42.8" ry="40.8"/>
	<linearGradient id="SVGID_48_" gradientUnits="userSpaceOnUse" x1="79.9622" y1="404.8387" x2="79.9622" y2="479.1921">
		<stop  offset="0" style="stop-color:#FF5757"/>
		<stop  offset="6.747336e-002" style="stop-color:#EE4848"/>
		<stop  offset="0.1766" style="stop-color:#DB3636"/>
		<stop  offset="0.3017" style="stop-color:#CD2929"/>
		<stop  offset="0.4554" style="stop-color:#C42121"/>
		<stop  offset="0.7211" style="stop-color:#C21F1F"/>
	</linearGradient>
	<ellipse fill="url(#SVGID_48_)" cx="80" cy="444.9" rx="41" ry="39.1"/>
	<ellipse opacity="0.2" fill="#FFAEAE" cx="80" cy="422.1" rx="30.8" ry="14.4"/>
	<path fill="#FF5757" d="M120.9,446.8c-1,20.7-16.8,38.8-41,38.8c-26.9,0-41-19.1-41-40.7c0-1.3,0.1-2.7,0.2-4c0,0.6,0,1.2,0,1.8
		c0,21.6,18.1,39.3,40.8,39.3C101.1,482.1,118.8,466.5,120.9,446.8z"/>
	<path fill="#FF8D8D" d="M120.9,442.8c-1-20.7-19-37.2-41-37.2c-22.7,0-41,17.5-41,39.1c0,1.3,0.1,2.7,0.2,4c0-0.6,0-1.2,0-1.8
		c0-21.6,18.1-38,40.8-38C101.1,408.9,118.8,423.1,120.9,442.8z"/>
</g>
<g id="green_button_9">
	<path fill="#472318" d="M284.2,367.3c-10.8-1.9-10.7-13.6-10.7-13.6H268c0.7,15.6,15.2,17.1,15.2,17.1h13v-3.5
		C296.3,367.3,285.4,367.5,284.2,367.3z"/>
	<rect x="296.3" y="367.2" fill="#472318" width="264.7" height="3.5"/>
	<path fill="#804F38" d="M268,300.4l4.1,5.7c0,0,1.2-11.7,12-13.6c1.1-0.2,13.3,0,13.3,0v-10.6h-14.2
		C283.3,281.8,267.3,284.2,268,300.4z"/>
	<rect x="297.3" y="281.8" fill="#804F38" width="262.7" height="9.3"/>
	<path fill="#472318" d="M573,367.3c-1.2,0.2-12,0-12,0v3.5h13c0,0,14.5-1.5,15.2-17.1h-5.8C583.3,353.6,583.8,365.4,573,367.3z"/>
	<path fill="#804F38" d="M573.9,281.8h-14.2v10.4c0,0,12.1-0.2,13.3,0c10.8,1.9,12,13.6,12,13.6l4.1-5.4
		C589.9,284.2,573.9,281.8,573.9,281.8z"/>
	<linearGradient id="SVGID_49_" gradientUnits="userSpaceOnUse" x1="270.76" y1="352.6833" x2="270.76" y2="298.2892">
		<stop  offset="0" style="stop-color:#442116"/>
		<stop  offset="0.9961" style="stop-color:#805038"/>
	</linearGradient>
	<polygon fill="url(#SVGID_49_)" points="268,353.6 273.5,353.6 273.5,299 268,300.4 	"/>
	<linearGradient id="SVGID_50_" gradientUnits="userSpaceOnUse" x1="586.2544" y1="352.162" x2="586.2544" y2="299.7978">
		<stop  offset="0" style="stop-color:#442116"/>
		<stop  offset="0.9961" style="stop-color:#805038"/>
	</linearGradient>
	<polygon fill="url(#SVGID_50_)" points="583.3,353.6 589.2,353.6 589.2,300.4 583.3,299 	"/>
	<linearGradient id="SVGID_51_" gradientUnits="userSpaceOnUse" x1="428.6068" y1="293.7714" x2="428.6068" y2="366.3017">
		<stop  offset="0" style="stop-color:#42E610"/>
		<stop  offset="4.312610e-002" style="stop-color:#38D00E"/>
		<stop  offset="0.1162" style="stop-color:#2AB00A"/>
		<stop  offset="0.1962" style="stop-color:#1F9708"/>
		<stop  offset="0.2843" style="stop-color:#168306"/>
		<stop  offset="0.3847" style="stop-color:#107504"/>
		<stop  offset="0.508" style="stop-color:#0C6C03"/>
		<stop  offset="0.7211" style="stop-color:#0B6A03"/>
		<stop  offset="0.8751" style="stop-color:#0B6803"/>
		<stop  offset="0.9305" style="stop-color:#0C6103"/>
		<stop  offset="0.961" style="stop-color:#0C5903"/>
		<stop  offset="0.9929" style="stop-color:#0C5103"/>
	</linearGradient>
	<path fill="url(#SVGID_51_)" d="M584.4,304.8v50.9c0,0-1,10.1-10.4,11.8H283.2c-9.4-1.6-10.4-11.8-10.4-11.8v-50.9
		c0,0,1-10.1,10.4-11.8H574C583.4,294.6,584.4,304.8,584.4,304.8z"/>
	<path fill="#35C80D" d="M584.4,309.4v44.2c0,0-1,10.1-10.4,11.8H283.2c-9.4-1.6-10.4-11.8-10.4-11.8v-44.2c0,0,0.3-3.1,2.2-6.2
		c-0.2,0.9-0.3,1.5-0.3,1.5v44.9c0,0,1,10.2,10.1,11.8h287.2c9.1-1.6,10.1-11.8,10.1-11.8v-44.9c0,0-0.1-1-0.5-2.4
		C584,305.7,584.4,309.4,584.4,309.4z"/>
	<path opacity="0.2" fill="#B9FFAB" d="M576.6,306.3v15.3c0,0-0.9,8.6-8.9,10H289.8c-8-1.4-8.9-10-8.9-10v-15.3c0,0,0.9-8.6,8.9-10
		h277.9C575.7,297.6,576.6,306.3,576.6,306.3z"/>
	<path fill="#68F93A" d="M584.4,302.2v5.9c0,0-1-10.1-10.4-11.8H283.2c-9.4,1.6-10.4,11.8-10.4,11.8v-5.9c0,0,1-10.1,10.4-11.8H574
		C583.4,292,584.4,302.2,584.4,302.2z"/>
	<path opacity="0.15" d="M584.4,304.8v-2.6c0,0-1-10.1-10.4-11.8H283.2c-9.4,1.6-10.4,11.8-10.4,11.8v2.6c0,0,0,0,0,0v50.9
		c0,0,1,10.1,10.4,11.8H574c9.4-1.6,10.4-11.8,10.4-11.8L584.4,304.8C584.4,304.8,584.4,304.8,584.4,304.8z"/>
</g>
<g id="green_button_8">
	<path fill="#472318" d="M284.4,247.2c-10.8-1.9-10.5-13.6-10.5-13.6h-5.7c0.7,15.6,15.2,17.1,15.2,17.1h13.7l-0.7-3.5
		C296.5,247.2,285.6,247.4,284.4,247.2z"/>
	<rect x="296.5" y="247.2" fill="#472318" width="264.7" height="3.5"/>
	<path fill="#804F38" d="M268.2,180.3l5.7-1.4c0,0-0.4-11.7,10.5-13.6c1.1-0.2,13.3,0,13.3,0v-3.5h-14.2
		C283.5,161.8,267.5,164.1,268.2,180.3z"/>
	<rect x="297.5" y="161.7" fill="#804F38" width="262.7" height="3.5"/>
	<path fill="#472318" d="M573.2,247.2c-1.2,0.2-12,0-12,0v3.5h13c0,0,14.5-1.5,15.2-17.1h-5.4C583.9,233.6,584,245.3,573.2,247.2z"
		/>
	<path fill="#804F38" d="M574.1,161.8h-14.2v3.5c0,0,12.1-0.2,13.3,0c10.8,1.9,10.7,13.6,10.7,13.6l5.4,1.4
		C590.1,164.1,574.1,161.8,574.1,161.8z"/>
	<linearGradient id="SVGID_52_" gradientUnits="userSpaceOnUse" x1="271.0915" y1="232.5914" x2="271.0915" y2="178.1973">
		<stop  offset="0" style="stop-color:#442116"/>
		<stop  offset="0.9961" style="stop-color:#805038"/>
	</linearGradient>
	<polygon fill="url(#SVGID_52_)" points="268.2,233.6 273.9,233.6 273.9,178.9 268.2,180.3 	"/>
	<linearGradient id="SVGID_53_" gradientUnits="userSpaceOnUse" x1="586.6438" y1="232.07" x2="586.6438" y2="179.7058">
		<stop  offset="0" style="stop-color:#442116"/>
		<stop  offset="0.9961" style="stop-color:#805038"/>
	</linearGradient>
	<polygon fill="url(#SVGID_53_)" points="583.9,233.6 589.4,233.6 589.4,180.3 583.9,178.9 	"/>
	<linearGradient id="SVGID_54_" gradientUnits="userSpaceOnUse" x1="428.8056" y1="166.0053" x2="428.8056" y2="246.0897">
		<stop  offset="0" style="stop-color:#00F500"/>
		<stop  offset="0.1012" style="stop-color:#03DE01"/>
		<stop  offset="0.244" style="stop-color:#07C502"/>
		<stop  offset="0.392" style="stop-color:#09B202"/>
		<stop  offset="0.5472" style="stop-color:#0BA803"/>
		<stop  offset="0.7211" style="stop-color:#0BA403"/>
		<stop  offset="0.9047" style="stop-color:#0AA505"/>
		<stop  offset="0.9708" style="stop-color:#05A70C"/>
		<stop  offset="1" style="stop-color:#00A912"/>
	</linearGradient>
	<path fill="url(#SVGID_54_)" d="M584.6,176.9v58.6c0,0-1,10.1-10.4,11.8H283.4c-9.4-1.6-10.4-11.8-10.4-11.8v-58.6
		c0,0,1-10.1,10.4-11.8h290.8C583.6,166.8,584.6,176.9,584.6,176.9z"/>
	<path fill="#59ED29" d="M584.6,184.2v44.2c0,0-1,10.1-10.4,11.8H283.4c-9.4-1.6-10.4-11.8-10.4-11.8v-44.2c0,0,0.3-3.1,2.2-6.2
		c-0.2,0.9-0.3,1.5-0.3,1.5v44.9c0,0,1,10.2,10.1,11.8h287.2c9.1-1.6,10.1-11.8,10.1-11.8v-44.9c0,0-0.1-1-0.5-2.4
		C584.2,180.4,584.6,184.2,584.6,184.2z"/>
	<path opacity="0.2" fill="#DBFFD2" d="M576.8,181.1v15.3c0,0-0.9,8.6-8.9,10H290c-8-1.4-8.9-10-8.9-10v-15.3c0,0,0.9-8.6,8.9-10
		h277.9C575.9,172.4,576.8,181.1,576.8,181.1z"/>
	<path fill="#97FF71" d="M584.6,177v5.9c0,0-1-10.1-10.4-11.8H283.4c-9.4,1.6-10.4,11.8-10.4,11.8V177c0,0,1-10.1,10.4-11.8h290.8
		C583.6,166.8,584.6,177,584.6,177z"/>
</g>
<g id="green_button_7">
	<path fill="#472318" d="M284.4,126.7c-10.8-1.9-10.5-13.6-10.5-13.6h-5.7c0.7,15.6,15.2,17.1,15.2,17.1h13.7l-0.7-3.5
		C296.5,126.7,285.6,126.9,284.4,126.7z"/>
	<rect x="296.5" y="126.7" fill="#472318" width="264.7" height="3.5"/>
	<path fill="#804F38" d="M268.2,59.8l5.7-1.4c0,0-0.4-11.7,10.5-13.6c1.1-0.2,13.3,0,13.3,0v-3.5h-14.2
		C283.5,41.2,267.5,43.6,268.2,59.8z"/>
	<rect x="297.5" y="41.2" fill="#804F38" width="262.7" height="3.5"/>
	<path fill="#472318" d="M573.2,126.7c-1.2,0.2-12,0-12,0v3.5h13c0,0,14.5-1.5,15.2-17.1h-5.4C583.9,113.1,584,124.8,573.2,126.7z"
		/>
	<path fill="#804F38" d="M574.1,41.2h-14.2v3.5c0,0,12.1-0.2,13.3,0c10.8,1.9,10.7,13.6,10.7,13.6l5.4,1.4
		C590.1,43.6,574.1,41.2,574.1,41.2z"/>
	<linearGradient id="SVGID_55_" gradientUnits="userSpaceOnUse" x1="271.0915" y1="112.0884" x2="271.0915" y2="57.6943">
		<stop  offset="0" style="stop-color:#442116"/>
		<stop  offset="0.9961" style="stop-color:#805038"/>
	</linearGradient>
	<polygon fill="url(#SVGID_55_)" points="268.2,113.1 273.9,113.1 273.9,58.4 268.2,59.8 	"/>
	<linearGradient id="SVGID_56_" gradientUnits="userSpaceOnUse" x1="586.6438" y1="111.5671" x2="586.6438" y2="59.2029">
		<stop  offset="0" style="stop-color:#442116"/>
		<stop  offset="0.9961" style="stop-color:#805038"/>
	</linearGradient>
	<polygon fill="url(#SVGID_56_)" points="583.9,113.1 589.4,113.1 589.4,59.8 583.9,58.4 	"/>
	<linearGradient id="SVGID_57_" gradientUnits="userSpaceOnUse" x1="428.8056" y1="45.5023" x2="428.8056" y2="125.5867">
		<stop  offset="0" style="stop-color:#42E610"/>
		<stop  offset="4.312610e-002" style="stop-color:#38D00E"/>
		<stop  offset="0.1162" style="stop-color:#2AB00A"/>
		<stop  offset="0.1962" style="stop-color:#1F9708"/>
		<stop  offset="0.2843" style="stop-color:#168306"/>
		<stop  offset="0.3847" style="stop-color:#107504"/>
		<stop  offset="0.508" style="stop-color:#0C6C03"/>
		<stop  offset="0.7211" style="stop-color:#0B6A03"/>
		<stop  offset="0.825" style="stop-color:#0B6803"/>
		<stop  offset="0.8624" style="stop-color:#0C6103"/>
		<stop  offset="0.883" style="stop-color:#0C5903"/>
		<stop  offset="0.9929" style="stop-color:#0C5103"/>
	</linearGradient>
	<path fill="url(#SVGID_57_)" d="M584.6,56.4v58.6c0,0-1,10.1-10.4,11.8H283.4c-9.4-1.6-10.4-11.8-10.4-11.8V56.4
		c0,0,1-10.1,10.4-11.8h290.8C583.6,46.3,584.6,56.4,584.6,56.4z"/>
	<path fill="#35C80D" d="M584.6,63.7v44.2c0,0-1,10.1-10.4,11.8H283.4C274,118,273,107.9,273,107.9V63.7c0,0,0.3-3.1,2.2-6.2
		c-0.2,0.9-0.3,1.5-0.3,1.5v44.9c0,0,1,10.2,10.1,11.8h287.2c9.1-1.6,10.1-11.8,10.1-11.8V59c0,0-0.1-1-0.5-2.4
		C584.2,59.9,584.6,63.7,584.6,63.7z"/>
	<path opacity="0.2" fill="#B9FFAB" d="M576.8,60.6v15.3c0,0-0.9,8.6-8.9,10H290c-8-1.4-8.9-10-8.9-10V60.6c0,0,0.9-8.6,8.9-10
		h277.9C575.9,51.9,576.8,60.6,576.8,60.6z"/>
	<path fill="#68F93A" d="M584.6,56.4v5.9c0,0-1-10.1-10.4-11.8H283.4C274,52.2,273,62.3,273,62.3v-5.9c0,0,1-10.1,10.4-11.8h290.8
		C583.6,46.3,584.6,56.4,584.6,56.4z"/>
</g>
<g id="green_button_6">
	<path fill="#30140C" d="M237.1,276.7h-71c-9.5,0-17.2,7.5-17.2,16.8V355c0,9.3,7.7,16.8,17.2,16.8h71c9.5,0,17.2-7.5,17.2-16.8
		v-61.5C254.3,284.2,246.6,276.7,237.1,276.7z"/>
	<linearGradient id="SVGID_58_" gradientUnits="userSpaceOnUse" x1="154.7616" y1="357.7064" x2="163.5274" y2="371.8987">
		<stop  offset="0" style="stop-color:#442116"/>
		<stop  offset="0.9961" style="stop-color:#D79280"/>
	</linearGradient>
	<path fill="url(#SVGID_58_)" d="M161.8,370.1c-10.8-1.9-12-13.6-12-13.6h-4.1c0.7,15.6,15.2,17.1,15.2,17.1h13.8l-0.8-3.5
		C173.8,370.1,162.9,370.3,161.8,370.1z"/>
	<rect x="173.8" y="370" fill="#D79280" width="55" height="3.5"/>
	<path fill="#804F38" d="M145.6,293.5l4.1-1.4c0,0,1.2-11.7,12-13.6c1.1-0.2,13.3,0,13.3,0v-3.5h-14.2
		C160.8,274.9,144.8,277.3,145.6,293.5z"/>
	<rect x="174.9" y="274.9" fill="#804F38" width="53" height="3.5"/>
	<linearGradient id="SVGID_59_" gradientUnits="userSpaceOnUse" x1="250.4997" y1="363.9643" x2="230.3564" y2="373.9346">
		<stop  offset="0" style="stop-color:#442116"/>
		<stop  offset="0.9961" style="stop-color:#D79280"/>
	</linearGradient>
	<path fill="url(#SVGID_59_)" d="M240.9,370.1c-1.2,0.2-12,0-12,0v3.5h13c0,0,14.5-1.5,15.2-17.1h-4.1
		C252.9,356.4,251.7,368.2,240.9,370.1z"/>
	<path fill="#804F38" d="M241.8,274.9h-14.2v3.5c0,0,12.1-0.2,13.3,0c10.8,1.9,12,13.6,12,13.6l4.1,1.4
		C257.8,277.3,241.8,274.9,241.8,274.9z"/>
	<linearGradient id="SVGID_60_" gradientUnits="userSpaceOnUse" x1="147.664" y1="355.3111" x2="147.664" y2="291.2705">
		<stop  offset="0" style="stop-color:#442116"/>
		<stop  offset="0.9961" style="stop-color:#805038"/>
	</linearGradient>
	<polygon fill="url(#SVGID_60_)" points="145.6,356.4 149.7,356.4 149.7,292.1 145.6,293.5 	"/>
	<linearGradient id="SVGID_61_" gradientUnits="userSpaceOnUse" x1="254.9684" y1="354.6973" x2="254.9684" y2="293.0467">
		<stop  offset="0" style="stop-color:#442116"/>
		<stop  offset="0.9961" style="stop-color:#805038"/>
	</linearGradient>
	<polygon fill="url(#SVGID_61_)" points="252.9,356.4 257,356.4 257,293.5 252.9,292.1 	"/>
	<linearGradient id="SVGID_62_" gradientUnits="userSpaceOnUse" x1="201.3184" y1="287.5278" x2="201.3184" y2="363.1596">
		<stop  offset="0" style="stop-color:#42E610"/>
		<stop  offset="4.312610e-002" style="stop-color:#38D00E"/>
		<stop  offset="0.1162" style="stop-color:#2AB00A"/>
		<stop  offset="0.1962" style="stop-color:#1F9708"/>
		<stop  offset="0.2843" style="stop-color:#168306"/>
		<stop  offset="0.3847" style="stop-color:#107504"/>
		<stop  offset="0.508" style="stop-color:#0C6C03"/>
		<stop  offset="0.7211" style="stop-color:#0B6A03"/>
		<stop  offset="0.8751" style="stop-color:#0B6803"/>
		<stop  offset="0.9305" style="stop-color:#0C6103"/>
		<stop  offset="0.961" style="stop-color:#0C5903"/>
		<stop  offset="0.9929" style="stop-color:#0C5103"/>
	</linearGradient>
	<path fill="url(#SVGID_62_)" d="M248.1,298.5v54.1c0,0-1,10.1-10.4,11.8h-72.8c-9.4-1.6-10.4-11.8-10.4-11.8v-54.1
		c0,0,1-10.1,10.4-11.8h72.8C247.1,288.4,248.1,298.5,248.1,298.5z"/>
	<path fill="#0C5103" d="M248.1,345.4v7.9c0,0-1,10.1-10.4,11.8h-72.8c-9.4-1.6-10.4-11.8-10.4-11.8v-7.9c0,0,1,11.9,10.4,13.6h72.8
		C247.1,357.3,248.1,345.4,248.1,345.4z"/>
	<path fill="#35C80D" d="M248.1,305.8V350c0,0-1,10.1-10.4,11.8h-72.8c-9.4-1.6-10.4-11.8-10.4-11.8v-44.2c0,0,0.3-3.1,2.2-6.2
		c-0.2,0.9-0.3,1.5-0.3,1.5V346c0,0,1,10.2,10.1,11.8h69.2c9.1-1.6,10.1-11.8,10.1-11.8v-44.9c0,0-0.1-1-0.5-2.4
		C247.7,302,248.1,305.8,248.1,305.8z"/>
	<path opacity="0.2" fill="#B9FFAB" d="M240.3,302.6v15.3c0,0-0.9,8.6-8.9,10h-59.9c-8-1.4-8.9-10-8.9-10v-15.3c0,0,0.9-8.6,8.9-10
		h59.9C239.4,294,240.3,302.6,240.3,302.6z"/>
	<path fill="#68F93A" d="M248.1,298.5v5.9c0,0-1-10.1-10.4-11.8h-72.8c-9.4,1.6-10.4,11.8-10.4,11.8v-5.9c0,0,1-10.1,10.4-11.8h72.8
		C247.1,288.4,248.1,298.5,248.1,298.5z"/>
	<path opacity="0.15" d="M237.7,286.7h-72.8c-9.4,1.6-10.4,11.8-10.4,11.8v54.1c0,0,1,10.1,10.4,11.8h72.8
		c9.4-1.6,10.4-11.8,10.4-11.8v-54.1C248.1,298.5,247.1,288.4,237.7,286.7z"/>
</g>
<g id="green_button_5">
	<path fill="#30140C" d="M237.1,156.6h-71c-9.5,0-17.2,7.5-17.2,16.8v61.5c0,9.3,7.7,16.8,17.2,16.8h71c9.5,0,17.2-7.5,17.2-16.8
		v-61.5C254.3,164.1,246.6,156.6,237.1,156.6z"/>
	<linearGradient id="SVGID_63_" gradientUnits="userSpaceOnUse" x1="154.7616" y1="237.6209" x2="163.5274" y2="251.8132">
		<stop  offset="0" style="stop-color:#442116"/>
		<stop  offset="0.9961" style="stop-color:#D79280"/>
	</linearGradient>
	<path fill="url(#SVGID_63_)" d="M161.8,250c-10.8-1.9-12-13.6-12-13.6h-4.1c0.7,15.6,15.2,17.1,15.2,17.1h13.8l-0.8-3.5
		C173.8,250,162.9,250.2,161.8,250z"/>
	<rect x="173.8" y="250" fill="#D79280" width="55" height="3.5"/>
	<path fill="#804F38" d="M145.6,173.4l4.1-1.4c0,0,1.2-11.7,12-13.6c1.1-0.2,13.3,0,13.3,0v-3.5h-14.2
		C160.8,154.9,144.8,157.2,145.6,173.4z"/>
	<rect x="174.9" y="154.9" fill="#804F38" width="53" height="3.5"/>
	<linearGradient id="SVGID_64_" gradientUnits="userSpaceOnUse" x1="250.4997" y1="243.8789" x2="230.3564" y2="253.8492">
		<stop  offset="0" style="stop-color:#442116"/>
		<stop  offset="0.9961" style="stop-color:#D79280"/>
	</linearGradient>
	<path fill="url(#SVGID_64_)" d="M240.9,250c-1.2,0.2-12,0-12,0v3.5h13c0,0,14.5-1.5,15.2-17.1h-4.1
		C252.9,236.4,251.7,248.1,240.9,250z"/>
	<path fill="#804F38" d="M241.8,154.9h-14.2v3.5c0,0,12.1-0.2,13.3,0c10.8,1.9,12,13.6,12,13.6l4.1,1.4
		C257.8,157.2,241.8,154.9,241.8,154.9z"/>
	<linearGradient id="SVGID_65_" gradientUnits="userSpaceOnUse" x1="147.664" y1="235.2256" x2="147.664" y2="171.1851">
		<stop  offset="0" style="stop-color:#442116"/>
		<stop  offset="0.9961" style="stop-color:#805038"/>
	</linearGradient>
	<polygon fill="url(#SVGID_65_)" points="145.6,236.4 149.7,236.4 149.7,172 145.6,173.4 	"/>
	<linearGradient id="SVGID_66_" gradientUnits="userSpaceOnUse" x1="254.9684" y1="234.6118" x2="254.9684" y2="172.9612">
		<stop  offset="0" style="stop-color:#442116"/>
		<stop  offset="0.9961" style="stop-color:#805038"/>
	</linearGradient>
	<polygon fill="url(#SVGID_66_)" points="252.9,236.4 257,236.4 257,173.4 252.9,172 	"/>
	<linearGradient id="SVGID_67_" gradientUnits="userSpaceOnUse" x1="201.3184" y1="163.5614" x2="201.3184" y2="243.6459">
		<stop  offset="0" style="stop-color:#00F500"/>
		<stop  offset="0.1012" style="stop-color:#03DE01"/>
		<stop  offset="0.244" style="stop-color:#07C502"/>
		<stop  offset="0.392" style="stop-color:#09B202"/>
		<stop  offset="0.5472" style="stop-color:#0BA803"/>
		<stop  offset="0.7211" style="stop-color:#0BA403"/>
		<stop  offset="0.9047" style="stop-color:#0AA505"/>
		<stop  offset="0.9708" style="stop-color:#05A70C"/>
		<stop  offset="1" style="stop-color:#00A912"/>
	</linearGradient>
	<path fill="url(#SVGID_67_)" d="M248.1,174.5v58.6c0,0-1,10.1-10.4,11.8h-72.8c-9.4-1.6-10.4-11.8-10.4-11.8v-58.6
		c0,0,1-10.1,10.4-11.8h72.8C247.1,164.4,248.1,174.5,248.1,174.5z"/>
	<path fill="#05A70B" d="M248.1,225.3v7.9c0,0-1,10.1-10.4,11.8h-72.8c-9.4-1.6-10.4-11.8-10.4-11.8v-7.9c0,0,1,10.1,10.4,11.8h72.8
		C247.1,235.4,248.1,225.3,248.1,225.3z"/>
	<path fill="#59ED29" d="M248.1,181.8v44.2c0,0-1,10.1-10.4,11.8h-72.8c-9.4-1.6-10.4-11.8-10.4-11.8v-44.2c0,0,0.3-3.1,2.2-6.2
		c-0.2,0.9-0.3,1.5-0.3,1.5v44.9c0,0,1,10.2,10.1,11.8h69.2c9.1-1.6,10.1-11.8,10.1-11.8v-44.9c0,0-0.1-1-0.5-2.4
		C247.7,178,248.1,181.8,248.1,181.8z"/>
	<path opacity="0.2" fill="#DBFFD2" d="M240.3,178.6v15.3c0,0-0.9,8.6-8.9,10h-59.9c-8-1.4-8.9-10-8.9-10v-15.3c0,0,0.9-8.6,8.9-10
		h59.9C239.4,170,240.3,178.6,240.3,178.6z"/>
	<path fill="#97FF71" d="M248.1,174.5v5.9c0,0-1-10.1-10.4-11.8h-72.8c-9.4,1.6-10.4,11.8-10.4,11.8v-5.9c0,0,1-10.1,10.4-11.8h72.8
		C247.1,164.4,248.1,174.5,248.1,174.5z"/>
</g>
<g id="green_button_4">
	<path fill="#30140C" d="M237.1,36.1h-71c-9.5,0-17.2,7.5-17.2,16.8v61.5c0,9.3,7.7,16.8,17.2,16.8h71c9.5,0,17.2-7.5,17.2-16.8
		V52.9C254.3,43.6,246.6,36.1,237.1,36.1z"/>
	<linearGradient id="SVGID_68_" gradientUnits="userSpaceOnUse" x1="154.7616" y1="117.118" x2="163.5274" y2="131.3102">
		<stop  offset="0" style="stop-color:#442116"/>
		<stop  offset="0.9961" style="stop-color:#D79280"/>
	</linearGradient>
	<path fill="url(#SVGID_68_)" d="M161.8,129.5c-10.8-1.9-12-13.6-12-13.6h-4.1c0.7,15.6,15.2,17.1,15.2,17.1h13.8l-0.8-3.5
		C173.8,129.5,162.9,129.7,161.8,129.5z"/>
	<rect x="173.8" y="129.5" fill="#D79280" width="55" height="3.5"/>
	<path fill="#804F38" d="M145.6,52.9l4.1-1.4c0,0,1.2-11.7,12-13.6c1.1-0.2,13.3,0,13.3,0v-3.5h-14.2
		C160.8,34.4,144.8,36.7,145.6,52.9z"/>
	<rect x="174.9" y="34.4" fill="#804F38" width="53" height="3.5"/>
	<linearGradient id="SVGID_69_" gradientUnits="userSpaceOnUse" x1="250.4997" y1="123.3759" x2="230.3564" y2="133.3462">
		<stop  offset="0" style="stop-color:#442116"/>
		<stop  offset="0.9961" style="stop-color:#D79280"/>
	</linearGradient>
	<path fill="url(#SVGID_69_)" d="M240.9,129.5c-1.2,0.2-12,0-12,0v3.5h13c0,0,14.5-1.5,15.2-17.1h-4.1
		C252.9,115.9,251.7,127.6,240.9,129.5z"/>
	<path fill="#804F38" d="M241.8,34.4h-14.2v3.5c0,0,12.1-0.2,13.3,0c10.8,1.9,12,13.6,12,13.6l4.1,1.4
		C257.8,36.7,241.8,34.4,241.8,34.4z"/>
	<linearGradient id="SVGID_70_" gradientUnits="userSpaceOnUse" x1="147.664" y1="114.7227" x2="147.664" y2="50.6821">
		<stop  offset="0" style="stop-color:#442116"/>
		<stop  offset="0.9961" style="stop-color:#805038"/>
	</linearGradient>
	<polygon fill="url(#SVGID_70_)" points="145.6,115.9 149.7,115.9 149.7,51.5 145.6,52.9 	"/>
	<linearGradient id="SVGID_71_" gradientUnits="userSpaceOnUse" x1="254.9684" y1="114.1089" x2="254.9684" y2="52.4583">
		<stop  offset="0" style="stop-color:#442116"/>
		<stop  offset="0.9961" style="stop-color:#805038"/>
	</linearGradient>
	<polygon fill="url(#SVGID_71_)" points="252.9,115.9 257,115.9 257,52.9 252.9,51.5 	"/>
	<linearGradient id="SVGID_72_" gradientUnits="userSpaceOnUse" x1="201.3184" y1="43.0585" x2="201.3184" y2="123.1429">
		<stop  offset="0" style="stop-color:#42E610"/>
		<stop  offset="4.312610e-002" style="stop-color:#38D00E"/>
		<stop  offset="0.1162" style="stop-color:#2AB00A"/>
		<stop  offset="0.1962" style="stop-color:#1F9708"/>
		<stop  offset="0.2843" style="stop-color:#168306"/>
		<stop  offset="0.3847" style="stop-color:#107504"/>
		<stop  offset="0.508" style="stop-color:#0C6C03"/>
		<stop  offset="0.7211" style="stop-color:#0B6A03"/>
		<stop  offset="0.8868" style="stop-color:#0A6C04"/>
		<stop  offset="0.9464" style="stop-color:#077308"/>
		<stop  offset="0.9889" style="stop-color:#027E0F"/>
		<stop  offset="1" style="stop-color:#008312"/>
	</linearGradient>
	<path fill="url(#SVGID_72_)" d="M248.1,54v58.6c0,0-1,10.1-10.4,11.8h-72.8c-9.4-1.6-10.4-11.8-10.4-11.8V54c0,0,1-10.1,10.4-11.8
		h72.8C247.1,43.9,248.1,54,248.1,54z"/>
	<path fill="#0C5103" d="M248.1,104.8v7.9c0,0-1,10.1-10.4,11.8h-72.8c-9.4-1.6-10.4-11.8-10.4-11.8v-7.9c0,0,1,10.1,10.4,11.8h72.8
		C247.1,114.9,248.1,104.8,248.1,104.8z"/>
	<path fill="#35C80D" d="M248.1,61.3v44.2c0,0-1,10.1-10.4,11.8h-72.8c-9.4-1.6-10.4-11.8-10.4-11.8V61.3c0,0,0.3-3.1,2.2-6.2
		c-0.2,0.9-0.3,1.5-0.3,1.5v44.9c0,0,1,10.2,10.1,11.8h69.2c9.1-1.6,10.1-11.8,10.1-11.8V56.5c0,0-0.1-1-0.5-2.4
		C247.7,57.5,248.1,61.3,248.1,61.3z"/>
	<path opacity="0.2" fill="#B9FFAB" d="M240.3,58.1v15.3c0,0-0.9,8.6-8.9,10h-59.9c-8-1.4-8.9-10-8.9-10V58.1c0,0,0.9-8.6,8.9-10
		h59.9C239.4,49.5,240.3,58.1,240.3,58.1z"/>
	<path fill="#68F93A" d="M248.1,54v5.9c0,0-1-10.1-10.4-11.8h-72.8c-9.4,1.6-10.4,11.8-10.4,11.8V54c0,0,1-10.1,10.4-11.8h72.8
		C247.1,43.9,248.1,54,248.1,54z"/>
</g>
<g id="green_button_3">
	<linearGradient id="SVGID_73_" gradientUnits="userSpaceOnUse" x1="79.925" y1="375.4708" x2="79.925" y2="281.6377">
		<stop  offset="0" style="stop-color:#D79280"/>
		<stop  offset="5.966666e-003" style="stop-color:#D4907E"/>
		<stop  offset="9.073454e-002" style="stop-color:#AE7260"/>
		<stop  offset="0.1749" style="stop-color:#905B48"/>
		<stop  offset="0.2573" style="stop-color:#7A4A37"/>
		<stop  offset="0.3372" style="stop-color:#6D402D"/>
		<stop  offset="0.4116" style="stop-color:#693D2A"/>
		<stop  offset="1" style="stop-color:#693D2A"/>
	</linearGradient>
	<ellipse fill="url(#SVGID_73_)" cx="79.9" cy="326.4" rx="49.4" ry="49.6"/>
	<ellipse fill="#30140C" cx="79.9" cy="325.5" rx="46.4" ry="46.7"/>
	<ellipse fill="#0C5103" cx="80" cy="327.1" rx="42.8" ry="40.8"/>
	<linearGradient id="SVGID_74_" gradientUnits="userSpaceOnUse" x1="79.9622" y1="284.6122" x2="79.9622" y2="358.9656">
		<stop  offset="0" style="stop-color:#42E610"/>
		<stop  offset="4.312610e-002" style="stop-color:#38D00E"/>
		<stop  offset="0.1162" style="stop-color:#2AB00A"/>
		<stop  offset="0.1962" style="stop-color:#1F9708"/>
		<stop  offset="0.2843" style="stop-color:#168306"/>
		<stop  offset="0.3847" style="stop-color:#107504"/>
		<stop  offset="0.508" style="stop-color:#0C6C03"/>
		<stop  offset="0.7211" style="stop-color:#0B6A03"/>
		<stop  offset="0.8751" style="stop-color:#0B6803"/>
		<stop  offset="0.9305" style="stop-color:#0C6103"/>
		<stop  offset="0.961" style="stop-color:#0C5903"/>
		<stop  offset="0.9929" style="stop-color:#0C5103"/>
	</linearGradient>
	<ellipse fill="url(#SVGID_74_)" cx="80" cy="324.7" rx="41" ry="39.1"/>
	<ellipse opacity="0.2" fill="#B9FFAB" cx="80" cy="301.9" rx="30.8" ry="14.4"/>
	<path fill="#35C80D" d="M120.9,326.6c-1,20.7-16.8,38.8-41,38.8c-26.9,0-41-19.1-41-40.7c0-1.3,0.1-2.7,0.2-4c0,0.6,0,1.2,0,1.8
		c0,21.6,18.1,39.3,40.8,39.3C101.1,361.9,118.8,346.3,120.9,326.6z"/>
	<path fill="#68F93A" d="M120.9,322.5c-1-20.7-19-37.2-41-37.2c-22.7,0-41,17.5-41,39.1c0,1.3,0.1,2.7,0.2,4c0-0.6,0-1.2,0-1.8
		c0-21.6,18.1-38,40.8-38C101.1,288.6,118.8,302.8,120.9,322.5z"/>
	<path opacity="0.15" d="M109.7,297.7c-7.5-7.5-18-12.2-29.7-12.2s-22.2,4.7-29.7,12.2c-8.1,7.4-13.1,17.8-13.1,29.4
		c0,22.6,19.2,40.8,42.8,40.8c23.7,0,42.8-18.3,42.8-40.8C122.8,315.6,117.8,305.2,109.7,297.7z"/>
</g>
<g id="green_button_2">
	<linearGradient id="SVGID_75_" gradientUnits="userSpaceOnUse" x1="79.925" y1="255.3854" x2="79.925" y2="161.5523">
		<stop  offset="0" style="stop-color:#D79280"/>
		<stop  offset="5.966666e-003" style="stop-color:#D4907E"/>
		<stop  offset="9.073454e-002" style="stop-color:#AE7260"/>
		<stop  offset="0.1749" style="stop-color:#905B48"/>
		<stop  offset="0.2573" style="stop-color:#7A4A37"/>
		<stop  offset="0.3372" style="stop-color:#6D402D"/>
		<stop  offset="0.4116" style="stop-color:#693D2A"/>
		<stop  offset="1" style="stop-color:#693D2A"/>
	</linearGradient>
	<ellipse fill="url(#SVGID_75_)" cx="79.9" cy="206.3" rx="49.4" ry="49.6"/>
	<ellipse fill="#30140C" cx="79.9" cy="205.4" rx="46.4" ry="46.7"/>
	<ellipse fill="#05A70B" cx="80" cy="207.1" rx="42.8" ry="40.8"/>
	<linearGradient id="SVGID_76_" gradientUnits="userSpaceOnUse" x1="79.9622" y1="160.5997" x2="79.9622" y2="234.9531">
		<stop  offset="0" style="stop-color:#00F500"/>
		<stop  offset="0.1012" style="stop-color:#03DE01"/>
		<stop  offset="0.244" style="stop-color:#07C502"/>
		<stop  offset="0.392" style="stop-color:#09B202"/>
		<stop  offset="0.5472" style="stop-color:#0BA803"/>
		<stop  offset="0.7211" style="stop-color:#0BA403"/>
		<stop  offset="0.9047" style="stop-color:#0AA505"/>
		<stop  offset="0.9708" style="stop-color:#05A70C"/>
		<stop  offset="1" style="stop-color:#00A912"/>
	</linearGradient>
	<ellipse fill="url(#SVGID_76_)" cx="80" cy="200.7" rx="41" ry="39.1"/>
	<ellipse opacity="0.2" fill="#DBFFD2" cx="80" cy="177.9" rx="30.8" ry="14.4"/>
	<path fill="#59ED29" d="M120.9,202.6c-1,20.7-16.8,38.8-41,38.8c-26.9,0-41-19.1-41-40.7c0-1.3,0.1-2.7,0.2-4c0,0.6,0,1.2,0,1.8
		c0,21.6,18.1,39.3,40.8,39.3C101.1,237.9,118.8,222.3,120.9,202.6z"/>
	<path fill="#97FF71" d="M120.9,198.5c-1-20.7-19-37.2-41-37.2c-22.7,0-41,17.5-41,39.1c0,1.3,0.1,2.7,0.2,4c0-0.6,0-1.2,0-1.8
		c0-21.6,18.1-38,40.8-38C101.1,164.6,118.8,178.8,120.9,198.5z"/>
</g>
<g id="green_button_1">
	<linearGradient id="SVGID_77_" gradientUnits="userSpaceOnUse" x1="79.925" y1="134.8824" x2="79.925" y2="41.0493">
		<stop  offset="0" style="stop-color:#D79280"/>
		<stop  offset="5.966666e-003" style="stop-color:#D4907E"/>
		<stop  offset="9.073454e-002" style="stop-color:#AE7260"/>
		<stop  offset="0.1749" style="stop-color:#905B48"/>
		<stop  offset="0.2573" style="stop-color:#7A4A37"/>
		<stop  offset="0.3372" style="stop-color:#6D402D"/>
		<stop  offset="0.4116" style="stop-color:#693D2A"/>
		<stop  offset="1" style="stop-color:#693D2A"/>
	</linearGradient>
	<ellipse fill="url(#SVGID_77_)" cx="79.9" cy="85.8" rx="49.4" ry="49.6"/>
	<ellipse fill="#30140C" cx="79.9" cy="84.9" rx="46.4" ry="46.7"/>
	<ellipse fill="#0C5103" cx="80" cy="86.5" rx="42.8" ry="40.8"/>
	<linearGradient id="SVGID_78_" gradientUnits="userSpaceOnUse" x1="79.9622" y1="40.0967" x2="79.9622" y2="114.4501">
		<stop  offset="0" style="stop-color:#42E610"/>
		<stop  offset="4.312610e-002" style="stop-color:#38D00E"/>
		<stop  offset="0.1162" style="stop-color:#2AB00A"/>
		<stop  offset="0.1962" style="stop-color:#1F9708"/>
		<stop  offset="0.2843" style="stop-color:#168306"/>
		<stop  offset="0.3847" style="stop-color:#107504"/>
		<stop  offset="0.508" style="stop-color:#0C6C03"/>
		<stop  offset="0.7211" style="stop-color:#0B6A03"/>
		<stop  offset="0.8868" style="stop-color:#0A6C04"/>
		<stop  offset="0.9464" style="stop-color:#077308"/>
		<stop  offset="0.9889" style="stop-color:#027E0F"/>
		<stop  offset="1" style="stop-color:#008312"/>
	</linearGradient>
	<ellipse fill="url(#SVGID_78_)" cx="80" cy="80.2" rx="41" ry="39.1"/>
	<ellipse opacity="0.2" fill="#B9FFAB" cx="80" cy="57.4" rx="30.8" ry="14.4"/>
	<path fill="#35C80D" d="M120.9,82.1c-1,20.7-16.8,38.8-41,38.8c-26.9,0-41-19.1-41-40.7c0-1.3,0.1-2.7,0.2-4c0,0.6,0,1.2,0,1.8
		c0,21.6,18.1,39.3,40.8,39.3C101.1,117.4,118.8,101.8,120.9,82.1z"/>
	<path fill="#68F93A" d="M120.9,78c-1-20.7-19-37.2-41-37.2c-22.7,0-41,17.5-41,39.1c0,1.3,0.1,2.7,0.2,4c0-0.6,0-1.2,0-1.8
		c0-21.6,18.1-38,40.8-38C101.1,44.1,118.8,58.3,120.9,78z"/>
	<g>
	</g>
	<g>
	</g>
	<g>
	</g>
	<g>
	</g>
	<g>
	</g>
	<g>
	</g>
</g>
</svg>
