%YAML 1.1
%TAG !u! tag:unity3d.com,2011:
--- !u!114 &11400000
MonoBehaviour:
  m_ObjectHideFlags: 0
  m_CorrespondingSourceObject: {fileID: 0}
  m_PrefabInstance: {fileID: 0}
  m_PrefabAsset: {fileID: 0}
  m_GameObject: {fileID: 0}
  m_Enabled: 1
  m_EditorHideFlags: 0
  m_Script: {fileID: 11500000, guid: fa25ed36a316bff4788c56cd1f853741, type: 3}
  m_Name: FireWeapon
  m_EditorClassIdentifier: 
  ItemMesh: {fileID: 4300000, guid: 39ae8618fdf0a544384e3b025d4fe826, type: 3}
  Points: 50
  Price: 100
  Rotation: {x: 0, y: 0, z: 0, w: 0}
  Damage: 25
  Distance: 50
  Cadency: 5
  MaxBullets: 10
