%YAML 1.1
%TAG !u! tag:unity3d.com,2011:
--- !u!1 &7588289076613159040
GameObject:
  m_ObjectHideFlags: 0
  m_CorrespondingSourceObject: {fileID: 0}
  m_PrefabInstance: {fileID: 0}
  m_PrefabAsset: {fileID: 0}
  serializedVersion: 6
  m_Component:
  - component: {fileID: 5074212561355577176}
  - component: {fileID: 2528567834194874102}
  - component: {fileID: 3273998218332302231}
  - component: {fileID: -826469753284480293}
  - component: {fileID: 4178159188197126771}
  m_Layer: 0
  m_Name: Alien - Fragate
  m_TagString: Enemy
  m_Icon: {fileID: 0}
  m_NavMeshLayer: 0
  m_StaticEditorFlags: 0
  m_IsActive: 1
--- !u!4 &5074212561355577176
Transform:
  m_ObjectHideFlags: 0
  m_CorrespondingSourceObject: {fileID: 0}
  m_PrefabInstance: {fileID: 0}
  m_PrefabAsset: {fileID: 0}
  m_GameObject: {fileID: 7588289076613159040}
  m_LocalRotation: {x: 0, y: 0, z: 0, w: 1}
  m_LocalPosition: {x: -4, y: 11.96, z: -0.08756686}
  m_LocalScale: {x: 1, y: 1, z: 1}
  m_ConstrainProportionsScale: 0
  m_Children: []
  m_Father: {fileID: 0}
  m_RootOrder: 0
  m_LocalEulerAnglesHint: {x: 0, y: 0, z: 0}
--- !u!212 &2528567834194874102
SpriteRenderer:
  m_ObjectHideFlags: 0
  m_CorrespondingSourceObject: {fileID: 0}
  m_PrefabInstance: {fileID: 0}
  m_PrefabAsset: {fileID: 0}
  m_GameObject: {fileID: 7588289076613159040}
  m_Enabled: 1
  m_CastShadows: 0
  m_ReceiveShadows: 0
  m_DynamicOccludee: 1
  m_StaticShadowCaster: 0
  m_MotionVectors: 1
  m_LightProbeUsage: 1
  m_ReflectionProbeUsage: 1
  m_RayTracingMode: 0
  m_RayTraceProcedural: 0
  m_RenderingLayerMask: 1
  m_RendererPriority: 0
  m_Materials:
  - {fileID: 10754, guid: 0000000000000000f000000000000000, type: 0}
  m_StaticBatchInfo:
    firstSubMesh: 0
    subMeshCount: 0
  m_StaticBatchRoot: {fileID: 0}
  m_ProbeAnchor: {fileID: 0}
  m_LightProbeVolumeOverride: {fileID: 0}
  m_ScaleInLightmap: 1
  m_ReceiveGI: 1
  m_PreserveUVs: 0
  m_IgnoreNormalsForChartDetection: 0
  m_ImportantGI: 0
  m_StitchLightmapSeams: 1
  m_SelectedEditorRenderState: 0
  m_MinimumChartSize: 4
  m_AutoUVMaxDistance: 0.5
  m_AutoUVMaxAngle: 89
  m_LightmapParameters: {fileID: 0}
  m_SortingLayerID: 0
  m_SortingLayer: 0
  m_SortingOrder: 0
  m_Sprite: {fileID: 21300000, guid: 9323a6c37ab7cee46aff0f07c38607a9, type: 3}
  m_Color: {r: 1, g: 1, b: 1, a: 1}
  m_FlipX: 0
  m_FlipY: 0
  m_DrawMode: 0
  m_Size: {x: 2.09, y: 4.79}
  m_AdaptiveModeThreshold: 0.5
  m_SpriteTileMode: 0
  m_WasSpriteAssigned: 1
  m_MaskInteraction: 0
  m_SpriteSortPoint: 0
--- !u!60 &3273998218332302231
PolygonCollider2D:
  m_ObjectHideFlags: 0
  m_CorrespondingSourceObject: {fileID: 0}
  m_PrefabInstance: {fileID: 0}
  m_PrefabAsset: {fileID: 0}
  m_GameObject: {fileID: 7588289076613159040}
  m_Enabled: 1
  m_Density: 1
  m_Material: {fileID: 0}
  m_IsTrigger: 0
  m_UsedByEffector: 0
  m_UsedByComposite: 0
  m_Offset: {x: 0, y: 0}
  m_SpriteTilingProperty:
    border: {x: 0, y: 0, z: 0, w: 0}
    pivot: {x: 0.5, y: 0.5}
    oldSize: {x: 2.09, y: 4.79}
    newSize: {x: 2.09, y: 4.79}
    adaptiveTilingThreshold: 0.5
    drawMode: 0
    adaptiveTiling: 0
  m_AutoTiling: 0
  m_Points:
    m_Paths:
    - - {x: 0.205, y: -2.395}
      - {x: 0.275, y: -2.235}
      - {x: 0.325, y: -1.9449999}
      - {x: 0.33499998, y: -1.525}
      - {x: 0.39499998, y: -1.4549999}
      - {x: 0.575, y: -1.4449999}
      - {x: 0.645, y: -1.365}
      - {x: 0.645, y: -1.275}
      - {x: 0.79499996, y: -1.295}
      - {x: 1.045, y: -0.97499996}
      - {x: 1.045, y: -0.655}
      - {x: 0.92499995, y: -0.505}
      - {x: 0.625, y: -0.385}
      - {x: 0.585, y: -0.33499998}
      - {x: 0.505, y: -0.315}
      - {x: 0.415, y: -0.405}
      - {x: 0.48499998, y: -0.275}
      - {x: 0.49499997, y: 0.39499998}
      - {x: 0.555, y: 0.475}
      - {x: 0.545, y: 1.115}
      - {x: 0.515, y: 1.5649999}
      - {x: 0.435, y: 2.155}
      - {x: 0.42499998, y: 2.385}
      - {x: 0.415, y: 2.395}
      - {x: 0.355, y: 2.395}
      - {x: 0.275, y: 2.0449998}
      - {x: 0.205, y: 1.895}
      - {x: 0.24499999, y: 1.6949999}
      - {x: 0.235, y: 1.3149999}
      - {x: 0.195, y: 1.275}
      - {x: 0.145, y: 1.115}
      - {x: 0.125, y: 1.615}
      - {x: 0.145, y: 1.675}
      - {x: 0.145, y: 1.875}
      - {x: 0.085, y: 2.245}
      - {x: 0.055, y: 2.355}
      - {x: 0.005, y: 2.395}
      - {x: -0.035, y: 2.395}
      - {x: -0.114999995, y: 2.2549999}
      - {x: -0.16499999, y: 1.805}
      - {x: -0.145, y: 1.615}
      - {x: -0.145, y: 1.115}
      - {x: -0.195, y: 1.275}
      - {x: -0.235, y: 1.3149999}
      - {x: -0.24499999, y: 1.785}
      - {x: -0.21499999, y: 1.885}
      - {x: -0.275, y: 1.925}
      - {x: -0.285, y: 2.105}
      - {x: -0.36499998, y: 2.395}
      - {x: -0.42499998, y: 2.395}
      - {x: -0.45499998, y: 2.075}
      - {x: -0.515, y: 1.5649999}
      - {x: -0.555, y: 0.865}
      - {x: -0.555, y: 0.705}
      - {x: -0.565, y: 0.475}
      - {x: -0.48499998, y: 0.405}
      - {x: -0.48499998, y: -0.24499999}
      - {x: -0.475, y: -0.275}
      - {x: -0.405, y: -0.345}
      - {x: -0.515, y: -0.33499998}
      - {x: -0.585, y: -0.33499998}
      - {x: -0.625, y: -0.385}
      - {x: -0.625, y: -0.48499998}
      - {x: -0.865, y: -0.48499998}
      - {x: -0.92499995, y: -0.515}
      - {x: -0.945, y: -0.545}
      - {x: -1.045, y: -0.66499996}
      - {x: -1.045, y: -0.92499995}
      - {x: -1.005, y: -1.015}
      - {x: -0.79499996, y: -1.285}
      - {x: -0.565, y: -1.435}
      - {x: -0.505, y: -1.4549999}
      - {x: -0.405, y: -1.365}
      - {x: -0.39499998, y: -1.4449999}
      - {x: -0.325, y: -1.5749999}
      - {x: -0.33499998, y: -1.875}
      - {x: -0.275, y: -2.235}
      - {x: -0.205, y: -2.395}
      - {x: -0.13499999, y: -2.395}
      - {x: -0.095, y: -2.355}
      - {x: 0.095, y: -2.345}
      - {x: 0.145, y: -2.395}
--- !u!114 &-826469753284480293
MonoBehaviour:
  m_ObjectHideFlags: 0
  m_CorrespondingSourceObject: {fileID: 0}
  m_PrefabInstance: {fileID: 0}
  m_PrefabAsset: {fileID: 0}
  m_GameObject: {fileID: 7588289076613159040}
  m_Enabled: 1
  m_EditorHideFlags: 0
  m_Script: {fileID: 11500000, guid: 2bb9d5506ffb3f04da00ba5d2b840010, type: 3}
  m_Name: 
  m_EditorClassIdentifier: 
  Speed: 0
  Points: 0
  TimeBetweenBullets: 0
  _bullet: {fileID: 7653994107963560601, guid: 1346c7313debd436dbf879eb83243d30, type: 3}
--- !u!50 &4178159188197126771
Rigidbody2D:
  serializedVersion: 4
  m_ObjectHideFlags: 0
  m_CorrespondingSourceObject: {fileID: 0}
  m_PrefabInstance: {fileID: 0}
  m_PrefabAsset: {fileID: 0}
  m_GameObject: {fileID: 7588289076613159040}
  m_BodyType: 0
  m_Simulated: 1
  m_UseFullKinematicContacts: 0
  m_UseAutoMass: 0
  m_Mass: 1
  m_LinearDrag: 0
  m_AngularDrag: 0.05
  m_GravityScale: 0
  m_Material: {fileID: 0}
  m_Interpolate: 0
  m_SleepingMode: 1
  m_CollisionDetection: 0
  m_Constraints: 4
