%YAML 1.1
%TAG !u! tag:unity3d.com,2011:
--- !u!1001 &7655961303751007117
PrefabInstance:
  m_ObjectHideFlags: 0
  serializedVersion: 2
  m_Modification:
    m_TransformParent: {fileID: 0}
    m_Modifications:
    - target: {fileID: 1973797488871700, guid: 48e06088b7e195f40898a828bd389ec3, type: 3}
      propertyPath: m_Name
      value: fireball-red-tail-big Variant
      objectReference: {fileID: 0}
    - target: {fileID: 1973797488871700, guid: 48e06088b7e195f40898a828bd389ec3, type: 3}
      propertyPath: m_TagString
      value: EnemyBullet
      objectReference: {fileID: 0}
    - target: {fileID: 4469022170149554, guid: 48e06088b7e195f40898a828bd389ec3, type: 3}
      propertyPath: m_RootOrder
      value: 0
      objectReference: {fileID: 0}
    - target: {fileID: 4469022170149554, guid: 48e06088b7e195f40898a828bd389ec3, type: 3}
      propertyPath: m_LocalPosition.x
      value: 1
      objectReference: {fileID: 0}
    - target: {fileID: 4469022170149554, guid: 48e06088b7e195f40898a828bd389ec3, type: 3}
      propertyPath: m_LocalPosition.y
      value: 7.957789
      objectReference: {fileID: 0}
    - target: {fileID: 4469022170149554, guid: 48e06088b7e195f40898a828bd389ec3, type: 3}
      propertyPath: m_LocalPosition.z
      value: -0.08756686
      objectReference: {fileID: 0}
    - target: {fileID: 4469022170149554, guid: 48e06088b7e195f40898a828bd389ec3, type: 3}
      propertyPath: m_LocalRotation.w
      value: 1
      objectReference: {fileID: 0}
    - target: {fileID: 4469022170149554, guid: 48e06088b7e195f40898a828bd389ec3, type: 3}
      propertyPath: m_LocalRotation.x
      value: 0
      objectReference: {fileID: 0}
    - target: {fileID: 4469022170149554, guid: 48e06088b7e195f40898a828bd389ec3, type: 3}
      propertyPath: m_LocalRotation.y
      value: 0
      objectReference: {fileID: 0}
    - target: {fileID: 4469022170149554, guid: 48e06088b7e195f40898a828bd389ec3, type: 3}
      propertyPath: m_LocalRotation.z
      value: 0
      objectReference: {fileID: 0}
    - target: {fileID: 4469022170149554, guid: 48e06088b7e195f40898a828bd389ec3, type: 3}
      propertyPath: m_LocalEulerAnglesHint.x
      value: 0
      objectReference: {fileID: 0}
    - target: {fileID: 4469022170149554, guid: 48e06088b7e195f40898a828bd389ec3, type: 3}
      propertyPath: m_LocalEulerAnglesHint.y
      value: 0
      objectReference: {fileID: 0}
    - target: {fileID: 4469022170149554, guid: 48e06088b7e195f40898a828bd389ec3, type: 3}
      propertyPath: m_LocalEulerAnglesHint.z
      value: 0
      objectReference: {fileID: 0}
    m_RemovedComponents: []
  m_SourcePrefab: {fileID: 100100000, guid: 48e06088b7e195f40898a828bd389ec3, type: 3}
--- !u!1 &7653994107963560601 stripped
GameObject:
  m_CorrespondingSourceObject: {fileID: 1973797488871700, guid: 48e06088b7e195f40898a828bd389ec3,
    type: 3}
  m_PrefabInstance: {fileID: 7655961303751007117}
  m_PrefabAsset: {fileID: 0}
--- !u!50 &-3380045282584126152
Rigidbody2D:
  serializedVersion: 4
  m_ObjectHideFlags: 0
  m_CorrespondingSourceObject: {fileID: 0}
  m_PrefabInstance: {fileID: 0}
  m_PrefabAsset: {fileID: 0}
  m_GameObject: {fileID: 7653994107963560601}
  m_BodyType: 0
  m_Simulated: 1
  m_UseFullKinematicContacts: 0
  m_UseAutoMass: 0
  m_Mass: 1
  m_LinearDrag: 0
  m_AngularDrag: 0.05
  m_GravityScale: 0
  m_Material: {fileID: 0}
  m_Interpolate: 0
  m_SleepingMode: 1
  m_CollisionDetection: 0
  m_Constraints: 0
--- !u!58 &787634211330009779
CircleCollider2D:
  m_ObjectHideFlags: 0
  m_CorrespondingSourceObject: {fileID: 0}
  m_PrefabInstance: {fileID: 0}
  m_PrefabAsset: {fileID: 0}
  m_GameObject: {fileID: 7653994107963560601}
  m_Enabled: 1
  m_Density: 1
  m_Material: {fileID: 0}
  m_IsTrigger: 0
  m_UsedByEffector: 0
  m_UsedByComposite: 0
  m_Offset: {x: -0.0029103905, y: 0.004922956}
  serializedVersion: 2
  m_Radius: 0.05610743
--- !u!114 &-1920861410396447220
MonoBehaviour:
  m_ObjectHideFlags: 0
  m_CorrespondingSourceObject: {fileID: 0}
  m_PrefabInstance: {fileID: 0}
  m_PrefabAsset: {fileID: 0}
  m_GameObject: {fileID: 7653994107963560601}
  m_Enabled: 1
  m_EditorHideFlags: 0
  m_Script: {fileID: 11500000, guid: b01e242633ca90848afddba7a1c50d3d, type: 3}
  m_Name: 
  m_EditorClassIdentifier: 
  Speed: 0
