<svg width="14" height="16" viewBox="0 0 14 16" xmlns="http://www.w3.org/2000/svg">
    <path d="M4.225.553A.999.999 0 0 1 5.119 0H8.88c.378 0 .725.214.894.553L10 1h3a1 1 0 1 1 0 2H1a1 1 0 0 1 0-2h3l.225-.447zM.972 4H13v10c0 1.103-.897 2-2 2H2.972c-1.077 0-2-.897-2-2V4zm2.5 2.5v7c0 .275.253.5.5.5.303 0 .5-.225.5-.5v-7c0-.275-.197-.5-.5-.5a.52.52 0 0 0-.5.5zm3 0v7c0 .275.253.5.5.5.303 0 .528-.225.528-.5v-7c0-.275-.225-.5-.528-.5a.52.52 0 0 0-.5.5zm3.028 0v7c0 .275.225.5.5.5s.5-.225.5-.5v-7c0-.275-.225-.5-.5-.5s-.5.225-.5.5z" fill="#FFF" fill-rule="nonzero"/>
</svg>
