{
  "hosting": {
    "predeploy": [
      "yarn lint",
      "yarn build:production"
    ],
    "public": "public",
    "ignore": [
      "firebase.json",
      "**/.*",
      "**/node_modules/**"
    ],
    "rewrites": [
      {
        "source": "**",
        "destination": "/index.html"
      }
    ]
  }
}
