[
  {
    "name": "Krimea",
    "link": "https://i.imgur.com/b1bggmS.png",
    "important": true,
    "canvas": 0,
    "startX": 5828,
    "startY": -9853
  },
  {
    "name": "NAVI",
    "link": "https://i.imgur.com/l8Xan5R.png",
    "important": false,
    "canvas": 0,
    "startX": 6400,
    "startY": -10000
  },
  {
    "name": "prapor_vmf",
    "link": "https://i.imgur.com/dqErGqG.png",
    "important": false,
    "canvas": 0,
    "startX": 6501,
    "startY": -11059
  }, 
  {
    "name": "! prapor_i_mista",
    "link": "https://i.imgur.com/Ys2HRVI.png",
    "important": false,
    "canvas": 0,
    "startX": 6486,
    "startY": -10610
  },
  {
    "name": "Old arts of Kuban",
    "link": "https://i.imgur.com/unfPZBX.png",
    "important": false,
    "canvas": 0,
    "startX": 6602,
    "startY": -9840
  },
  {
    "name": "Old arts of Kuban 2",
    "link": "https://i.imgur.com/b2GgQAc.png",
    "important": false,
    "canvas": 0,
    "startX": 6761,
    "startY": -9862
  },
  {
    "name": "Sagaidachnyi",
    "link": "https://i.imgur.com/dGaANqP.png",
    "important": false,
    "canvas": 0,
    "startX": 5507,
    "startY": -9651
  },
  {
    "name": "UNR Africa",
    "link": "https://i.imgur.com/zvxMSzx.png",
    "important": false,
    "canvas": 0,
    "startX": 7119,
    "startY": 1310
  },
  {
    "name": "UKR girl",
    "link": "https://i.imgur.com/cjyL6q8.png",
    "important": false,
    "canvas": 0,
    "startX":  5926,
    "startY": -11614
  },
  {
    "name": "Geogia",
    "link": "https://i.imgur.com/6iPhbSq.png",
    "important": false,
    "canvas": 0,
    "startX": 7407,
    "startY": -9075
  },
  {
    "name": "Ukrainian borders+",
    "link": "https://imgur.com/f0dgIza.png",
    "important": false,
    "canvas": 0,
    "startX": 4712,
    "startY": -10450
  },
  {
    "name": "PIKACHU",
    "link": "https://i.imgur.com/chMuIhc.png",
    "important": false,
    "canvas": 0,
    "startX": 6501,
    "startY": -10838
   },
   {
    "name": "ODESA",
    "link": "https://i.imgur.com/NYNb0ny.png",
    "important": false,
    "canvas": 0,
    "startX": 5389,
    "startY": -9976
  }
]